C++Builder6在安装Indy10的时候报错 [问题点数:20分,结帖人zjntche_cn]

Bbs1
本版专家分:87
结帖率 100%
Bbs11
本版专家分:248228
版主
Blank
优秀版主 2015年9月优秀大版主
2015年5月优秀大版主
2015年4月优秀版主
2014年11月论坛优秀版主
Blank
铜牌 2005年12月 总版技术专家分月排行榜第三
Blank
红花 2017年3月 C++ Builder大版内专家分月排行榜第一
2015年5月 C++ Builder大版内专家分月排行榜第一
2015年4月 C++ Builder大版内专家分月排行榜第一
2015年3月 C++ Builder大版内专家分月排行榜第一
2015年1月 C++ Builder大版内专家分月排行榜第一
2014年12月 C++ Builder大版内专家分月排行榜第一
2014年11月 C++ Builder大版内专家分月排行榜第一
2014年10月 C++ Builder大版内专家分月排行榜第一
2014年9月 C++ Builder大版内专家分月排行榜第一
2014年8月 C++ Builder大版内专家分月排行榜第一
2014年7月 C++ Builder大版内专家分月排行榜第一
2014年6月 C++ Builder大版内专家分月排行榜第一
2014年5月 C++ Builder大版内专家分月排行榜第一
2014年4月 C++ Builder大版内专家分月排行榜第一
2014年3月 C++ Builder大版内专家分月排行榜第一
2014年2月 C++ Builder大版内专家分月排行榜第一
2014年1月 C++ Builder大版内专家分月排行榜第一
2013年12月 C++ Builder大版内专家分月排行榜第一
2013年10月 C++ Builder大版内专家分月排行榜第一
2013年9月 C++ Builder大版内专家分月排行榜第一
2013年8月 C++ Builder大版内专家分月排行榜第一
2013年7月 C++ Builder大版内专家分月排行榜第一
2013年6月 C++ Builder大版内专家分月排行榜第一
2013年5月 C++ Builder大版内专家分月排行榜第一
2013年4月 C++ Builder大版内专家分月排行榜第一
2013年3月 C++ Builder大版内专家分月排行榜第一
2013年2月 C++ Builder大版内专家分月排行榜第一
2013年1月 C++ Builder大版内专家分月排行榜第一
2012年12月 C++ Builder大版内专家分月排行榜第一
2012年11月 C++ Builder大版内专家分月排行榜第一
2012年10月 C++ Builder大版内专家分月排行榜第一
2012年9月 C++ Builder大版内专家分月排行榜第一
2012年8月 C++ Builder大版内专家分月排行榜第一
2012年7月 C++ Builder大版内专家分月排行榜第一
2012年6月 C++ Builder大版内专家分月排行榜第一
2012年5月 C++ Builder大版内专家分月排行榜第一
2012年4月 C++ Builder大版内专家分月排行榜第一
2012年3月 C++ Builder大版内专家分月排行榜第一
2012年2月 C++ Builder大版内专家分月排行榜第一
2011年11月 C++ Builder大版内专家分月排行榜第一
2011年10月 C++ Builder大版内专家分月排行榜第一
2011年9月 C++ Builder大版内专家分月排行榜第一
2011年7月 C++ Builder大版内专家分月排行榜第一
2011年6月 C++ Builder大版内专家分月排行榜第一
2011年5月 C++ Builder大版内专家分月排行榜第一
2011年4月 C++ Builder大版内专家分月排行榜第一
2011年3月 C++ Builder大版内专家分月排行榜第一
2011年2月 C++ Builder大版内专家分月排行榜第一
2011年1月 C++ Builder大版内专家分月排行榜第一
2010年12月 C++ Builder大版内专家分月排行榜第一
2010年11月 C++ Builder大版内专家分月排行榜第一
2010年9月 C++ Builder大版内专家分月排行榜第一
2010年8月 C++ Builder大版内专家分月排行榜第一
2010年7月 C++ Builder大版内专家分月排行榜第一
2010年6月 C++ Builder大版内专家分月排行榜第一
2010年2月 C++ Builder大版内专家分月排行榜第一
2009年12月 C++ Builder大版内专家分月排行榜第一
2009年11月 C++ Builder大版内专家分月排行榜第一
2009年10月 C++ Builder大版内专家分月排行榜第一
2009年9月 C++ Builder大版内专家分月排行榜第一
2009年8月 C++ Builder大版内专家分月排行榜第一
2009年7月 C++ Builder大版内专家分月排行榜第一
2009年6月 C++ Builder大版内专家分月排行榜第一
2009年5月 C++ Builder大版内专家分月排行榜第一
2009年4月 C++ Builder大版内专家分月排行榜第一
2009年3月 C++ Builder大版内专家分月排行榜第一
2008年7月 C++ Builder大版内专家分月排行榜第一
2007年4月 C++ Builder大版内专家分月排行榜第一
2007年3月 C++ Builder大版内专家分月排行榜第一
2006年11月 C++ Builder大版内专家分月排行榜第一
2006年1月 C++ Builder大版内专家分月排行榜第一
2005年12月 C++ Builder大版内专家分月排行榜第一
2005年11月 C++ Builder大版内专家分月排行榜第一
2005年10月 C++ Builder大版内专家分月排行榜第一
2005年9月 C++ Builder大版内专家分月排行榜第一
2004年3月 C++ Builder大版内专家分月排行榜第一
2003年12月 C++ Builder大版内专家分月排行榜第一
2003年9月 C++ Builder大版内专家分月排行榜第一
Blank
黄花 2015年9月 C++ Builder大版内专家分月排行榜第二
2013年11月 C++ Builder大版内专家分月排行榜第二
2012年1月 C++ Builder大版内专家分月排行榜第二
2011年12月 C++ Builder大版内专家分月排行榜第二
2011年8月 C++ Builder大版内专家分月排行榜第二
2010年10月 C++ Builder大版内专家分月排行榜第二
2010年5月 C++ Builder大版内专家分月排行榜第二
2010年1月 C++ Builder大版内专家分月排行榜第二
2008年6月 C++ Builder大版内专家分月排行榜第二
2007年11月 C++ Builder大版内专家分月排行榜第二
2007年2月 C++ Builder大版内专家分月排行榜第二
2006年8月 C++ Builder大版内专家分月排行榜第二
2006年3月 C++ Builder大版内专家分月排行榜第二
2006年2月 C++ Builder大版内专家分月排行榜第二
2005年8月 C++ Builder大版内专家分月排行榜第二
Bbs1
本版专家分:87
Bbs1
本版专家分:87
pip安装时候报错
最近在看 python +robotframework 。作为完全不懂的我一脸懵逼 <em>安装</em>遇到各种问题  现在来说问题: 这个当时不知道是啥原因 。结果同事告知是开了 charles代理造成的。 关闭就好了。 然后就是上面的方法我不知道咋解决 就下载<em>安装</em> 结果 <em>安装</em>失败  图我没截到  不过大致包的是‘decorator’没有<em>安装</em>  (当然不是我自己看出来的 还是刚那位同事看出
AS安装模拟器的时候报错
Installation failed since the device possibly has stale dexed jars that don’t match the current version (dexopt error). In order to proceed, you have to uninstall the existing application.WARNING: Unin
安装opencv-python时候报错
Operation not permitted: ‘/var/folders执行:sudo pip install --user opencv-python
sqlserver安装时候报错
系统是xp 深度的那个ghost版本 sqlserver2005rn在硬件检查的<em>时候</em>只是iis那里警告而已rnsqlserver database services <em>安装</em>失败rnSQL server windows NT 遇到问题需要关闭
indy10安装出现问题
我的bcb版本是bcb6.0 build10.166 ,Winxp sp3 英文专业版rn我在CCrun上面下载了rnhttp://www.ccrun.com/view.asp?id=365rn我按照步骤操作完成了:rn在C++Builder6中的<em>安装</em>方法和步骤(2006.12.17 ccrun纠正版):rn0. 将Indy\Lib\Protocols\ZLib目录下的*.obj文件拷贝到Indy\Lib\Protocols目录中。rn1. 运行lib目录下的Fullc6.Indy10.bat(感谢大智的工作)rn2. 将Indy\lib\修正的.h文件\BCB6目录下的IdWinsock2.hpp复制到新生成的C6目录中,覆盖同名文件。rn3. 所有需要的.h/.obj/.lib/.bpl文件全部在C6目录下。打开C++Builder,ComponentInstall Packages找到 C6目录下的dclIndyCore60.bpl和dclIndyProtocols60.bpl,添加到组件列表中。rn4. 在C++Builder中设置一下路径:ProjectOptionsDirectories/ConditionalsInclude path和Library path中将C6的目录添加进来,这样就OK了。rn5. 建议将C6目录移至C++Builder的<em>安装</em>目录中,这样可以在工程选项的路径中使用较短的相对路径。rn==========================================rn我在窗体上增加一个控件IdSMTP控件,在编译之后出现下面问题,不知道如何解决?rn请高人帮助rnrn[C++ Error] IdStreamVCL.hpp(29): E2316 'TIdBytes' is not a member of 'Idglobal'rn[C++ Error] IdStreamVCL.hpp(29): E2293 ) expectedrn[C++ Error] IdStreamVCL.hpp(30): E2316 'TIdBytes' is not a member of 'Idglobal'rn[C++ Error] IdStreamVCL.hpp(30): E2293 ) expectedrn[C++ Error] IdExceptionCore.hpp(2404): E2316 'EIdSocketError' is not a member of 'Idstack'rn[C++ Error] IdExceptionCore.hpp(2404): E2303 Type name expectedrn[C++ Error] IdExceptionCore.hpp(2405): E2316 'EIdSocketError' is not a member of 'Idstack'rn[C++ Error] IdExceptionCore.hpp(2405): E2040 Declaration terminated incorrectlyrn[C++ Error] IdExceptionCore.hpp(2409): E2316 'EIdSocketError' is not a member of 'Idstack'rn[C++ Error] IdExceptionCore.hpp(2409): E2272 Identifier expectedrn[C++ Error] IdExceptionCore.hpp(2414): E2316 'EIdSocketError' is not a member of 'Idstack'rn[C++ Error] IdExceptionCore.hpp(2414): E2272 Identifier expectedrn[C++ Error] IdExceptionCore.hpp(2419): E2316 'EIdSocketError' is not a member of 'Idstack'rn[C++ Error] IdExceptionCore.hpp(2419): E2272 Identifier expectedrn[C++ Error] IdExceptionCore.hpp(2422): E2316 'EIdSocketError' is not a member of 'Idstack'rn[C++ Error] IdExceptionCore.hpp(2422): E2272 Identifier expectedrn[C++ Error] IdExceptionCore.hpp(2425): E2316 'EIdSocketError' is not a member of 'Idstack'rn[C++ Error] IdExceptionCore.hpp(2425): E2272 Identifier expectedrn[C++ Error] IdExceptionCore.hpp(2428): E2316 'EIdSocketError' is not a member of 'Idstack'rn[C++ Error] IdExceptionCore.hpp(2428): E2272 Identifier expectedrn[C++ Error] IdExceptionCore.hpp(2431): E2316 'EIdSocketError' is not a member of 'Idstack'rn[C++ Error] IdExceptionCore.hpp(2431): E2272 Identifier expectedrn[C++ Error] IdExceptionCore.hpp(2434): E2316 'EIdSocketError' is not a member of 'Idstack'rn[C++ Error] IdExceptionCore.hpp(2434): E2272 Identifier expectedrn[C++ Error] IdExceptionCore.hpp(2437): E2316 'EIdSocketError' is not a member of 'Idstack'rn[C++ Error] IdExceptionCore.hpp(2437): E2228 Too many error or warning messages
安装INDY10后
<em>安装</em>了INDY10后,发现在线程运行IDHTTP有的<em>时候</em>出现错误,错误描述在下面:rnprocedure TIdCustomHTTP.ConnectToHost(ARequest: TIdHTTPRequest; AResponse: TIdHTTPResponse);rnvarrn LLocalHTTP: TIdHTTPProtocol;rn LS : TIdStreamVCL;rnbeginrn ARequest.FUseProxy := SetHostAndPort;rnrn if ARequest.UseProxy = ctProxy thenrn beginrn ARequest.URL := FURI.URI;rn end;rnrn case ARequest.UseProxy ofrn ctNormal:rn if (ProtocolVersion = pv1_0) and (Length(ARequest.Connection) = 0) thenrn ARequest.Connection := 'keep-alive'; do not localizern ctSSL, ctSSLProxy: ARequest.Connection := '';rn ctProxy:rn if (ProtocolVersion = pv1_0) and (Length(ARequest.Connection) = 0) thenrn beginrn ARequest.ProxyConnection := 'keep-alive'; do not localizern end;rn end;rnrn if Assigned(FCompressor) thenrn beginrn if (IndyPos('deflate',Request.AcceptEncoding)=0) and do not localizern (IndyPos('gizp',Request.AcceptEncoding)=0) then do not localizern beginrn Request.AcceptEncoding := 'deflate, gzip, '; do not localizern end;rn end;rn if IndyPos('identity',Request.AcceptEncoding)=0 then do not localizern beginrn Request.AcceptEncoding := Request.AcceptEncoding + 'identity'; do not localizern end;rn if ARequest.UseProxy = ctSSLProxy then beginrn LLocalHTTP := TIdHTTPProtocol.Create(Self);rnrn with LLocalHTTP do beginrn Request.UserAgent := ARequest.UserAgent;rn Request.Host := ARequest.Host;rn Request.ContentLength := ARequest.ContentLength;rn Request.Pragma := 'no-cache'; do not localizern Request.URL := URL.Host + ':' + URL.Port;rn Request.Method := hmConnect;rn Request.ProxyConnection := 'keep-alive'; do not localizernrn Response.ContentStream := TMemoryStream.Create;rn tryrn tryrn repeatrn CheckAndConnect(Response);rn BuildAndSendRequest(nil);rnrn Response.ResponseText := IOHandler.ReadLn;rn if Length(Response.ResponseText) = 0 then beginrn // Support for HTTP responses without status line and headersrn Response.ResponseText := 'HTTP/1.0 200 OK'; do not localizern Response.Connection := 'close'; do not localizern endrn else beginrn RetrieveHeaders(MaxHeaderLines);rn ProcessCookies(LLocalHTTP.Request, LLocalHTTP.Response);rn end;rnrn if Response.ResponseCode = 200 thenrn beginrn // Connection establishedrn (IOHandler as TIdSSLIOHandlerSocketBase).PassThrough := false;rn Break;rn end else beginrn ProcessResponse([]);rn end;rn until False;rn exceptrn raise;rn // TODO: Add property that will contain the error messages.rn end;rn finallyrn LLocalHTTP.Response.ContentStream.Free;rn FreeAndNil(LLocalHTTP);rn end;rn end;rn end else beginrn CheckAndConnect(AResponse);rn end;rnrn FHTTPProto.BuildAndSendRequest(URL);rnrn if (ARequest.Method in [hmPost, hmPut]) then//错误在这一句,过不去了,一直提示非法操作rn beginrn LS := TIdStreamVCL.Create(ARequest.Source);rn tryrn IOHandler.Write(LS, 0, false);rn finallyrn FreeAndNil(LS);rn end;rn end;rnend;rnrn这个是什么问题?????
lazarus indy10 linux 安装
请问各位,我在linux下<em>安装</em>了lazarus,现在想<em>安装</em><em>indy10</em>插件,可是<em>安装</em>过程中,出现错误,错误时:rncan't find unit qt4 used by OSPrinters,请问有人遇到过同样的错误码?怎么解决的?
求助c++ builder6安装序列号~!
我下了一个c++ <em>builder6</em> 但没有序列号,郁闷。。。。。。rn谁有送我一个~!
求C++ Builder6安装序列号
。。。
安装apache 时候报错 ssl_engine_pphrase.c
请教 <em>安装</em>apache <em>时候</em><em>报错</em>rnssl_engine_pphrase.c: In function 'ssl_pphrase_Handle_CB':rnssl_engine_pphrase.c:684: error: 'PEM_F_DEF_CALLBACK' undeclared (first use in this function)rnssl_engine_pphrase.c:684: error: (Each undeclared identifier is reported only oncernssl_engine_pphrase.c:684: error: for each function it appears in.)rnmake[3]: *** [ssl_engine_pphrase.lo] Error 1rnrn我执行的命令如下 ./configure --prefix=/slview/apache \rn --enable-rule=SHARED_CORE \rn --enable-rule=SHARED_CHAIN \rn --enable-module=so \rn --enable-module=most \rn --enable-ssl \rn --enable-shared=maxrnrnmake & make installrnrnhttpd 版本httpd-2.0.53 openssl 版本0.9.8ernrn有人了解什么地方出问题了嘛?
安装mysql-connector-python-rf时候报错的解决方法
在用pip install mysql-connector-python-rf&amp;gt;=1.2.2时会出现<em>安装</em>错误,可能是因为版本和系统不匹配,可以多试几个版本 这里我用2.0.4,就可以,但是其他的版本都是error  ...
centos 安装 wine时候 报错
[root@localhost wine-1.3.11]# ./configure checking build system type... i686-pc-linux-gnu checking host system type... i686-pc-linux-gnu checking whether make sets $(MAKE)... yes checking for gc...
安装安卓的插件的时候报错
An error has occurred. See error log for more details.rnjava.lang.NullPointerExceptionrnrnrnrnrnjava.lang.NullPointerExceptionrnat com.genuitec.pulse2.common.ui.ImageServices.createScaled(Unknown Source)rnat com.genuitec.pulse.client.common.collab.ui.tab.software.NormalBrowseSelectionSectionPart.refresh(Unknown Source)rnat com.genuitec.pulse.client.contrib.ui.blueprint.BlueprintAwareSectionPart.refresh(Unknown Source)rnat com.genuitec.pulse.client.common.collab.ui.tab.software.SoftwareTabFormPart.selectionChanged(Unknown Source)rnat com.genuitec.pulse.client.contrib.ui.provisional.tablesection.TitledViewersScrolledComposite.fireSelectionChanged(Unknown Source)rnat com.genuitec.pulse.client.contrib.ui.provisional.tablesection.TitledViewersScrolledComposite.handleSelectionChanged(Unknown Source)rnat com.genuitec.pulse.client.contrib.ui.provisional.tablesection.TitledViewersScrolledComposite$1.selectionChanged(Unknown Source)rnat org.eclipse.jface.viewers.Viewer$2.run(Viewer.java:162)rnat org.eclipse.core.runtime.SafeRunner.run(SafeRunner.java:42)rnat org.eclipse.core.runtime.Platform.run(Platform.java:888)rnat org.eclipse.ui.internal.JFaceUtil$1.run(JFaceUtil.java:48)rnat org.eclipse.jface.util.SafeRunnable.run(SafeRunnable.java:175)rnat org.eclipse.jface.viewers.Viewer.fireSelectionChanged(Viewer.java:160)rnat org.eclipse.jface.viewers.StructuredViewer.updateSelection(StructuredViewer.java:2132)rnat org.eclipse.jface.viewers.StructuredViewer.handleSelect(StructuredViewer.java:1160)rnat org.eclipse.jface.viewers.StructuredViewer$4.widgetSelected(StructuredViewer.java:1190)rnat org.eclipse.jface.util.OpenStrategy.fireSelectionEvent(OpenStrategy.java:228)rnat org.eclipse.jface.util.OpenStrategy.access$4(OpenStrategy.java:222)rnat org.eclipse.jface.util.OpenStrategy$1.handleEvent(OpenStrategy.java:389)rnat org.eclipse.swt.widgets.EventTable.sendEvent(EventTable.java:84)rnat org.eclipse.swt.widgets.Widget.sendEvent(Widget.java:1003)rnat org.eclipse.swt.widgets.Display.runDeferredEvents(Display.java:3910)rnat org.eclipse.swt.widgets.Display.readAndDispatch(Display.java:3503)rnat org.eclipse.ui.internal.Workbench.runEventLoop(Workbench.java:2405)rnat org.eclipse.ui.internal.Workbench.runUI(Workbench.java:2369)rnat org.eclipse.ui.internal.Workbench.access$4(Workbench.java:2221)rnat org.eclipse.ui.internal.Workbench$5.run(Workbench.java:500)rnat org.eclipse.core.databinding.observable.Realm.runWithDefault(Realm.java:332)rnat org.eclipse.ui.internal.Workbench.createAndRunWorkbench(Workbench.java:493)rnat org.eclipse.ui.PlatformUI.createAndRunWorkbench(PlatformUI.java:149)rnat org.eclipse.ui.internal.ide.application.IDEApplication.start(IDEApplication.java:113)rnat org.eclipse.equinox.internal.app.EclipseAppHandle.run(EclipseAppHandle.java:194)rnat org.eclipse.core.runtime.internal.adaptor.EclipseAppLauncher.runApplication(EclipseAppLauncher.java:110)rnat org.eclipse.core.runtime.internal.adaptor.EclipseAppLauncher.start(EclipseAppLauncher.java:79)rnat org.eclipse.core.runtime.adaptor.EclipseStarter.run(EclipseStarter.java:368)rnat org.eclipse.core.runtime.adaptor.EclipseStarter.run(EclipseStarter.java:179)rnat sun.reflect.NativeMethodAccessorImpl.invoke0(Native Method)rnat sun.reflect.NativeMethodAccessorImpl.invoke(NativeMethodAccessorImpl.java:39)rnat sun.reflect.DelegatingMethodAccessorImpl.invoke(DelegatingMethodAccessorImpl.java:25)rnat java.lang.reflect.Method.invoke(Method.java:597)rnat org.eclipse.equinox.launcher.Main.invokeFramework(Main.java:559)rnat org.eclipse.equinox.launcher.Main.basicRun(Main.java:514)rnat org.eclipse.equinox.launcher.Main.run(Main.java:1311)rn
【求助】安装jre7的时候报错
<em>安装</em>jre7的<em>时候</em><em>报错</em>,求解决rn[root@RPG15_Publish ~]# rpm -ivh jre-7u9-linux-x64.rpmrnPreparing... ########################################### [100%]rn 1:jre ########################################### [100%]rnUnpacking JAR files...rn rt.jar...rnError: Could not open input file: /usr/java/jre1.7.0_09/lib/rt.packrn jsse.jar...rnError: Could not open input file: /usr/java/jre1.7.0_09/lib/jsse.packrn charsets.jar...rnError: Could not open input file: /usr/java/jre1.7.0_09/lib/charsets.packrn localedata.jar...rnError: Could not open input file: /usr/java/jre1.7.0_09/lib/ext/localedata.packrnrn系统版本Linux version 2.6.18-194.el5
安装freetype2 ./configure时候报错
<em>安装</em>freetype2<em>时候</em>./configure出现下面错误提示,网上没找到好的解决方法,求高手帮忙rnrnGNU make (>= 3.80) or makepp (>= 1.19) is required to build FreeType2.rnPlease tryrn MAKE= ./configurernor rn MAKE="makepp --norc-substitution" ./configure
nodejs安装时候报错2603
<em>安装</em>nodejs的<em>时候</em><em>报错</em>,<em>报错</em>码为2603,那么产生这个原因是什么呢? 没有获取管理员权限!! 所以,其实只要获取到管理员权限,再去<em>安装</em>就行了。 1、先在你的电脑里找到cmd应用程序,然后右键点击,选择以管理员身份运行 2、切换到你的nodejs的目录 3、输入命令:msiexec /package node-v-xx-xx.msi(这里
安装nagios插件的时候报错
相关的nagios支持已经<em>安装</em>:rnhttpd-2.2.0-5.1.2rngcc-4.1.0-3rngcc-4.1.1-51.fc5rnglibc-2.4-4rnglibc-2.4-11rnglibc-common-2.4-4rnglibc-common-2.4-11rngd-2.0.33-6.2rngd-devel-2.0.33-6.2rngd-devel-2.0.33-8.fc5rnrnrnrnrn[size=24px]rn<em>安装</em>插件时的错误如下:[/size]rnrnmake all-recursivernmake[1]: Entering directory `/home/cuiyan/nagios/nagios-plugins-1.4.14'rnMaking all in glrnmake[2]: Entering directory `/home/cuiyan/nagios/nagios-plugins-1.4.14/gl'rnrm -f configmake.h-trn echo '/* DO NOT EDIT! GENERATED AUTOMATICALLY! */'; \rn echo '#define PREFIX "/usr/local/nagios"'; \rn echo '#define EXEC_PREFIX "/usr/local/nagios"'; \rn echo '#define BINDIR "/usr/local/nagios/bin"'; \rn echo '#define SBINDIR "/usr/local/nagios/sbin"'; \rn echo '#define LIBEXECDIR "/usr/local/nagios/libexec"'; \rn echo '#define DATAROOTDIR "/usr/local/nagios/share"'; \rn echo '#define DATADIR "/usr/local/nagios/share"'; \rn echo '#define SYSCONFDIR "/usr/local/nagios/etc"'; \rn echo '#define SHAREDSTATEDIR "/usr/local/nagios/com"'; \rn echo '#define LOCALSTATEDIR "/usr/local/nagios/var"'; \rn echo '#define INCLUDEDIR "/usr/local/nagios/include"'; \rn echo '#define OLDINCLUDEDIR "/usr/include"'; \rn echo '#define DOCDIR "/usr/local/nagios/share/doc/nagios-plugins"'; \rn echo '#define INFODIR "/usr/local/nagios/share/info"'; \rn echo '#define HTMLDIR "/usr/local/nagios/share/doc/nagios-plugins"'; \rn echo '#define DVIDIR "/usr/local/nagios/share/doc/nagios-plugins"'; \rn echo '#define PDFDIR "/usr/local/nagios/share/doc/nagios-plugins"'; \rn echo '#define PSDIR "/usr/local/nagios/share/doc/nagios-plugins"'; \rn echo '#define LIBDIR "/usr/local/nagios/lib"'; \rn echo '#define LISPDIR ""'; \rn echo '#define LOCALEDIR "/usr/local/nagios/share/locale"'; \rn echo '#define MANDIR "/usr/local/nagios/share/man"'; \rn echo '#define MANEXT ""'; \rn echo '#define PKGDATADIR "/usr/local/nagios/share/nagios-plugins"'; \rn echo '#define PKGINCLUDEDIR "/usr/local/nagios/include/nagios-plugins"'; \rn echo '#define PKGLIBDIR "/usr/local/nagios/lib/nagios-plugins"'; \rn echo '#define PKGLIBEXECDIR ""'; \rn | sed '/""/d' > configmake.h-trnif test -f configmake.h && cmp configmake.h-t configmake.h > /dev/null; then \rn rm -f configmake.h-t; \rnelse \rn rm -f configmake.h; mv configmake.h-t configmake.h; \rnfirnmake all-recursivernmake[3]: Entering directory `/home/cuiyan/nagios/nagios-plugins-1.4.14/gl'rnmake[4]: Entering directory `/home/cuiyan/nagios/nagios-plugins-1.4.14/gl'rnrm -f configmake.h-trn echo '/* DO NOT EDIT! GENERATED AUTOMATICALLY! */'; \rn echo '#define PREFIX "/usr/local/nagios"'; \rn echo '#define EXEC_PREFIX "/usr/local/nagios"'; \rn echo '#define BINDIR "/usr/local/nagios/bin"'; \rn echo '#define SBINDIR "/usr/local/nagios/sbin"'; \rn echo '#define LIBEXECDIR "/usr/local/nagios/libexec"'; \rn echo '#define DATAROOTDIR "/usr/local/nagios/share"'; \rn echo '#define DATADIR "/usr/local/nagios/share"'; \rn echo '#define SYSCONFDIR "/usr/local/nagios/etc"'; \rn echo '#define SHAREDSTATEDIR "/usr/local/nagios/com"'; \rn echo '#define LOCALSTATEDIR "/usr/local/nagios/var"'; \rn echo '#define INCLUDEDIR "/usr/local/nagios/include"'; \rn echo '#define OLDINCLUDEDIR "/usr/include"'; \rn echo '#define DOCDIR "/usr/local/nagios/share/doc/nagios-plugins"'; \rn echo '#define INFODIR "/usr/local/nagios/share/info"'; \rn echo '#define HTMLDIR "/usr/local/nagios/share/doc/nagios-plugins"'; \rn echo '#define DVIDIR "/usr/local/nagios/share/doc/nagios-plugins"'; \rn echo '#define PDFDIR "/usr/local/nagios/share/doc/nagios-plugins"'; \rn echo '#define PSDIR "/usr/local/nagios/share/doc/nagios-plugins"'; \rn echo '#define LIBDIR "/usr/local/nagios/lib"'; \rn echo '#define LISPDIR ""'; \rn echo '#define LOCALEDIR "/usr/local/nagios/share/locale"'; \rn echo '#define MANDIR "/usr/local/nagios/share/man"'; \rn echo '#define MANEXT ""'; \rn echo '#define PKGDATADIR "/usr/local/nagios/share/nagios-plugins"'; \rn echo '#define PKGINCLUDEDIR "/usr/local/nagios/include/nagios-plugins"'; \rn echo '#define PKGLIBDIR "/usr/local/nagios/lib/nagios-plugins"'; \rn echo '#define PKGLIBEXECDIR ""'; \rn | sed '/""/d' > configmake.h-trnif test -f configmake.h && cmp configmake.h-t configmake.h > /dev/null; then \rn rm -f configmake.h-t; \rnelse \rn rm -f configmake.h; mv configmake.h-t configmake.h; \rnfirnmake[4]: Leaving directory `/home/cuiyan/nagios/nagios-plugins-1.4.14/gl'rnmake[3]: Leaving directory `/home/cuiyan/nagios/nagios-plugins-1.4.14/gl'rnmake[2]: Leaving directory `/home/cuiyan/nagios/nagios-plugins-1.4.14/gl'rnMaking all in taprnmake[2]: Entering directory `/home/cuiyan/nagios/nagios-plugins-1.4.14/tap'rnmake[2]: Nothing to be done for `all'.rnmake[2]: Leaving directory `/home/cuiyan/nagios/nagios-plugins-1.4.14/tap'rnMaking all in librnmake[2]: Entering directory `/home/cuiyan/nagios/nagios-plugins-1.4.14/lib'rnMaking all in .rnmake[3]: Entering directory `/home/cuiyan/nagios/nagios-plugins-1.4.14/lib'rnmake[3]: Nothing to be done for `all-am'.rnmake[3]: Leaving directory `/home/cuiyan/nagios/nagios-plugins-1.4.14/lib'rnMaking all in testsrnmake[3]: Entering directory `/home/cuiyan/nagios/nagios-plugins-1.4.14/lib/tests'rnmake[3]: Nothing to be done for `all'.rnmake[3]: Leaving directory `/home/cuiyan/nagios/nagios-plugins-1.4.14/lib/tests'rnmake[2]: Leaving directory `/home/cuiyan/nagios/nagios-plugins-1.4.14/lib'rnMaking all in pluginsrnmake[2]: Entering directory `/home/cuiyan/nagios/nagios-plugins-1.4.14/plugins'rn/bin/sh ../libtool --tag=CC --mode=link gcc -DNP_VERSION='"1.4.14"' -g -O2 -L. -o check_ldap check_ldap.o netutils.o utils.o ../lib/libnagiosplug.a ../gl/libgnu.a -lnsl -lresolv -lldap -llber -lpthread -ldl rngcc -DNP_VERSION=\"1.4.14\" -g -O2 -o check_ldap check_ldap.o netutils.o utils.o -L/home/cuiyan/nagios/nagios-plugins-1.4.14/plugins ../lib/libnagiosplug.a ../gl/libgnu.a -lnsl -lresolv -lldap -llber -lpthread -ldlrnrn
bcb2006中安装indy10的问题
从indy的开源网站上下载了<em>indy10</em>源码,按照网上的说明双击打开“Fullc6.bat”文件,结果显示“compiler not installed! Error!”,而我的机器上已经<em>安装</em>了bcb2006,为什么出现这个错误呢?是不是我操作有错误?
安装Indy10后出现的问题
我<em>安装</em>Indy10后,在程序中放上个IdHTTP组件.rn调用了IdHTTP的Get方法.也是该控件唯一的一句代码.rn我在设置断点后一步步执行,当执行到这个方法时,rn编辑器转到了IdHTTP.pas里了,而不是在我所写程的下一步,rn请问怎样设置能让编辑器不进入该PAS文件里呢?直接到我所写程的下一步!rn谢谢!!
Indy10 ACTIVE 时报错,怎么解决?
''idftpsrvr_1 Scheduler'' is not a valid component namern不管改什么名字,它都会在名字后加一个 Scheduler再报出来!~
Indy10的TIdHttp上传报错,希望各位朋友帮帮忙
弹出的错误信息: Socket Error # 10053 Software caused connection abort.rnrn有些客户会报这种错误,如果文件比较大时基本会报!rnrn请问各位朋友这个是什么原因导致的?有什么更好的方法rnrn防火墙问题的错误信息是端口连接不上;因此这个跟防火墙无关rnrnrnFNetHttp :TIdHttp; Indy10版本;rn未设置其它参数属性,都采用默认值;rnrn[code=Delphi(Pascal)]rn FNetHttp := TIdHttp.create;(类的私有变量)rnrn //上传进度显示rn ...使用后释放地址rnrn Stream := TIdMultiPartFormDataStream.Create;rn tryrnrn //Txt的字符串信息 rn Stream.AddFile('UPLoadPara', FileName, 'multipart/form-data'); rnrn //Access数据库(已被压缩为zip),大小不限,有些会超过50Mrn Stream.AddFile('UPLoadFile', FileName, 'multipart/form-data'); rn rn tryrn FNetHttp.Request.ContentType := Stream.RequestContentType; rn FNetHttp.Post('网址', Stream);rn Except on e:Exception dorn Showmessage(e.Message)rn end;rn finallyrn FreeAndNil(Stream)rn end;rn[/code]
c++ Builder6
Borland公司还会继续开发c++ <em>builder6</em>以后的更高的版本吗?有谁知道吗?它会淘汰吗?rn
如何正确安装borland c++ builder6。0
我在下载了borland c++ builder后,先解压缩,是ISO文件。确实是两张盘。分别是disk.iso和DISK.ISO.再<em>安装</em>了一个DAEMON Tools,光驱虚拟软件。开始<em>安装</em>后,先用Daemon打开那个disk1.iso文件.出来六个选项(分别是c++ builer6……installshield expriss custom edition for c++)。我选取了第一项c++ builer6,提示注册,我输入了正确的注册码,注册完后<em>安装</em>,当中间要换第二张盘时,我先用daemon换第二张盘,再点击确定。可以说一切顺利。虽然在控制面板——》添加/删除程序里出现了borland c++ <em>builder6</em>这个东东,但是却没有自动在桌面上出现BCB6的东东。我想我可能在什么地方搞错了,于是想使用控制面板——》添加/删除程序来删除BCB6来重新<em>安装</em>一次,但是却删除不了。请问:我是不是<em>安装</em>出错?还是万事俱备,只欠东风(缺了一个步骤)?再次请求网友指点
c++ builder6 安装ccrun.com三方组件问题!!!
我从妖哥的网站下载了两个插件,FlashEngine和ThemeEngine。均不知如何正常<em>安装</em>。rnrn两个组件的情况都一样,<em>安装</em>后packages文件中有fe_cb6.bpk、fe_cb6.cpp、fe_cb6.res,但是我通过“组件-<em>安装</em>包-添加-fe_cb6.bpk”时却显示无效的<em>安装</em>包,需要.bpl文件。rnrn请各位高手为小弟指明方向,不甚感激!
AIX安装ssl,ssh的时候报错
[img=https://img-bbs.csdn.net/upload/201310/29/1383010882_785724.png][/img][img=https://img-bbs.csdn.net/upload/201310/29/1383010973_247358.png][/img]rnrn我是用 smit <em>安装</em>的rn求助于各位高手
安装11.2.0.1的时候执行root.sh报错
<em>安装</em>11.2.0.1的<em>时候</em><em>报错</em>: [root@rac1 ~]# /u01/app/11.2.0/grid/root.sh Running Oracle 11g root.sh script... The following environment variables are set as: ORACLE_OWNER= grid ORACLE_HOME= /u01/app/11.
python3.6安装OpenCV 使用时候报错
[img=https://img-bbs.csdn.net/upload/201707/13/1499881103_515110.png][/img]rn如上图所示,我直接import cv2,后面都无法调出cv2中的成员rn然而在命令行中测试import cv2却并不会<em>报错</em>rn[img=https://img-bbs.csdn.net/upload/201707/13/1499881205_432109.png][/img]rn我python装的是3.6rn[img=https://img-bbs.csdn.net/upload/201707/13/1499881268_100054.png][/img]rn在site-packages里面也有对应的cv2.pydrn[img=https://img-bbs.csdn.net/upload/201707/13/1499881375_487058.png][/img]rn而且有趣的是,同样的代码我写在命令行里就不会<em>报错</em>rn[img=https://img-bbs.csdn.net/upload/201707/13/1499881497_778678.png][/img]rn不知道有没有谁遇到过相同的问题?怎么解决的啊?
redhat下安装Qt-online的时候报错 找不到libX11-xcb.so.1
<em>安装</em>qt-online 直接一下错误。rn./qt-unified-linux-x86-2.0.4-online.run: error while loading shared libraries: libX11-xcb.so.1: cannot open shared object file: No such file or directoryrnrn在64位系统和32位系统下都报这个错。<em>安装</em>的是32位程序。如何解决,网上也没找到相应的解决方案。以前装过Ubuntu好像也没碰到过这种问题。
重复安装GI的时候报错INS-32025
[INS-32025] The chosen installation conflicts with software already installed in the given Oracle home. 解决: cd /u01/app/oraInventory/ContentsXML rm inventory.xml 重新<em>安装</em>,搞定!
安装VS2008时候报错 “SQL发行”错误
在Win7系统下,由于原先<em>安装</em>的VS2008评估过期了,重新升级<em>安装</em>出现了<em>报错</em>,“SQL发行”<em>安装</em>失败,不知是何原因,请求哪位大虾解答下,非常感谢~
安装android SDK的时候提示报错
你好rnrn当我点击SDK Manager.exe <em>安装</em>android SDK的<em>时候</em>进程中提示如下<em>报错</em>rnFetching https://dl-ssl.google.com/android/repository/addons_list-2.xmlrnFetched Add-ons List successfullyrnFetching URL: https://dl-ssl.google.com/android/repository/repository-8.xmlrnDone loading packages.rnFetching https://dl-ssl.google.com/android/repository/addons_list-2.xmlrn[color=#FF0000]Failed to fetch URL https://dl-ssl.google.com/android/repository/addons_list-2.xml, reason: Connection to https://dl-ssl.google.com refused[/color]rnFetched Add-ons List successfullyrnFetching URL: https://dl-ssl.google.com/android/repository/repository-8.xmlrn[color=#FF0000]Failed to fetch URL https://dl-ssl.google.com/android/repository/repository-8.xml, reason: HttpHostConnect Connection to https://dl-ssl.google.com refused[/color]rnDone loading packages.
Indy10帮助文档
Indy10帮助文档,英文版
indy10 最新
<em>indy10</em> 最新 full source
indy10 安装方法
<em>indy10</em><em>安装</em>方法,源代码可以到ccrun下载
Indy10 demo
官方的例子,有需要的朋友可以下载来参考一下
安装Go语言,测试时候报错
声明,linux环境是centos7.4,需要<em>安装</em>的是1.10.3版本的go 1:需要先<em>安装</em>1.4版本的go语言 git clone https://github.com/golang/go.git cd go git branch git checkout realease-branch.go1.4 git branch cd src/ ./all.bash Build ...
npm安装工具时候报错code EINTEGRITY
npm<em>安装</em>cnpm<em>时候</em><em>报错</em>code EINTEGRITY 错误展示 PS C:\Users\by\Desktop\element_ui_demo&amp;gt; npm install --global cnpm npm ERR! code EINTEGRITY npm ERR! sha512-DowXzQwtSWDtbAjuWecuEiismR0VdNEYaL3VxNTYTdW6AGkYx...
linux安装mysql时候报错解决方案
<em>安装</em>教程:https://www.jianshu.com/p/d49bd39e23a3 1、执行命令:mv /etc/yum.repos.d/CentOS-Base.repo /etc/yum.repos.d/CentOS-Base.repo.backu <em>报错</em>:mv: cannot stat ‘/etc/yum.repos.d/CentOS-Base.repo’: No such...
安装的.net,建立工程的时候报错
The Web server reported the following error when attempting to create or open the Web project located at the following URL rn"http://localhost/WebApplication1," rn"HTTP/1.1 403Access Forbidden."rn错误如上!刚<em>安装</em>的.net,建立工程的<em>时候</em>就会报上述错误!rn请大家帮帮忙!
Vue 安装依赖的时候扩展符报错
扩展符<em>报错</em>,第一反应是babel没有配置好。可是所有的<em>安装</em>依赖都是在package.json文件里,都是直接复制过来的(一台电脑转移文件到另外一台电脑),按理说不会有错。 于是网上找了一下,发现很多人都说是.labelrc文件的问题。 顿时想起,在编辑器里除了.labelrc还有其他几个文件,因为电脑上没有设置隐藏文件可见,所以在项目的文件夹里就看不到,从而直接把文件夹里的东西复制到另外一个地方的...
netbeans安装快速调试时候报错
错误如下:rnTemporarily enhancing PATH to include DevKit...rnBuilding native extensions. This could take a while...rnERROR: Error installing ruby-debug-ide:rn ERROR: Failed to build gem native extension.rnrne:/Ruby/bin/ruby.exe mkrf_conf.rbrnrnrnGem files will remain installed in e:/Ruby/lib/ruby/gems/1.8/gems/ruby-debug-ide-0.4.9 for inspection.rnResults logged to e:/Ruby/lib/ruby/gems/1.8/gems/ruby-debug-ide-0.4.9/ext/gem_make.outrnrn我电脑装了2个版本的 ruby 1.8.6 和 1.9.2 rn1.9.2的 <em>安装</em>成功了但是启动不了 1.8.6 一在线<em>安装</em>就报这个错 是为什么?
fedora10安装, 分区的时候报错
挂载分区/。我的分配<em>安装</em>的大小25G。为什么还说:没有足够的空间去创建分区/.rnrn错误如下:rncould not allocate requested partitions:rnPartitioning failed: Could not allocaternpartitions as primary partitions.rnNot enough space left to create partition for /.rn
Eclipse3.2安装EclipseMe时候报错?求助!!!!!!
新安的eclipse<em>安装</em>Eclipse之后,<em>安装</em>WTK手机模拟器<em>报错</em>,查找错误日志,有以下几个错误:rnjava.lang.NoSuchMethodError: java.lang.Integer.valueOf(I)Ljava/lang/Integer;rnrnrnjava.lang.NoSuchMethodError: java.lang.Integer.valueOf(I)Ljava/lang/Integer;rn at eclipseme.core.internal.persistence.XMLPersistenceProvider.storePersistable(XMLPersistenceProvider.java:258)rn at eclipseme.core.model.device.DeviceRegistry.storeUsing(DeviceRegistry.java:342)rn at eclipseme.core.model.device.DeviceRegistry.store(DeviceRegistry.java:325)rn at eclipseme.ui.internal.preferences.DeviceManagementPreferencePage.performOk(DeviceManagementPreferencePage.java:198)rn at org.eclipse.jface.preference.PreferenceDialog$11.run(PreferenceDialog.java:889)rn at org.eclipse.core.runtime.SafeRunner.run(SafeRunner.java:37)rn at org.eclipse.core.runtime.Platform.run(Platform.java:843)rn at org.eclipse.ui.internal.JFaceUtil$1.run(JFaceUtil.java:44)rn at org.eclipse.jface.util.SafeRunnable.run(SafeRunnable.java:149)rn at org.eclipse.jface.preference.PreferenceDialog.okPressed(PreferenceDialog.java:869)rn at org.eclipse.ui.internal.dialogs.FilteredPreferenceDialog.okPressed(FilteredPreferenceDialog.java:376)rn at org.eclipse.ui.internal.dialogs.WorkbenchPreferenceDialog.okPressed(WorkbenchPreferenceDialog.java:164)rn at org.eclipse.jface.preference.PreferenceDialog.buttonPressed(PreferenceDialog.java:230)rn at org.eclipse.jface.dialogs.Dialog$3.widgetSelected(Dialog.java:660)rn at org.eclipse.swt.widgets.TypedListener.handleEvent(TypedListener.java:90)rn at org.eclipse.swt.widgets.EventTable.sendEvent(EventTable.java:66)rn at org.eclipse.swt.widgets.Widget.sendEvent(Widget.java:928)rn at org.eclipse.swt.widgets.Display.runDeferredEvents(Display.java:3348)rn at org.eclipse.swt.widgets.Display.readAndDispatch(Display.java:2968)rn at org.eclipse.jface.window.Window.runEventLoop(Window.java:820)rn at org.eclipse.jface.window.Window.open(Window.java:796)rn at org.eclipse.ui.internal.OpenPreferencesAction.run(OpenPreferencesAction.java:65)rn at org.eclipse.jface.action.Action.runWithEvent(Action.java:499)rn at org.eclipse.jface.action.ActionContributionItem.handleWidgetSelection(ActionContributionItem.java:539)rn at org.eclipse.jface.action.ActionContributionItem.access$2(ActionContributionItem.java:488)rn at org.eclipse.jface.action.ActionContributionItem$5.handleEvent(ActionContributionItem.java:400)rn at org.eclipse.swt.widgets.EventTable.sendEvent(EventTable.java:66)rn at org.eclipse.swt.widgets.Widget.sendEvent(Widget.java:928)rn at org.eclipse.swt.widgets.Display.runDeferredEvents(Display.java:3348)rn at org.eclipse.swt.widgets.Display.readAndDispatch(Display.java:2968)rn at org.eclipse.ui.internal.Workbench.runEventLoop(Workbench.java:1930)rn at org.eclipse.ui.internal.Workbench.runUI(Workbench.java:1894)rn at org.eclipse.ui.internal.Workbench.createAndRunWorkbench(Workbench.java:422)rn at org.eclipse.ui.PlatformUI.createAndRunWorkbench(PlatformUI.java:149)rn at org.eclipse.ui.internal.ide.IDEApplication.run(IDEApplication.java:95)rn at org.eclipse.core.internal.runtime.PlatformActivator$1.run(PlatformActivator.java:78)rn at org.eclipse.core.runtime.internal.adaptor.EclipseAppLauncher.runApplication(EclipseAppLauncher.java:92)rn at org.eclipse.core.runtime.internal.adaptor.EclipseAppLauncher.start(EclipseAppLauncher.java:68)rn at org.eclipse.core.runtime.adaptor.EclipseStarter.run(EclipseStarter.java:400)rn at org.eclipse.core.runtime.adaptor.EclipseStarter.run(EclipseStarter.java:177)rn at sun.reflect.NativeMethodAccessorImpl.invoke0(Native Method)rn at sun.reflect.NativeMethodAccessorImpl.invoke(Unknown Source)rn at sun.reflect.DelegatingMethodAccessorImpl.invoke(Unknown Source)rn at java.lang.reflect.Method.invoke(Unknown Source)rn at org.eclipse.core.launcher.Main.invokeFramework(Main.java:336)rn at org.eclipse.core.launcher.Main.basicRun(Main.java:280)rn at org.eclipse.core.launcher.Main.run(Main.java:977)rn at org.eclipse.core.launcher.Main.main(Main.java:952)rnrnrnrnrnrnrn救命啊!!!!!!!!!!!!!!!!!!!!!!!!!!!!!!!!!!!!!!!rn
windows7在安装vc14的时候报错(0x80240017)
centos6 安装oracle10g 登录时候报错
[oracle@tt ~]$ sqlplus /nologrnrnSQL*Plus: Release 10.2.0.1.0 - Production on ▒▒▒▒▒▒ 11▒▒ 30 16:30:38 2011rnrnCopyright (c) 1982, 2005, Oracle. All rights reserved.rnrnSQL> connect sys/change_on_install as sysdbarnConnected to an idle instance.rnSQL>rn麻烦看看 rn还有 oracle登录乱码 rnrn[oracle@tt ~]$ cd /home/oracle/rn[oracle@tt ~]$ lsrnoraInventory ?????? ????????? ?????? ?????? ?????? ?????? ?????? ??????rn
请问在ubuntu16安装oracle12C的时候一直报错
因为依赖包没有<em>安装</em>完全,可是<em>安装</em>程序一直跳过先决条件检查,我也不知道到底缺了什么,请问怎么解决啊?
c builder6 cpu调度和可变分区调度算法模拟
是基于简单多线程的 四个调度算法可即时转换 可即时添加进程,内存实现动态分配和回收 程序写的不是很精练
Indy10 开发版
indy 10 最新开发版 有没有用自己来选择
indy10 demo
<em>indy10</em>的例子程序,方便从实际程序中了解vcl的使用方式。
indy10 for delphi7
<em>indy10</em> delphi7版本。 <em>安装</em>的<em>时候</em>把d7自带的*indy*.bpl都删除了。
Indy10组件
c++builder 4 ~ 6 、2006 ~ 2010 、 XE ~ XE8 可用 c++ builder 6 <em>安装</em>方法: 1、先编译源码 运行 lib 文件夹 中的批处理文件 Fullc6.bat,会开始自动编译,编译完毕后,在 lib 同级目录下 会多出一个编译结果和头文件、库文件、bpl文件组成的目录 C6; 2、<em>安装</em>组件包 2.1、打开 bcb6,component-> install packages-> add,找到新产生的bpl文件,确定; 2.2、执行project-> options-> directories/conditional,将include path和lib path中 均添加你的indy9产生的c6目录,最好将搜索目录路径提至最前! 3、把 c6目录中 所有.bpl后缀的文件 复制 c++ builder<em>安装</em>目录\Projects\Bpl 中, 把 c6目录中 所有.bpi后缀的文件 复制 c++ builder<em>安装</em>目录\Projects\Lib 中, 4、重启 bcb6 即可
indy10 的问题。
第一个问题:我用delphi2010的IdTCPServer做个服务器希望能保持1000个以上的连接,不知道能不能支持的了?rn第二个问题:rnprocedure TForm2.GPRSTCPServerExecute(AContext: TIdContext);rnvarrn Len,i,ClientPort : Integer;rn Str,HexStr,ClientIP : string;rnbeginrn Len := AContext.Connection.Socket.InputBuffer.Size;rn Str := AContext.Connection.Socket.ReadString(Len);rnrn if Str <>'' thenrn beginrn for i := 1 to Length(Str)dorn HexStr := HexStr+' '+IntToHex(Byte(Str[i]),2);rnrn ClientPort := AContext.Connection.Socket.Binding.PeerPort;rn ClientIP := AContext.Connection.Socket.Binding.PeerIP;rnrn Memo1.Lines.Add('ReadForm:'+ClientIP+'--'+IntToStr(ClientPort)+'--DataLen:'+IntToStr(Len)+'--linkcount:'+IntToStr(GPRSTCPServer.Contexts.LockList.Count));rn Memo1.Lines.Add('ASC:'+Str);rn Memo1.Lines.Add('HEX:'+HexStr);rn end;rnend;rnrn这个代码发现第一个客户端连接进来后能够正常的接收到数据,第2个客户端连接进来后不能正常接收到第2个客户端的信息。这是什么原因呀?
使用gcc编译c代码的时候报错
[b]今天编译erlang自带的ei_interface的例子时,<em>报错</em>如下[/b] [code=&quot;shell&quot;] [liufan@liufan src]$ gcc -o extprg -I/usr/local/lib/erlang/lib/erl_interface-3.7.13/include/ -L/usr/local/lib/erlang/lib/erl_interface-3.7.13...
Indy10 Delphi6
Indy10 适用于Delphi6,<em>安装</em>时直接添加bpl文件,将目录添加引用即可
indy10文件传输
请问<em>indy10</em>.5.5中的UDP怎么传输文件,以前的版本中AData为TStream,现在成了TBytes不知道怎么做,请高手们不吝赐教!
Indy10的文件传输
基于Indy10写的文件传输,最最基本的代码,自己刚学Indy10的<em>时候</em>写来练习的。
delphi indy10
看注释:功能很简单,服务端结合TTrayIcon控件使用,接收消息作为气泡弹出,关闭指令'Quit'
indy10 for delphi7
<em>indy10</em> for delphi7 在Delphi7中请在测试可以使用。。。。
Indy10的帮助文件
我在Indy网站上下载了10.0版的,<em>安装</em>完成后发现没有帮助文件,然后另外下载了三个帮助文件,分别是Indy10.als、Indy10.cnt、Indy10.hlp,这三个文件怎么利用呢?我现在在FORM里添加Indy的控件后,按F1没有相关的帮助信息出来,而且在编写语句时,比如录入“IdFTP1.”后,并没有方法属性提示,请大家指导一下。
indy10 for D7
<em>indy10</em> for D7
Indy10的使用例子
记录下,使用方法 unit UMain; interface uses Windows, Messages, SysUtils, Variants, Classes, Graphics, Controls, Forms, Dialogs, StdCtrls, IdCustomTCPServer, IdTCPServer, IdBaseComponent, IdComponent,
lazarus indy10
在linux(Ubuntu10.04)中<em>安装</em><em>indy10</em>控件,出现了如下的错误提示:rnHint: Start of reading config file /etc/fpc.cfgrnHint: End of reading config file /etc/fpc.cfgrnFree Pascal Compiler version 2.4.0-2 [2010/03/06] for i386rnCopyright (c) 1993-2009 by Florian KlaempflrnTarget OS: Linux for i386rnCompiling printer4lazarus.pasrnCompiling printersdlgs.pprnCompiling osprinters.pasrnCompiling ./unix/cupsdyn.pprn/usr/lib/lazarus/0.9.28.2/components/printers/unix/cupsdyn.pp(72,17) Hint: Type "sockaddr_in" redefinitionrn/usr/lib/lazarus/0.9.28.2/components/printers/unix/cupsdyn.pp(714,50) Note: Values in enumeration types have to be ascendingrn/usr/lib/lazarus/0.9.28.2/components/printers/unix/cupsdyn.pp(1068,64) Hint: C arrays are passed by referencern/usr/lib/lazarus/0.9.28.2/components/printers/unix/cupsdyn.pp(1069,69) Hint: C arrays are passed by referencern/usr/lib/lazarus/0.9.28.2/components/printers/unix/cupsdyn.pp(1070,48) Hint: C arrays are passed by referencern/usr/lib/lazarus/0.9.28.2/components/printers/unix/cupsdyn.pp(1,1) Fatal: Can't find unit qt4 used by OSPrintersrn有人遇到过吗?
安装redis集群,时候安装ruby redis接口报错问题
前提: <em>安装</em>ruby完成:<em>安装</em>方法:编译<em>安装</em>!1.9.3以上版本 错误描述:gem install --local /usr/local/src/redis-3.3.0.gem  ERROR:  Loading command: install (LoadError)     cannot load such file -- zlib ERROR:  While execut
安装vue开发环境→安装淘宝镜像的时候报错
 问题:npm WARN deprecated socks@1.1.10: If using 2.x branch, please upgrade to at least 2.1.6 to avoid a serious bug with socket data flow and an import issue introduced in 2.1.0解决办法:降低版本 npm install np...
手动安装的PHP7环境,安装扩展的时候报错
场景:在php7下需要<em>安装</em>mbstring扩展命令:yum install php-mbstring错误:Error: php70w-common conflicts with php-common-5.4.16-43.el7_4.1.x86_64 You could try using --skip-broken to work around the problem You could try ...
cocoapods 安装报错报错
解决方案: 这是Xcode没有找到,我用的是Xcode-beta7.1版,通过下面命令设置下当前的Xcode路径sudo xcode-select -switch /Applications/Xcode-beta.app/Contents/Developer
C++ Builder6英文帮助文件
资料比较齐全
C++ Builder6 的错误
C++ Builder6 中只要输入void main()或任何函数,库函数也是,就会出现以下错误提示rnrn[C++ Error] Unit1.cpp(1): Unable to invoke Code Parameters due to errors in source code
C++ Builder6 PPT
这是关于C++BUILDER 6 的PPT教程,内容详细.与大家共勉!
VCL60.bpl(C++ Builder6)
为什么用c++builder的做一个exe文件在别的机子上总说少vcl60.bpl等文件;这里有vcl60.bpl下载
C++ BUILDER6实用教程+代码
高清影印,C++ BUILDER6实用教程+代码,初级到深入。
C++ Builder6安装教程
为解决广大编程爱好者<em>安装</em>C++ Builder6的困扰!
builder6关于access的基本操作
C++ builder 6 关于access数据库的基本操作,包括连接数据库,数据库的查询、添加、删除、保存等基本操作。数据库文件与生成exe文件同处于一个文件夹下即可。
C++ builder6 ADOQuery 问题
void __fastcall TfmMain::addempClick(TObject *Sender)rnrn fmEmpInfo->Caption="增加柜员";rn fmDB->ADOQuery1->Append();rn fmEmpInfo->ShowModal();rnrnrn整个程序只添加了这个代码,为什么运行后关闭程序无法自动结束程序,运行生成的exe文件说是“0x7c930a19”指令引用的“0xffffffff”内存,该内存不能为“read”。
about wndproc in c++ builder6
我的程序如下:rn但编译通不过,why? helprnunit1.hrnrn.............rnprotected:rn virtual void __fastcall WndProc(Messages::TMessage &Message);rn..............rnrnrnrnunit1.cpprnrnvoid __fastcall TForm1::WndProc(Messages::TMessage &Message)rnrn if(Message.Msg==iconmessage)rn rn if(Message.LParam==WM_LBUTTONDBLCLK)rn rn Application->Terminate();rn //如果双击图标,则关闭应用程序rn rn return;rn rnrnrnrn请各位帮忙rn
c++ builder6的打印对话框
请各位看下面的代码,我想显示一个打印对话框,可这段代码在rnc++builder5下能显示出对话框,可在c++<em>builder6</em>下却什么都不显示,请问为什么??rn int nResult;rn PRINTDLG pd ;rn pd.lStructSize = sizeof (PRINTDLG) ;rn pd.hwndOwner = NULL ;rn pd.hDevMode = NULL ;rn pd.hDevNames = NULL ;rn pd.hDC = NULL ;rn pd.Flags = PD_ALLPAGES | PD_COLLATE |rn PD_RETURNDC | PD_NOSELECTION ;rn pd.nFromPage = 0 ;rn pd.nToPage = 0 ;rn pd.nMinPage = 0 ;rn pd.nMaxPage = 0 ;rn pd.nCopies = 1 ;rn pd.hInstance = NULL ;rn pd.lCustData = 0L ;rn pd.lpfnPrintHook = NULL ;rn pd.lpfnSetupHook = NULL ;rn pd.lpPrintTemplateName = NULL ;rn pd.lpSetupTemplateName = NULL ;rn pd.hPrintTemplate = NULL ;rn pd.hSetupTemplate = NULL ;rn if (!PrintDlg (&pd))rn rn rn // return true ;rnrn int n = CommDlgExtendedError();
为什么我在D7中安装了Indy10 后,编译程序的时候,系统报错!在线等哈…………………………
为什么我在D7中<em>安装</em>了Indy 后,编译程序的<em>时候</em>,系统<em>报错</em>:rnUnit IdCommandHandlers was complied with a different version of IdComponent.TIdComponent。rnrn我是先卸载了D7 的Indy9 再<em>安装</em>Indy10 的。是不是我没有卸载干净?rn我是这样卸载的:Compontents-〉install packages ->选中Indy 然后Remove。rn最后把Delphi中Projects\Bpl下和Lib下所有*indy 都卸载了。rnrn请各位指点哈,先谢谢了!rn
c++ builder6 导出excel
之前一个 bcb5开发的程序 移植到 bcb6中 需添加 导出excel 功能。 现在的问题是 用ole 方法 程序<em>报错</em> rnaccess violation at address 005AE277 .之前一个项目 用bcb6 开发的 同样代码 就没有<em>报错</em>。 刚开始学bcb 完善找不到方向 。求各位大神帮帮忙rn
哪有C++ Builder6下载?
哪有C++ Builder6下载?
C++ builder6 求救
本人刚接触C++ <em>builder6</em>,碰到一个小问题,希望大家多帮忙。rnrn我新建了一个窗体,随便放了几个组件玩玩,然后我就把C++ <em>builder6</em>关了。这<em>时候</em>系统就提示我是否需要保存更改,我选择“是”, 然后系统弹出一个我弄不明白的对话框。 对话框显示的内容是:rnunable to find package import yb-base-c6.bpi 我点击执行按钮时也会出现同样的对话框。rnrn请问这是什么意思,怎么处理啊?rnrnrn
c++ builder6的盘
我以前的cb6的盘给丢了,去买的<em>时候</em>,好家伙,全部都变成了4张(好像还是6张)盘的,请问各位有没有谁知道,其他的几张盘是什么内容???
C++ Builder6 初学问题
为什么下面函数有错?(最后一句)rn String str1;rn int str1_size;rn str1=(Edit1->Text);rn int size=str1.size();rn 这size()是标准C++函数。为什么这里不能用。
c++ builder6的麻烦问题
各位高手,请问为何我在c++ builder里编写一个程序时,末保存就运行,这样就编译成功,而且运行正常,但保存后再运行就出错了,提示 rn[Linker Fatal Error]Fatal:Expected a file name rn请问这是什么原因,是我装的c++ <em>builder6</em>有什么问题吗?我在win98和win2000试过都是这样,有人建议我在<em>安装</em>c++ <em>builder6</em>后,再装update4,不过这个update4太难找了,找到了又下载不了,请问如何是好?
Builder6 程序设计实用教程
C++ <em>builder6</em>完成程序界面设计
MYSQL + C++ BUILDER6的问题
我用MYSQL的C++ API来进行MYSQL的操作就是不行,有那位大侠给我一份示例!我是从MYSQL网站上下的C API FOR C++ BUILDER 6.0的,可是老是<em>报错</em>,真是烦人rn我的邮箱:729320@163.com,谢谢!
bcb6.hlp(C++ Builder6 的帮助文件)
BCB 帮助文件 bcb6.hlp(C++ Builder6 的帮助文件)
C++ Builder6的注册码是什么?
C++ Builder6的注册码是什么?rn在下新买两张<em>builder6</em>盘,但是怎么也找不到注册码,请各位大侠帮忙。
关于c++ builder6的帮助!
请教怎么使用C++ BUILDER6的帮助呢?rn连AnsiString的属性、方法都找不到呀,在5的帮助中就能找到的!!rn我用的是WIN98系统.
安装报错】win7下安装myeclipse8.5报错
win7下<em>安装</em>myeclipse8.5,默认<em>安装</em>。rn然后进入myeclipse-new-web project<em>报错</em>rn网上搜了一下,说<em>安装</em>路径不能有中文名...可是c盘的"用户"-"用户名"的用户名已经是自己的中文姓名了,是这个问题吗?该怎么解决,求助啊!!!
安装报错
本机<em>安装</em>winform项目时提示"不会<em>安装</em>该公布应用程序,因为它可能不安全.请于管理员联系将程序包的用户界面选项更改为基本",这个<em>安装</em>包在别的机器上都可以正常<em>安装</em>.我本机<em>安装</em>别的项目也正常.这是什么原因?
import Tkinter的时候报错
在看到图形界面编程的<em>时候</em>,需要导入Tkinter模块,从而在解释器中进行import Tkinter,然后。。。<em>报错</em>如下:   &amp;gt;&amp;gt;&amp;gt; from tkinter import * Traceback (most recent call last): File &quot;&amp;lt;stdin&amp;gt;&quot;, line 1, in &amp;lt;module&amp;gt; File &quot;/usr/loca...
在集成第三方库的时候报错
在集成第三方库的<em>时候</em><em>报错</em>,解决方法1:在Build settings里的enable bitcode改为NO
asp.net数据库连接时候报错
using System;rnusing System.Collections.Generic;rnusing System.Linq;rnusing System.Web;rnusing System.Web.UI;rnusing System.Web.UI.WebControls;rnrnusing System.Data.SqlClient;rnusing System.Data;rnusing System.Web.Configuration;rnpublic partial class _Default : System.Web.UI.Pagernrn protected void Page_Load(object sender, EventArgs e)rn rnrn rn // private bool doCheck(string condVlue, string type = "login")rn // rn rn // rn protected void Button1_Click(object sender, EventArgs e)rn rn string strconn = WebConfigurationManager.ConnectionStrings["weiboConnectionString"].ConnectionString;rn SqlConnection con = new SqlConnection(strconn);rn con.Open();rn SqlCommand cmd= new SqlCommand("INSERT INTO Table(user_login,user_password)Value(@user_login,@user_password)",con);rn cmd.Parameters.AddWithValue("@user_login", TextBox1.Text);rn cmd.Parameters.AddWithValue("@user_password", TextBox2.Text);rn cmd.CommandType = CommandType.StoredProcedure;rn int count=cmd.ExecuteNonQuery();rn if (count == 1)rn rn Page.ClientScript.RegisterClientScriptBlock(this.GetType(), "success", "alert(\"chenggong\");", true);rn rn cmd = null;rn con.Close();rn con = null;rnrn rnrnrn Could not find stored procedure 'Insert into Table(user_login,user_password)Value(@user_login,@user_password)'.rn说明: 执行当前 Web 请求期间,出现未经处理的异常。请检查堆栈跟踪信息,以了解有关该错误以及代码中导致错误的出处的详细信息。rnrn异常详细信息: System.Data.SqlClient.SqlException: Could not find stored procedure 'Insert into Table(user_login,user_password)Value(@user_login,@user_password)'.rnrn源错误:rnrnrn行 28: cmd.Parameters.AddWithValue("@user_password", TextBox2.Text);rn行 29: cmd.CommandType = CommandType.StoredProcedure;rn行 30: int count=cmd.ExecuteNonQuery();rn行 31: if (count == 1)rn行 32:
java笔试题大汇总下载
java笔试题大汇总,常见考题,请大家下载 相关下载链接:[url=//download.csdn.net/download/sunxiaochuan2003/2077785?utm_source=bbsseo]//download.csdn.net/download/sunxiaochuan2003/2077785?utm_source=bbsseo[/url]
3721卸载方法下载
3721网站的卸载方法, 3721卸载方法 相关下载链接:[url=//download.csdn.net/download/xqcnjs/5363655?utm_source=bbsseo]//download.csdn.net/download/xqcnjs/5363655?utm_source=bbsseo[/url]
RFC文档3501-4000下载
如果你想成为网络方面的专家,那么RFC无疑是最重要也是最经常需要用到的资料之一,所以RFC享有网络知识圣经之美誉。 相关下载链接:[url=//download.csdn.net/download/death_note_/7217021?utm_source=bbsseo]//download.csdn.net/download/death_note_/7217021?utm_source=bbsseo[/url]
相关热词 c#入门推荐书 c# 解码海康数据流 c# xml的遍历循环 c# 取 查看源码没有的 c#解决高并发 委托 c#日期转化为字符串 c# 显示问号 c# 字典对象池 c#5.0 安装程序 c# 分页算法
我们是很有底线的