win32 error 267的错误,怎么解决啊。

C/C++ > C++ 语言 [问题点数:20分,结帖人yanjinbin01]
等级
本版专家分:1
结帖率 100%
等级
本版专家分:7040
勋章
Blank
蓝花 2008年3月 C/C++大版内专家分月排行榜第三
等级
本版专家分:1
等级
本版专家分:1
等级
本版专家分:41106
勋章
Blank
黄花 2009年3月 C/C++大版内专家分月排行榜第二
等级
本版专家分:1
等级
本版专家分:1
等级
本版专家分:0
等级
本版专家分:0
等级
本版专家分:0
yanjinbin01

等级:

如何解决VC6.0中Win32 error 267错误

http://peng-jun.blog.163.com/blog/static/2156281420093179427693/

NSIS “Win32 Error,Code:740 ,请求的操作需要提升”错误解决方法

 使用NSIS安装向导,生成脚本后,按F9后,居然提示:Win32 Error,Code:740 .请求的操作需要提升 解决方法: 使用管理员权限打开NSIS Edit ,打开文件进行编辑运行即可。

vc6.0编译运行程序提示could not execute :Access denied (win32 error 5)解决办法

这个错误很郁闷 解决办法就是把360了退出就可以了 如果你不是这个原因,欢迎留言补充,谢谢。

错误ERROR 1935 安装程序集的解决办法

32位操作系统),在安装的过程中出现 Microsoft Visual C++2005 安装不成功,提示:错误 1935。安装程序集“Microsoft.VC80.OpenMP,type="win32",version="8.0.50727.42",publicKeyToken="1fc8b3b9a1e18e3b",pro

解决Error:CreateProcess error=193,1%不是有效的Win32应用程序

一、出现此错误的过程 笔记本电脑windows系统,之前安装过Android Studio,本次安装换路径了,安装好了后,新建了个工程,发现报错,报错截图如下: 开始以为是Android Studio版本的问题和Windows不兼容导致的,...

fatal error C1189: #error 错误解决方案

fatal error C1189: #error : TBB is unable to run on old Windows versions;_WIN32_WINNT must be 0x0501 or greater.

VS2010编译错误:fatal error C1189: #error : This file requires _WIN32_WINNT to be #defined at least ...

下面是彻底解决方法: 在工程的stdafx.h中添加(如有类似语句,需注释掉) #ifndef WINVER // Allow use of features specific to Windows 95 and Windows NT 4 or later. #define WINVER 0x0501 // Change this ...

win7上安装visual c++ 2008 redistributable 发生错误error 1935

原来服务"Windows Modules Installer"被禁用了, 启用该服务后, 问题就解决了.

使用Runtime去运行命令行 CreateProcess error=193, %1 不是有效的 Win32 应用程序。

java.io.IOException: CreateProcess error=193, %1 不是有效的 Win32 应用程序。 百度到解决方案:方案 运行的命令行前面添加: runtime.exec(“cmd \c ionic -v”); 下面是参考过来的:错误代码2一般都

解决安装软件出现错误Error 1935安装程序集

解决安装软件出现错误Error 1935安装程序集的方法 修改注册表数值 注册表路径 HKEY_LOCAL_MACHINE \SYSTEM \CurrentControlSet\Control  步骤: 开始 - 运行(输入regedit.exe)- 确定或者回车,打开注册表...

植物大战僵尸win10无限报错fatal error终极解决办法

win10的植物大战僵尸全屏有时候会遇到一些奇怪的问题,你报错可能是因为默认全屏游戏了。此时把输入法改成ENG英语(美国),然后再打开游戏就好了。 ...

运行时出现Run-time error'429'错误解决方法

解决方法:点击“开始”→“运行”在弹出的输入框中键入以下命令: regsvr32 "C:/Program Files/Common Files/Microsoft Shared/DAO/dao360.dll" 然后按回车键,注意必须加引号。如果还提示:429错误,可以再进行...

VS2012 下C1189错误解决办法

一个C++工程拷贝至另一个系统之后,重新编译,报如下错误Error 1 error C1189: #error : This file requires _WIN32_WINNT to be #defined at least to 0x0403. Value 0x0501 or higher is recommended  原来是...

64位Win7系统中安装vc++2008运行时报Error1935错误解决方法

问题说明   最新单位来了一批新的计算机(64位Win7系统),其中很...通过对比正常使用的计算机,发现是没有安装vc++2008运行时,于是在网上下载了运行时并在有问题的计算机上安装,但在安装过程中报Error1935错误

windows connect()返回错误的代码10061的解决办法

即还没有开启服务器端,开启服务器端就可以了.

(转)如何解决VC6.0中win32 error267错误

如何解决VC6.0中Win32 error 267错误   作者:彭天   今天,在运行某个程序的时候出现了错误。说是“Invalid Directory(Win32 error 267)”。从错误提示上,很明显是因为我们的VC6.0...

windows visual c++ 2005 redistributable error 1935解决办法

原由:在控制面板,错误的操作删除了vcredist_x86 2005  现象:QQ2010不能用,Nero 10不能用,安装Arcgis10 失败! 解决办法,在网上下载了vcredist_x86 sp1安装,问题接着出现,安装的最后过程也是相当缓慢~~~...

有关error C2501: 'WINGDIAPI' : missing storage-class or type specifiers的错误

在w7 64为操作系统上,安装好VC 6.0,并且配置好OpenGL开发环境后,创建Win 32 Console Application项目之后,写了一个简单的程序,调试时提示错误error C2501: 'WINGDIAPI' : missing storage-class or type ...

成功解决pywintypes.error: (2, 'LoadLibraryEx', '系统找不到指定的文件。')

成功解决pywintypes.error: (2, 'LoadLibraryEx', '系统找不到指定的文件。') 目录 解决问题 解决思路 解决方法 解决问题 pywintypes.error: (2, 'LoadLibraryEx', '系统找不到指定的文件。') ...

VB6在WIN7 64位下报automatic error解决办法

VS6企业版可以在WIN7 64位下安装成功,但每次运行VB6...1,显式地以管理员身份运行(64位权限控制的问题,32WIN7没有此问题,默认以管理员方式运行); 2,VB6程序的属性里修改以兼容模式运行(选WINXP)。 据个人分

Matlab 2016a安装激活,启动显示License Manager Error-8,解决方法?

描述:将Matlab 2016a Win64 Crack\R2016a\bin\win64下面的libmwservices.dll文件放到MATLAB\R2016a\bin\win64文件夹下(覆盖,替换);图示:1— 2—小尾巴:同志们!一起学习,共同进步!

Error 1935.安装程序集 Microsoft.vc80.atl,type="win32",version="8.0.50727.762

装很多软件是都要配置VC++环境的,但由于系统注册表限制,很多时候软件安装过程中会报如下错误 尤其是在win7旗舰版下面: 安装 vc++2005 运行库 Error 1935.安装程序集 Microsoft.vc80.atl,type="win32",version=...

Couldn't reserve space for cygwin's heap, Win32 error 0

Win7上使用MinGW\msys\1.0\bin\patch.exe打补丁的时候,出现上如标题所示的错误。 在stackoverflow上找到了答案: ...

Error:CreateProcess error=193, %1 不是有效的 Win32 应用程序。

安装好Studio,启动项目提示以下图片内容:   我是XP系统,32位电脑。装了1.8的JDK,android studio 也正常安装2.2后升级到2.

HTTP错误500.19-Internal Server Error

前言  这个错误是小编在发布网站的时候遇到的,通过IIS发布网站就不介绍了,就说说小编对这个问题的理解吧。 问题分析  1. 应用程序池已经启用了32位,所以应该不是这个的问题   2. 这个B/S系统放在了系统...

Win10安装SVN出现2503错误

1.原因 出现这个错误的原因是权限不足,

关于MATLAB7.0打开提示runtime error问题的全面解决方法

1、在C盘建立一个文件夹...3、还是在第2步那里,新建变量,变量名称为BLAS_VERSION,值为C:\MATLAB7\bin\win32\atlas_Athlon.dll(ps:这个具体看当初安装时路径是在哪里,我的直接默认安装在C盘,本质是看tlas_Athlon.

Win7 NSIS Error: error writing temporary file的解决方法

转自VC错误:http://www.vcerror.com/?p=1907 问题描述: ...Win7 NSIS Error: error writing temporary file的解决方法 解决方法: 具体的解决方法参考文章:http://www.vcerror.com/?p=1907

GLFWError #65542 Happen, WGL: The driver does not appear to support OpenGL

小黑升级的Win10后就跑不起 Cocos2d了,换了几个版本的引擎都是提示这个错误。 先前用Win7的时候还跑的起,说明小黑的集成显卡 GMA 4500 是支持 OpenGL的。同时网上搜索这个错误,基本上说的也是显卡驱动,...

C++错误LIBCD.lib(wincrt0.obj) : error LNK2001: unresolved external symbol _WinMain@16的原因

LIBCD.lib(wincrt0.obj) : error LNK2001: unresolved external symbol _WinMain@16   出现这个错误的原因是你创建了win32 Application工程,而主函数却定义为了控制台模式的main函数。  ...

相关热词 c#创建非模态窗体 c#提取字符串中的数字 c# 扩展无返回类 c#网站如何做预览功能 c# 异步 返回值 c#chart实时曲线图 c# 窗体 隐藏 c#实现终端上下滑动 c# 传递数组 可变参数 c# list 补集