process finished with exit code -1? [问题点数:0分]

Bbs1
本版专家分:0
结帖率 100%
Bbs6
本版专家分:6258
运行出现Process finished with exit code 1
出现此问题大部分为端口号被占用,更换端口号即可,或检查是否开启了2个本地项目
idea项目用run可以跑起来, 但是用debugger报这个错误 :Process finished with exit code 1
-
Process finished with exit code -1
tf_embedding = tf.Variable(tf.to_float(self.embeddings), trainable=True, name="W"),embeddings是词向量。代码
”填坑“ -- springboot 启动报错 “Process finished with exit code 1”
pom文件中一个”0“ 引发的血案 背景 近期使用spring boot2.0做新项目demo时,发现启动boot项目时,控制台什么错误日志都不显示,显示如下信息: Process <em>finished</em> with <em>exit</em> <em>code</em> 1 可能问题 启动时存在这种情况时,基本上是以下几种情况导致: 1. yml配置文件有特殊字符错误 2. pom.xml 文件多了特殊字符 3. 其他配...
解决 Spring boot 启动报 Process finished with exit code 1 问题
报错信息如下: 我造成该问题的原因如下: 1.项目中的日志配置不正确 2.项目中mapper.xml存在错误 解决办法如下: 1.修改日志配置文件,把下图中的spring.profiles.active = test 修改为spring.profiles.active = dev 2.修改完上述步骤后,控制的就能正常打印处日志,如下: 找到错误位置,修改正确后重...
Maven实战:test skip
about maven mvn clean install -Dmaven.test.skip=true
Java SSM 项目启动报 Process finished with exit code 1
错误重现 原因 在项目的test 目录下有个数据字段,我是用外部的软件打开,所以报错 解决方案 关闭外部软件就可以了
Process finished with exit code 1
** 1. pom.xml ** pom.xml中可能有依赖冲突(或重复依赖)或者有不合法的特殊字符 依赖可在External Libraries中检查(直观) 特殊字符就只能在pom.xml中仔细查看了 ** 2. .properties和 .yml配置文件 ** 可能配置有误,请仔细检查 若有多个配置文件,请使用spring.profiles.active=xxx指定你的启动配置文件 **...
Android Studio Emulator: Process finished with exit code 1 问题解决
最近启动模拟器的时候报一下错误:Emulator: Process <em>finished</em> with <em>exit</em> <em>code</em> 1Emulator: [6216]:WARNING:android/android-emu/android/featurecontrol/FeatureControlImpl.cpp:160:Failed to load advanced feature default settin...
emulator: Process finished with exit code 1
机型lenovo 小新锐7000  windows10 安装Android Studio过程中遇到了好多的问题,总算装好啦,把问题动总结了一下;安装的过程中一定要充满耐心的重启与安装(沧桑脸...) 1.启动模拟器失败时的报错信息  emulator: Process <em>finished</em> with <em>exit</em> <em>code</em> 1;  emulator: ERROR: x86 emulation c...
spring cloud Process finished with exit code 1分析
测试环境配置一套Mongodb 副本集,发现新的配置启动失败,打印万项目logo 之后报错 spring cloud Process <em>finished</em> with <em>exit</em> <em>code</em> 1 控制台直接没有报错信息,没有日志信息 直接查找错误 开始怀疑是配置spring cloud 配置中心有问题,看到源码之后排除配置中心问题 后来本地启动项目,报错信息一致,再次确定配置中心的问题 debug 模式...
关于idea搭建SpringBoot启动时:Process finished with exit code 0解决办法
使用idea(springboot initializr)快速搭建springboot项目,一路next;启动时候:Process <em>finished</em> with <em>exit</em> <em>code</em> 0,这不是错;意思是:这个表示程序正常执行完毕退出了。这就表示项目启动成功后了,此时运行,最后运行完毕自动退出。而现在我们想要的是启动项目访问路径,我们需要的是springmvc的框架(可以使用一些注解如:@RestCo...
springboot运行时候出现Process finished with exit code 1错误
Connected to the target VM, address: '127.0.0.1:49944', transport: 'socket' . ____ _ __ _ _ /\\ / ___'_ __ _ _(_)_ __ __ _ \ \ \ \ ( ( )\___ | '_ | '_| | '_ \/ _` | \ \ \ \...
运行代码后出现Process finished with exit code 0是为什么?
Process <em>finished</em> with <em>exit</em> <em>code</em> 0 意味着你的程序正常执行完毕并退出。 可以科普一下<em>exit</em> <em>code</em>,在大部分编程语言中都适用: <em>exit</em> <em>code</em> 0 表示程序执行成功,正常退出 <em>exit</em> <em>code</em> 1 表示程序执行执行过程中遇到了某些问题或者错误,非正常退出 ...
Process finished with exit code 1 Class not found: "DiaryServiceTest"Empty test suite.
1. 编写目的 介绍IDEA报的一种错误以及错误的解决方法。 2. 问题描述 运行项目中的test代码时(junit单元测试),IDEA会提示错误如图: 3. 解决方法 删除已经生成的target文件夹即可。 再次运行IDEA会重新生成target文件夹,并且不再会提示以上错误。 Smileyan 2019年3月5日 ...
Process finished with exit code -1073741819 (0xC0000005)错误解决
一. 错误出现原因 从python3.5.2更新到了3.6.2后,再运行import tensorflow as tf,报错。 二. 解决办法 更新h5py
pycharm报错:Process finished with exit code -1073741819 (0xC0000005)
这个错误是真的奇怪,网上说法居然各个都不一样,而我解决的方法也都和大家不一样。所以如果你遇到了这个问题,可以从以下几个方面找找原因,希望能帮到你。我觉得最有可能的是第六种,可以直接看第六种方法。。 第一种:读取csv文件 如果你读取了csv文件,请参考这个,否则直接跳过 原地址:https://stackoverflow.com/questions/28447567/python-termi...
解决Pycharm debug下出现错误Process finished with exit code -1073741819 (0xC0000005)的问题
这个错误困扰了我一天,网上找的答案也是千奇百怪,部分可以参考该篇博客 博客地址:https://blog.csdn.net/qiao1025566574/article/details/81037908 以上尝试未果,最后在外网找到了解答,具体有三种,每个都试一次或许就能解决(最有可能是第三种方法) 一、更新pyqt,更新numpy 二、打开pycharm的菜单中的Run – Edit...
idea启动springboot项目,控制台出现Process finished with exit code 0,
2017-10-06 14:29:49.326 WARN 3348 --- o.h.v.m.ParameterMessageInterpolator : HV000184: ParameterMess
Intellij idea 下spring boot 启动报错Process finished with exit code 1
解决办法,修改配置文件:spring-profiles-active=dev; spring: profiles: active: dev 欢迎关注个人微信公众号 四味馆
cordova Process finished with exit code -1
http://www.androiddevtools.cn/#gradle cordova Process <em>finished</em> with <em>exit</em> <em>code</em> -1   安装完cordova之后,创建一个测试项目后,运行报Process <em>finished</em> with <em>exit</em> <em>code</em> -1,经过查找原因,是因为gradle没有安装,在http://www.androiddevtoo
Process finished with exit code -1073741571 (0xC00000FD),总是报这个错,这是怎么回事呢?
-
SpringBoot启动直接结束 控制台只显示 “Process finished with exit code 1” 处理方式
启动SpringBoot main方法后 什么都不显示直接: “Process <em>finished</em> with <em>exit</em> <em>code</em> 1” DeBug模式只显示分配的IP和端口,2秒后直接Destory,然后我检查了一下代码没有问题,只能从配置文件查找,但是,我只有两个配置文件,我删除logback-spring.xml 后正常运行,可能是不小心改到哪了,通常这问题应该是配置文件错误。 ...
大坑之Process finished with exit code -1073740791(0xC0000409)
作者是个技术不怎么样的bug制造者,用的是windows+caffe+python的GPU版本训练模型,但是在训练加载prototxt的时候遇到了这个问题,噩梦一般的Process <em>finished</em> with <em>exit</em> <em>code</em> -1073740791(0xC0000409)表达一下这两天修改这个bug的心路历程。 报错的地方在一个将三个通道进行全连接层之后,就针对这个问题,作者觉得自己已经是一...
pycharm远程调试程序时出现Couldn't connect to console process. Process finished with exit code -1
pycharm远程调试程序时出现 “Couldn’t connect to console <em>process</em>. Process <em>finished</em> with <em>exit</em> <em>code</em> -1” 针对于错误代码为-1的情况,本人解决方式如下:pycharm →\rightarrow→ Edit Configrations →\rightarrow→ python →\rightarrow→ Run with p...
idea启动main函数 显示 “错误: 找不到或无法加载主类 com.Main Process finished with exit code 1”
idea项目之前都是好好的,但是第二天运行main方法就出现 “错误: 找不到或无法加载主类 com.Main Process <em>finished</em> with <em>exit</em> <em>code</em> 1” 用的Debug运行也显示这个,但还多两行代码。 网上搜索了不少有关解决这个问题的文章,包括什么修改地址,项目名字,方法名字,清理缓存之类的;也做了相应修改,还是无济于事。最后对比了同事的项目发现右边红色区域多了很...
spring boot 运行提示:Process finished with exit code 1
spring boot 运行提示:Process <em>finished</em> with <em>exit</em> <em>code</em> 1 经检查发现是由于在application.properties配置文件中将某些自定义配置项移除了,但是代码中没有删掉,导致以上错误发生。 例如,配置文件中原先存在: jszs.path=/oracle/grgzpt-test/ 代码中存在以下应用:@Value(&quot;${jszs.path}&quot;)pri...
Process finished with exit code 3
是在运行tensorflow的时候遇到的这个问题,百度发现原因是因为内存不足,深度代码需要修改batch大小或者修改输入数据库大小就行 运行tensorflow的例子,出现Process <em>finished</em> with <em>exit</em> <em>code</em> 3问题 顺便总结一下关于<em>exit</em> <em>code</em>的提示 <em>process</em> <em>finished</em> with <em>exit</em> <em>code</em> 0 说明程序正常运行完毕 pro...
Process finished with exit code -1073740791 (0xC0000409)
晚上来了兴致,做了一个CNN的demo,然后在jupyter book里无法运行,python已停止工作,顺便kernel也死掉了。然后就陷入了查错的过程。。之后用pycharm运行,程序直接退出,无debug信息。顺便出现这么一行Process <em>finished</em> with <em>exit</em> <em>code</em> -1073740791 (0xC0000409)。果然,是因为显卡内存不够啊。。解决办法:将训练数据分成...
IDEA中debug不报错run运行java程序报错Process finished with exit code -1073741819 (0xC0000005)
-
pycharm Process finished with exit code 0怎么解决
我把教程作者的源码下载到本地了。作者的代码运行之后是有输出的,我本地运行之后只有上述pycharm Process <em>finished</em> with <em>exit</em> <em>code</em> 0这个提示,这个怎么解决?
win10 pycharm debug tensorflow-gpu [Process finished with exit code -1073741819 (0xC0000005)【已解决】
windows上使用pycharm debug  project  with  tensorflow-gpu error: 这个问题还是蛮水逆的,网上有说是: 1、这个好像是环境变量的问题,pycharm在获取环境变量时,估计用了WINDOWS系统里过时的方法,导致在新的系统上无法正确解析出环境变量值出来,补充一下,本人用的win10。https://www.cnblogs.com/lin...
Process finished with exit code 0 / 1
  <em>exit</em> <em>code</em> 0 : 表示程序执行成功,正常退出 <em>exit</em> <em>code</em> 1 :表示程序执行执行过程中遇到了某些问题或者错误,非正常退出    
idea运行springBoot项目报错 Process finished with exit code 0
Deleting provided scope of spring-boot-starter-tomcat dependency helps me.在pom.xml中添加&amp;lt;dependency&amp;gt; &amp;lt;groupId&amp;gt;org.springframework.boot&amp;lt;/groupId&amp;gt; &amp;lt;artifactId&amp;gt;spring-boot-st...
运行代码后出现Process finished with exit code 0原因
Process <em>finished</em> with <em>exit</em> <em>code</em> 0:程序正常执行完毕并退出。 <em>exit</em> <em>code</em>在大部分编程语言中都适用: <em>exit</em> <em>code</em> 0 :表示程序执行成功,正常退出 <em>exit</em> <em>code</em> 1 :表示程序执行执行过程中遇到了某些问题或者错误,非正常退出...
runnerw.exe: CreateProcess failed with error 216: Process finished with exit code 216 运行go项目抛此异常
该异常原因是不是小伙伴们都遇见过把包名由test改为main即可
Process finished with exit code -1073741819 (0xC0000005)
在pycharm中只要一导入matplotlib.pyplot就会直接退出,然后报错,Process <em>finished</em> with <em>exit</em> <em>code</em> -1073741819 (0xC0000005)。 import matplotlib.pyplot as plt都会报错。   解决方法: 卸载了此时的matplotlib 然后重新安装了一个 然后就好了...
配置Pycharm,解决终端可运行,Pycharm报错:Process finished with exit code 134 (interrupted by signal 6: SIGABRT)
错误提示如下:I tensorflow/stream_executor/dso_loader.cc:135] successfully opened CUDA library libcublas.so.8.0 locally I tensorflow/stream_executor/dso_loader.cc:126] Couldn't open CUDA library libcudnn.so....
报错【Process finished with exit code -1073741819 (0xC0000005)】
python报错 Process <em>finished</em> with <em>exit</em> <em>code</em> -1073741819 (0xC0000005) 解决方案 移除from tensorflow.contrib.learn.python.learn.datasets import base 这个问题的原因也可能是其他的 但是都可以先移除自己不需要的包 再尝试运行看能不能解决。 ...
【spring boot】base服务启动失败--Process finished with exit code 0
前言    小编在启动spring boot项目的时候,遇到了一个问题base服务启动后直接退出:Process <em>finished</em> with <em>exit</em> <em>code</em> 0,之前配置项目启动Eureka的时候也是遇到了这个问题,当时控制台没有报错信息,是启动的端口号与本地的IIS服务端口冲突导致的。 问题重现 1.运行失败 2.控制台的错误日志: 018-10-22 19:18:05.70...
Android Studio Emulator: Process finished with exit code 0错误
android studio 更新到3.0到时候启动模拟器无法启动,报以下错误 根据错误提示百度,但网上的解决方案依然没有用,不过大概知道是因为虚拟化没有启动的原因。百度开启虚拟化。。。mac:sudo nvram boot-args=""然后重启之后发现模拟器正常启动。网上还有一种解决方案,就是不使用x86映像,使用arm平台的映像,不过速度会很慢。
webstrom运行nodejs文件出现CreateProcess failed with error 2
1:首先:确定自己已经安装好了nodejs 2:然后查看控制窗里面报的具体的信息,我的具体信息如下: "D:\软件\webstorm\WebStorm 2017.2.5\bin\runnerw.exe" D:\node\node.exe "D:\文档\node test\hello.js" CreateProcess failed with error 2: Process finishe
Python笔记——pyCharm错误: Process finished with exit code -1073740791 (0xC0000409)
楼主在pyCharm上搭建深度神经网络做图像生成时, 运行代码, 报错: Process <em>finished</em> with <em>exit</em> <em>code</em> -1073740791 (0xC0000409) 原因:显卡内存不足! 解决办法:将训练数据分成数量较小的batch
android Process finished with exit code 0
工具:android studio 现象:运行工程报错:android Process <em>finished</em> with <em>exit</em> <em>code</em> 0 原因:run的不是安卓工程,而是其他(例如:一个java工程-Main),选择app即可
Python 运行出现Process finished with exit code -1073741515 (0xC0000135)错误
原因是Python版本的不匹配,实际的配置中选用了python3,重新选为python2即可
Android Studio虚拟机报错Emulation: Process finished with exit code 3
问题原因:看起来和虚拟机API版本有关解决方法:在Run时选择Create new virtual device,在新的虚拟机里选择对应的API版本
pydev debugger报错:Process finished with exit code -1073741819 (0xC0000005)
原贴 https://blog.csdn.net/qiao1025566574/article/details/81037908 补充第七种情况: 卸载Qt相关 conda uninstall qt 我是这样解决的
解决win10+cuda9.2+Tensorflow+keras出错问题:Process finished with exit code -1073741819(0xc000005)
解决win10+cuda9.2+Cudnn+Tensorflow+keras出错问题:Process <em>finished</em> with <em>exit</em> <em>code</em> -1073741819(0xc000005) 本人出错原因cudnn不匹配,出错版本为cudnn-9.2-windows10-x64-v7.2.1.38; 更换cudnn-9.2-windows10-x64-v7.1或者cudnn-9.2-windo...
【error】intellij idea报错处理
报错: intellij idea一运行就报错,找不到类解决方法: 打开project structures(alt+ctrl+shift+s),查看project–out和module–path–out设置的目录是否存在。 一般module–path–out设置的是target目录下的,但是首次运行时没有target目录的,必须先用maven build一下才会生成,所以要么改out路径,要
Python错误TypeError: write() argument must be str, not bytes
小记一下,今天使用open打开文件的时候出现了下面的错误。 注:我用的是Python3.6.1版本。 TypeError: write() argument must be str, not bytes 网上搜索才发现原来是文件打开的方式有问题。 之前文件打开的语句是: filehandle = open(WAV_FILE, 'w') 然后使用二进制方式打开就没有这个问题: f...
idea启动程序后直接退出控制台Process finished with exit code 0
-
python 中文字符报错Process finished with exit code 0
# -*- coding:utf-8 -*-   解决方法:在文件开头声明编码utf-8
Process finished with exit code 1 (C++)
-
bug宝典node篇 nodejs Process finished with exit code 0
我使用webstorm创建node express项目,运行app.js出现下面的异常信息 nodejs Process <em>finished</em> with <em>exit</em> <em>code</em> 0 解决办法,就不拾人牙慧了nodejs Process <em>finished</em> with <em>exit</em> <em>code</em> 0错误处理 上图说明服务启动成功,端口3000是在bin目录下面www文件中说明了
emulator: ERROR: x86 emulation currently requires hardware acceleration! Please ensure Intel HAXM is
原文错误提示: emulator: ERROR: x86 emulation currently requires hardware acceleration! Please ensure Intel HAXM is properly installed and usable. CPU acceleration status: HAX kernel module is not install
process finished with exit code 52
在intellij上搭建了spark源码阅读环境,然后分别设置master与slave的启动参数,从而启动master与slave进程的时候,可能会报如下错误: <em>process</em> <em>finished</em> with <em>exit</em> <em>code</em> 52 进入调试状态,错误发生在: 进行调试发现52错误出现在SparkExitCode.scala类中,其中错误定义如下: /** The defau
python 使用requests时提示Process finished with exit code -1073741819 (0xC0000005)
我这里是因为访问的https连接,所以不验证证书或者指定证书路径即可。 requests.post(loginUrl,data=formData,headers=headers,verify=False) requests.get(loginUrl,data=formData,headers=headers,cert=('/path/server.crt', '/path/key'...
运行tensorflow的例子,出现Process finished with exit code 3问题
最近学习tensorflow。按照手册学习到Deep MNIST for Experts时,出现 test_accuracy = accuracy.eval(feed_dict={x: mnist.test.images, y_: mnist.test.labels, keep_prob: 1.0})这条语句不执行,后面的代码也没执行。但是没报错,显示Process <em>finished</em> with
引用BeautifulSoup库异常退出Process finished with exit code -1073741819 (0xC0000005)
在pycharm里运行这段代码就会异常退出 也不报错 from bs4 import BeautifulSoup html = """ - -
tensorflow 报错: Process finished with exit code -1073740791 (0xC0000409)
____tz_zs报错场景:我是在训练神经网络模型,同时运行检测的会话检测其正确率时报错(ps:在cpu版本的tensorflow上不会报错)Creating TensorFlow device (/gpu:0) -&amp;gt; (device: 0, name: GeForce GTX 965M, pci bus id: 0000:01:00.0) could not create cudnn ha...
pyCharm Process finished with exit code -1073740791 (0xC0000409)
楼主在pyCharm上搭建CNN做图像识别时, 运行代码, 报错: Process <em>finished</em> with <em>exit</em> <em>code</em> -1073740791 (0xC0000409) 原因:显卡内存不足! 解决办法:将训练数据分成数量较小的batch
运行安卓虚拟机时出现了错误
-
萌新求救,android studio无法运行模拟器
点击运行app启动模拟器后,右下角出现两条提示: Emulator: Process <em>finished</em> with <em>exit</em> <em>code</em> 1! Emulator: emulator: ERROR: x86
tensorflow载入报错Process finished with exit code -1073741819 (0xC0000005)
        这几天准备在现有的软件里加上caffe来测试一种新算法。发现windows下python3.6安装caffe是真的难,只能装好python2.7的版本就放弃了。回来继续完善软件,又发现软件里的tensorflow不能导入了。import tensorflow as tf 会导致Process <em>finished</em> with <em>exit</em> <em>code</em> -1073741819 (0xC00000...
AS运行每次都提示Process finished with exit code 0,该怎么解决啊。
-
Android之平时遇见的异常和错误总结(不断更新)
安卓错误经验累积  1、当出现下面错误时候     08-21 03:43:16.679: E/AndroidRuntime(1087): java.lang.RuntimeException: Unable to start activity ComponentInfo{com.example.fragment/com.example.fragment.MainActivity}: andr
Android Studio 模拟器第一次启动不了
-
解决Emulator: emulator: ERROR: x86 emulation currently requires hardware acceleration
系统:win10 64位 Android studio  3.2 第一次运行,报这个错 19:03    Emulator: emulator: ERROR: x86 emulation currently requires hardware acceleration! 19:03    Emulator: Process <em>finished</em> with <em>exit</em> <em>code</em> 1 解决办法...
Android Studio 模拟器打不开解决方法
The emulator <em>process</em> for AVD Nexus_5_API_24 was killed. emulator: ERROR: x86_64 emulation currently requires hardware acceleration! Android Studio Emulator: Process <em>finished</em> with <em>exit</em> <em>code</em> 1 这...
andoid studio 运行项目 finished with non-zero exit value 1 错误
编译不报错 运行项目出现下面错误  transformClassesWithDexForDebug'.  com.android.build.api.transform.TransformException: java.lang.RuntimeException: com.android.ide.common.<em>process</em>.ProcessException: java.util.concur
关于在as上启动虚拟机时发生问题的解决
以下为错误日志:23:23 Emulator: [7912]:ERROR:android/android-emu/android/qt/qt_setup.cpp:28:Qt library not found at C:\Program Files\Android\android-sdk\emulator\lib64\qt\lib 23:23 Emulator: Could not launch ...
android问题解答
Q1:android studio出现错误:Error:Could not resolve all files for configuration ':app:debugAndroidTestRuntimeClasspath'. > Could not download junit.jar (junit:junit:4.12) > Could not get resource 'https://jc
Return code 1 for dex process
最近在对老项目进行二次开发的时候,遇到一个问题。新建一个实体类的时候,直接提示 :app:transformClassesWithDexForDebug FAILED 具体的错误如下 AGPBI: {&quot;kind&quot;:&quot;error&quot;,&quot;text&quot;:&quot;1 error; aborting&quot;,&quot;sources&quot;:[{}]} :app:transformClassesWithDexForDebug FA...
process.ProcessException: Return code 1 for dex process"">android运行报错:"com.android.ide.common.process.ProcessException: Return code 1 for dex process"
一、找到项目相关的build.gradle 添加如下黑色背景的代码 android{ compileSdkVersion 25 buildToolsVersion "25.0.2"    .................. //此段代码解决的是因为引入了第三方jar包,而项目里方法数过多,需要分包,android项目有方法数限制,最多64K。包括引用的第三方类库里的方法
【已解决】程序异常终止:Process finished with exit code -1073741819 (0xC0000005)
一、问题出现背景: 项目环境:Maven + IDEA + JDK1.8 使用Run执行程序时直接终止并出现上述提示信息Process <em>finished</em> with <em>exit</em> <em>code</em> -1073741819 (0xC0000005) 使用debug执行程序正常 网上搜索到的是Python出现这个问题的博客文章,不熟悉:pycharm报错:Process <em>finished</em> with exi...
Intellij Idea Java process finished with exit code 0xc0000005 问题
最近Intellj Idea在升级到2018.3.5后,打开以前写的程序竟然发现在运行Main方法后,过大概3到5秒钟的时间,就异常退出程序, 提示: Intellij dea Java <em>process</em> <em>finished</em> with <em>exit</em> <em>code</em> 0xc0000005 花费了好久,又是把jdk1.8卸载重装,又是重新装了jdk10发现问题都没有解决, 偶然发现一个帖子:https:...
解决java - IntelliJ Process finished with exit code 0 when spring-boot run
I have a problem when starting spring-boot appication from IntelliJ-Idea. I don't have this problem when running application through terminal.:: Spring Boot :: (v1.2.1.RELEASE) 2015-09-24 12:2...
关于spring-boot服务 启用问题,求大神解答!
-
Java Spring _boot 运行提示Process finished with exit code 1
小弟初学java,在 debug spring boot项目时提示Process <em>finished</em> with <em>exit</em> <em>code</em> 1,网上找了几个解决方法。 1. 经测试,本地配置文件添加后无效 2 . 在IDEA 用Termial命令执行后提示 然后在maven目录下执行install,提示的是 这个是我的失误,应该执行Lyfecycle 目录下的,而不是Plugi...
sublime text3 没有输出详细错误问题
-
Sublime Text工具学习
编译:Ctrl+B{ "shell_cmd":"make" }<em>code</em>是1则成功[Finished in 0.0s with <em>exit</em> <em>code</em> 1] [shell_cmd: python -u "F:\sublimeTextPro\first.py"] [dir: F:\sublimeTextPro] [path: d:\AppCan\AppCanStudioPersonalV3.2\HD
解决sublime Text编译python中文脚本出错
sublime Text是一个非常好的IDE,而且响应速度神马的都非常棒,但是使用过程中会有一些头疼的问题。 最最常见的问题当属编译的时候莫名其妙的报错。 uni<em>code</em>中文是没有办法在sublime Text的console中输出的。 使用sys.setdefaultencoding('utf-8')即可解决
出现( linker command failed with exit code 1)错误总结
这种问题,通常出现在添加第三方库文件或者多人开发时。 这种问题一般是找不到文件而导致的链接错误。 我们可以从如下几个方面着手排查。 1.以如下错误为例,如果是多人开发,你同步完成后发现出现如下的错误。 Undefined symbols for architecture armv7: "_OBJC_CLASS_$_MyPageLogViewController", refer
SpringBoot应用在Intelij IDEA里面启动时总报Process finished with exit code 1
最近在弄SpringBoot应用应用开发,经常遇到SpringBoot应用在Intelij IDEA里启动时报错: Process <em>finished</em> with <em>exit</em> <em>code</em> 1 解决办法如下: 删除工程里的所有.idea目录 .iml文件 https://stackoverflow.com/questions/46428611/<em>process</em>-<em>finished</em>-with-<em>exit</em>-c...
Disconnected from the target VM, address:xxxx 或者 Process finished with exit code 1 终极解决办法 idea
这个bug,没有日志,无从下手! 网上找了上100篇文章仍然找不到解决方案! 报错如下图: 终极解决办法: 1.安装jrebel,参考本博主博文 https://blog.csdn.net/u013294097/article/details/90263477 2.使用jrebel使用debug启动 3.特别注意:此处有日志文件产生 4.排查日志,搞定! ...
使用 JVMTI 实现 jar 包字节码加密
由于 Java 属于解释型语言,在 class 文件被 JVM 加载之前,可以很容易的将其反编译,得到源码。对比网上提供的很多方法,比如使用混淆器或是自定义类加载器,都是基于Java层面的,一样可以被反编译。最后,终于找到一种更有效的解决方案:使用 JVMTI 实现 jar 包字节码加密。   JVMTI 简介 JVMTI(JVM Tool Interface)是 Java 虚拟机所提供的 ...
Java黑科技之源:JVMTI完全解读
Java生态中有一些非常规的技术,它们能达到一些特别的效果。这些技术的实现原理不去深究的话一般并不是广为人知。这种技术通常被称为黑科技。而这些黑科技中的绝...
JVMTI_ERROR_WRONG_PHASE (112)问题要怎么解决
我在编写JVMTI agent,连续调用几个接口函数,都是这个问题 jvmti手册上说是JVMTI_ERROR_WRONG_PHASE (112) The desired functionality
使用jvmti实现class加密,防止反编译
如果想要保护自己的java代码不被别人反编译,则可以使用下面的jvmti对Class加密,然后在类加载器加载时再进行解密,逃避反编译。 jvmti是java自带的强大工具,我们可以通过jvmti做一些操作(例如:hook class加载,jvm启动前做什么事情,或者jvm初始化时做事情等等) 步骤如下: 1.对class进行加密 2.创建本地方法DLL,实现解密代码 (1)添加jvmti...
想通过JVMTI来加密类文件,但存在疑虑,高手请进
最近想加密类文件,防止客户反编译。 我知道可以通过JVMTI来创建作为代理dll文件,让代理加密类文件,只要客户不反编译dll文件即可。 可是,是否允许多个-agentib参数同时存在? 如果允许,那
jrebel 启动报错-找不到指定的文件
这个错误我一直没有头绪,不知道怎么解决; 我的开发环境是 win7 +eclipse 多module的spring mvc 框架的maven项目 开启jrebel后,启动就报错 JRebel-JVMT
JVMTI对JAVA加密
通用JAVA加密或者是混淆更贴切技术是将class、方法及包,以随机命名方式进行混淆,虽然这种方式增加了阅读难度,但还不足以将字节码文件进行完整保护。本文介绍一种以JVMTI和JNI方式对字节码进行加
java计算器的制作下载
使用FlowLayout、GridLayout和BorderLayout的面板设置计算器。 相关下载链接:[url=//download.csdn.net/download/xlj0503a/4879003?utm_source=bbsseo]//download.csdn.net/download/xlj0503a/4879003?utm_source=bbsseo[/url]
第二章 FLOW-3D 铸造充填分析(高造铸造)下载
第二章 FLOW-3D 铸造充填分析(高造铸造) 相关下载链接:[url=//download.csdn.net/download/su_guiping/5202109?utm_source=bbsseo]//download.csdn.net/download/su_guiping/5202109?utm_source=bbsseo[/url]
LED显示屏系统下载
关于LED显示屏控制系统的关键技术的描述,可以对LED显示屏控制系统有一个详细的了解 相关下载链接:[url=//download.csdn.net/download/tianlanghai2012/7421053?utm_source=bbsseo]//download.csdn.net/download/tianlanghai2012/7421053?utm_source=bbsseo[/url]
相关热词 c# 线程结束时执行 c# kb mb 图片 c# 替换第几位字符 c#项目决定成败 c# 与matlab c# xml缩进 c#传感器基础 c#操作wps c# md5使用方法 c# 引用父窗口的组件
我们是很有底线的