VC++执行错误

C/C++ > C++ 语言 [问题点数:20分,结帖人zhaomiaoqianran]
等级
本版专家分:0
结帖率 94.74%
等级
本版专家分:1996
等级
本版专家分:663
安装PostgreSQL时出现VC++ runtime error的解决方法

最近想玩玩PostgreSQL,下载了一个9.3.2-1的64位...如下图:在网上找了找,问题原因可能是VC++ runtime 已经安装,所以我们在安装PostgreSQL时不安装VC++ runtime 即可。方法如下:在postgresql-9.3.2-1-windows-...

VC++6错误检查工具

先说个下载地址吧:http://download.csdn.net/source/1002260  http://www.vckbase.com/tools/downtools.asp?id=22 ... BoundsChecker 是一个Run-Time错误检测工具,它主要定位程序在运行时期发生的各种错误

VC++链接错误LNK2001总结

我们在 VC++开发时经常会遇到链接错误LNK2001,一般说来发生连接错误时,编译都已通过。产生连接错误的原因非常多,如版本原因,模块依赖,库使用不当。如果不深入地学习和理解VC++,要想改正连接错误LNK2001...

VC++错误Error1935解决方案

此本只针对于VC++问题引起的程序无法安装,其他问题请勿参考。 安装 vc++运行库 Error 1935.安装程序集 Microsoft.vc80.atl,type="win32",version="8.0.50727.762",publicekeytoken="1fc8b3b9a1...

VC++常见调试错误

调试方式: F9设置断点 F10单步执行   光标移动到一个代码段 ctrl+ F10 执行

我的 VC++ 常见错误问题解决办法

1.没有解决的外部定义错误 xyView.obj : error LNK2001: unresolved external symbol "public: __thiscall CMyOCRInfo::CMyOCRInfo(void)" (??0CMyOCRInfo@@QAE@XZ) 可能是由于构造方法没有实现代码 2.没有释放 ...

常见的vc++编译错误 及解决方法

常见的vc++编译错误  (2011-05-26 11:11:54 ▼ 标签:  it   1、fatal error C1010: unexpected end of file while looking for precompiled header directive。 寻找预...

VC++中“执行 cl.exe 时出错”解决方法

vc++ 链接错误 error LNK2019: unresolved external symbol 检查步骤

背景说明:此次用了别人给的一个C++算法源代码,源...当所有编译错误解决后,出现了很多链接错误。比如这样的:process.obj : error LNK2019: unresolved external symbol "void __cdecl matrixAdd(double *,d...

VC++执行Update SQL语句挂死问题分析

问题描述:

VC++执行MSSQL存储过程产生错误"对象关闭,无法操作该对象

VC++执行MSSQL存储过程产生错误"对象关闭,无法操作该对象" 解决方法:关掉存储过程的记录回显,就可以解决该问题 就是在创建存储过程时在前面加入语句:set nocount on就ok. 

VC++内存错误,管理,防止,运行错误

VC++内存错误,管理,防止,运行错误 C++语言是桌面系统,尤其是系统软件、大型应用软件的主流开发语言。C++语言以其灵活性著称,同时也更复杂。利用C++编写健壮的代码,更具有挑战性。C++允许动态内存管理, ...

VC++ ShellExecute 执行、运行一个外部程序函数功能详解:

ShellExecute 函数功能:  ShellExecute 的功能是运行一个外部程序(或者是打开一个已注册的文件、打开一个目录、打印一个文件等等),并对外部程序有一定的控制。 函数简介:  有几个 API 函数都可以实现这些...

VC++编译错误信息

1、fatal error C1010: unexpected end of file while looking for precompiled header directive。 寻找预编译头文件路径时遇到了不该遇到的文件尾。(一般是没有#include "stdafx.h") 2、fatal error C1083: ...

VC++程序运行时出现Runtime error的一种情况及解决

关于程序运行时出现Runtime error的错误,在网上看到很多说法,我暂且不论谁是谁非,在此我列举我编程过程中遇到的一种情况与大家分享。 错误提示如下图: 最终找到是响应OnTimer时出现了问题。当然,错误并不是...

VC++6.0单步执行

VC++6.0中的单步调试: 调试重要的几个键: F9在当前光标所在的行下断点,如果当前行已经有断点,则取消断点. F5调试状态运行程序,程序执行到有断点的地方会停下来. F10单步执行程序. CTRL+F10运行到光标所...

解决:explorer.exe 产生VC++ Runtime 错误的解决办法

20100413刚装完了一个系统,打开浏览器出现出现C++ runtime error,导致...在桌面上点击右键,无该错误2.在文件夹上点击右键,也无该错误3.在我的电脑空白处点击,也无该错误4.只是在文件上点击右键,马上产生该

vc++6.0单步执行

VC++6.0中的单步调试:  调试重要的几个键:  F9在当前光标所在的行下断点,如果当前行已经有断点,则取消断点.  F5调试状态运行程序,程序执行到有断点的地方会停下来.  F10单步执行程序.  CTRL+F10运行到...

VC++快捷键大全

F1: 帮助 Ctrl+O :Open Ctrl+P :Print Ctrl+N :New Ctrl+Shift+F2 :清除所有书签 F2 :上一个书签 Shift+F2 :上一个书签 Alt+F2 :编辑书签 Ctrl+F2 ...

VC++编译时错误 - 执行c windows system32 cmd.exe 时 出错

今天编译一个VC++(6.0)工程,出现下述错误: --------------------Configuration: GdiplusTest - Win32 Debug-------------------- Compiling resources... Compiling... StdAfx.cpp Compiling... GdiplusTest.cpp...

电脑启动一直出现vc++运行时库错误,这么解决?

下面是问题图片! [图片说明](https://img-ask.csdn.net/upload/202004/13/1586745249_450890.png) 还有就是运行有些程序代码时,也会报错,下面是图片

vc++6.0执行该程序后的这一个错误怎么处理

错误: --------------------Configuration: Cpp1 - Win32 Debug-------------------- Compiling... Cpp1.cpp c:\users\wrf\desktop\2\cpp1.cpp(3) : fatal error C1083: Cannot open include file: 'head.h': ...

VC++编程错误调试问题

出现下面错误要怎样具体调试 c:\program files\microsoft visual studio\myprojects\111\121.cpp(7) : fatal error C1083: Cannot open include file: 'Ntddndis.h': No such file or directory Error executing...

vc++6.0错误:没有找到MFC42D.DLL,因此这个应用程序未能启动

问题:vc++6.0错误:没有找到MFC42D.DLL,因此这个应用程序未能启动.重新安装应用程序可能会修复此问题。 解: 一般在编程序时,都是生成了调试版的程序,就是在那个 Debug目录下的可执行文件。运行这调试版的...

安装VC++6.0的时候提示acmboot.exe错误执行问题

最近因为需要使用到VC++6.0软件,在安装该软件时出现问题,报错说“ACMBOOT.EXE无法执行”,导致无法加载安装引导程序。 问题分析: 因为VC版本较老,我们使用的电脑大都在64bit/Win7以上了,所有该软件对此支持并...

VC++和Lua交互(VC调用Lua函数)

VC++ 与 lua 交互(二) ---- VC 调用 lua函数 --LuaTest.lua Function MaxMin(x,y)  If x > y then  return "x > y", x, y  elseif x == y then  return "x == y",x, y ...

解决win10安装VC++ 出现的启动错误

Windows10系统升级更新后,一位朋友发现电脑中的visual C++ 6.0软件突然无法正常运行了。这该怎么办呢?...1、如果你已经装有VC++ 6.0中文版,那么就可以直接下载英文版的MSDEV.exe可执行文件直接替换中文版的

vc++ 编译错误“no appropriate default constructor available”解决方法

 在继承一个新类时,出现no appropriate default constructor available这个错误,  原因:    基类的构造函数需要一个参数,  而 派生类继承自基类, 所以派生类的构造函数会提前...

VC++6.0常见编译错误中英文对照表

VC++6.0常见编译错误中英文对照表 fatal error C1003: error count exceeds number; stopping compilation 中文对照:(编译错误错误太多,停止编译 分析:修改之前的错误,再次编译 fatal ...

python爬虫20个案例

讲诉python爬虫的20个案例 。。。。。。。。。。。。。。。。。。。。。。。。。。。。。。。。

相关热词 c#中字符串大小写转化 c# 设置加载ie11 c#捕获关机信号 c#显示键盘输入的字符 c#list对象排序 c# sql查询方法 3d贝塞尔曲线 c# c#获取秒 c# 类型可空转换 c#字符串转ascii码