编译错误,<identifier> expected, [问题点数:20分,结帖人zt915]

Bbs1
本版专家分:0
结帖率 100%
Bbs6
本版专家分:5262
Bbs1
本版专家分:0
Bbs1
本版专家分:40
Bbs6
本版专家分:6922
Bbs6
本版专家分:6922
Bbs3
本版专家分:808
Cuda5.5不支持C++11的解决方法
最近在做的项目中既用到了Cuda,同时又用到了C++11的一些新的特性,在用gcc<em>编译</em>的时候会出现<em>错误</em>。 <em>错误</em>提示为: /usr/include/c++/4.6/x86_64-linux-gnu/./bits/c++config.h(159): error: identifier "nullptr" is undefined /usr/include/c++/4.6/x86_64-linux
新手请问, expected是什么原因呢?
请问,javac之后,出现 <em>expected</em>是什么原因呢? illegal start of type呢?还有'try' without 'catch' or 'finally
编译错误和运行错误
<em>编译</em><em>错误</em>指的是你写代码不规范,语法<em>错误</em>(简单说就是你代码这么写没有问题,但是你知道会在运行时候报错)和一些很明显的<em>错误</em>。运行<em>错误</em>是指代码逻辑<em>错误</em>,报异常。 DataStream有什么用 存取对象的属性; String.getBytes();获取String的byte;
IIS 发布的网站显示:编译错误,怎么回事?
请问以下是怎么回事,权限都是有的。 “/”应用程序中的服务器<em>错误</em>。 <em>编译</em><em>错误</em> 说明: 在<em>编译</em>向该请求提供服务所需资源的过程中出现<em>错误</em>。请检查下列特定<em>错误</em>详细信息并适当地修改源代码。 <em>编译</em>器<em>错误</em>消息:
C++ 常见编译错误及解决方法
1.[Error] in C++98 ‘box1’ must be initialized by constructor, not by ‘{…}’ vector初始化问题: CBox box1 ={78.0,24.0,18.0}; 改成 CBox box1 (78.0,24.0,18.0) 或者开启<em>编译</em>选项 -std=c++11 变量定义的问题: 例如:想要定义三个整型变量,初始化为0; ...
编译错误和运行错误,有什么区别?
import static java.lang.System.out; public class Primitive2Wrapper { public static void main(String
编译错误expected macro formal parameter
照着侯老先生的《深入浅出MFC》写的程序,其中要用到宏,但老<em>编译</em>出错。 #define _IMPLEMENT_RUNTIMECLASS(class_name,base_class_name,wSche
caffe训练出错之:Expected integer or identifier
执行训练的命令,加载solver之后出现该<em>错误</em>提示:Error parsing test-format caffe.NetParameter: 81:9: Expected integer or identifier,got:“Pooling”,提示缺少一个整型数或者标识符一般是由于“Pooling”层出现了语法<em>错误</em>(检查大括号是否完全正确匹配),或者layer与layers(贾扬清caffe版本...
求助:编译错误
1>------ 已启动全部重新生成: 项目: CreateEnts, 配置: Debug Win32 ------ 1>正在删除项目“CreateEnts”(配置“Debug|Win32”)的中间文
field or method identifier expected错误
代码如下,<em>编译</em>的时候报field or method identifier <em>expected</em>,为啥呀?怎么解决 unit TestUtil; interface type ItemGroup = cl
编译错误 error: expected ')' before
#ifndef S_T_R_B_L_O_B #define S_T_R_B_L_O_B #include #include #include #i
expected ';', identifier or '(' before 'struct'
#include #include /* run this program using the console pauser or add your own
Identifier expected but 'TYPE' found错误是何原因?是关于记录类型方面的错误
先附上一段代码: uses Windows, Messages, SysUtils, Classes, Graphics, Controls, Forms, Dialogs, ComCtrls, St
错误?怎样解决!">求救!!!Parsing error:Identifier expected.Input Line:"*/"是什么错误?怎样解决!
问题同题目
编译错误,帮忙看看原因出在什么地方
C:\Program Files (x86)\WiX Toolset v3.11\bin\candle.exe -dDebug -d"DevEnvDir=C:\Program Files (x86)\
iOS xocde编译报错 NSObjCRuntime.h
今天遇到一个比较少见的问题,记录下来,给遇到的人解答下,<em>错误</em>提示如下: 大家应该知道runtime是把OC<em>编译</em>成底层的C,他在这里报这个<em>错误</em>,我们要第一想到的是我们是否改动了这个文件,如果排除了这个可能,我们还要想到是不是项目里的PCH写错了,而笔者的问题就是PCH写错了。 把pch文件修改好就<em>编译</em>成功了。
expected错误的解决办法">web项目放入jQuery.js文件是出现Syntax error on token "catch", Identifier expected错误的解决办法
本文转自:http://blog.csdn.net/u011159417/article/details/73916676 <em>错误</em>: 解决办法如图: 右击出错的项目------MyEclipse-----点击Exclude From Validation--------Ran Validation 完成! ...
今天的c++编译错误及运行时错误
csdn的标题总是不好输入进去. 今天的<em>编译</em><em>错误</em>: 复制一个类时,没改构造函数名字. 函数名字写错了. 不能宏重定义.我以为还可以定义.原来不行.即不能递归定义宏. #define a b #define c a 不能这样. 找不到标识符.函数名写错了.或未进行宏定义 又一个无法将参数 5 从“unsigned char *”转换为“const float *” 这个就没法了.只一个存储数据的地方...
C++编译错误
我在做POJ中的一道题目,地址如下 我的代码如下: #include #include using namespace std; int t = 0; cha
编译错误和运行错误有什么区别?
如题!
identifier expected but 'BEGIN' found 是怎么回事啊
program Project2; uses Forms, Unit1 in 'Unit1.pas' {Form1}, Unit2 in 'Unit2.pas' {Form2}, Unit3 in '
Type name pattern expected 报错解决;Identifier expected报错解决;spring的Aop的XML方式配置
声明,使用 spring5.0.7 、JDK8 、maven3.5.4 问题描述: 在spring配置aop切点通配符时候报错,提示信息为: Type name pattern <em>expected</em> 、一般原因为少了逗号或者括号,检查没有发现这种<em>错误</em>;查看源码瞅瞅; 打开源码,发现原因为 com.baidu前面 少敲了个空格: 附上切点通用表达式: &amp;lt;!-- 设置aop 、po...
急!从没遇到过的编译错误
昨天运行还好好的,但是今天一运行就报错。<em>错误</em>信息如下: <em>编译</em><em>错误</em> 说明: 在<em>编译</em>向该请求提供服务所需资源的过程中出现<em>错误</em>。请检查下列特定<em>错误</em>详细信息并适当地修改源代码。 <em>编译</em>器<em>错误</em>信息: BC3045
gcc编译错误
1、 warning: control reaches end of non-void function 它的意思是:控制到达非void函数的结尾。就是说你的一些本应带有返回值的函数到达结尾后可能并没有返回任何值。这时候,最好检查一下是否每个控制流都会有返回值。 2、 warning: implicit declaration of function ‘fb_draw2’ 意思是,fb_draw2...
编译错误: error: expected nested-name-specifier be
系统:Ubuntu 9.10 环境: Qt Creator 1.2.1 based on Qt 4.5.2 ,g++ 4.4.1 #ifndef LINK_THREAD_H #define LINK_
编译时出现错误,跪求大侠支招。。
make: arm-linux-gnueabihf-gcc: Command not found CHK include/generated/uapi/linux/version.h CHK incl
Javascript脚本遭遇Expected identifier错误
       这几天调试程序都很正常。未曾想,有一个同事今天要测试我的程序,他用他的IE6浏览器一打开就发现了脚本<em>错误</em>:Expected identifier, string or number。但是用FireFox,IE8测试都没有这个问题。经测试,只有IE6,IE7会报这个脚本<em>错误</em>。而且从所报的脚本行数寻找过去,好像没有发现什么问题。于是几乎把整个程序文件重新过了一遍。折腾半天后发现是由于程序里多出了一个逗号。而这样的逗号FireFox和IE8都会忽略掉,IE6和IE7会认为逗号后面还有代码
编译错误:could not execute:path not found win32 error-3
<em>编译</em>一个程序,提示<em>错误</em>could-not-execute-path-not-found-win32-error-3,请问怎么解决啊??? 我调用了一个dll里面封装的函数, 难道是dll引起的<em>错误</em>吗?
c++编译时常见的几个错误
因问题可能会很多,后面会不断的进行更新。如果那里不好请不吝赐教。1.requestfor member XXX which is of non-class type 'YYY'XXX是指针, 但是引用其成员的时候使用了&quot;.&quot;, 把它当作一般的变量使用了, 这样就会导致这个<em>编译</em><em>错误</em>.2.new typesmay not be defined in a returntype类的声明时别忘了加上分号!3...
C++编译错误与运行时错误
这两天在准备实习,做笔试题时,有的选择题会让选择<em>编译</em><em>错误</em>还是运行<em>错误</em>,这里把自己找的最简单的理解记一下。 (1) <em>编译</em><em>错误</em>:就是<em>编译</em>器无法进行继续<em>编译</em>的<em>错误</em>,最基本的就是语法<em>错误</em>了,比如语句后面少了;或者 } 不匹配之类的,选择题一般是这样。<em>编译</em><em>错误</em>可以由<em>编译</em>器检查出来。 (2) 运行时<em>错误</em>:分为两类:1. 由于考虑不周或者输入<em>错误</em>导致程序异常,比如数组越界访问,除数为0,堆栈溢出等。 2,由
} expectedcss(css-rcurlyexpected)
} <em>expected</em>css(css-rcurly<em>expected</em>)----我出现这个<em>错误</em>的原因是没有在style中添加lang=less,添加后变为正常
JAVA的编译错误和运行时错误
1. 要区分<em>编译</em>时<em>错误</em>和运行时<em>错误</em>,就应该先明白什么是<em>编译</em>?什么是运行? 首先,先看一下这张图: <em>编译</em>期就是将我们写的java源代码交给<em>编译</em>器执行的过程,起翻译的作用,该过程主要对java源代码的语法进行检查,如果没有语法<em>错误</em>,就将源代码<em>编译</em>成字节码文件(即.class文件); 运行期则是将字节码文件(.class文件)加载到内存中交给java虚拟机执行,直到程序执行结束的过程,该过...
c++ 编译时报错 "undefined reference to ……"
-
编译出现错误
--------------------Configuration: AlbumDlg - Win32 Debug-------------------- Compiling... AlbumDlg.
常见编译错误(更新中...)
一、 无法解析的外部符号 _WinMain@16,该符号在函数 ___tmainCRTStartup 中被引用 #include using namespace std; int main() { cout &amp;lt;&amp;lt;“This is a C++ program.”; return 0; } 1&amp;gt;------ 已启动生成: 项目: hello1, 配置: Debug Win32 -...
请问这个编译错误如何解决?
typedef struct _seqof1 { struct _seqof1 *next; HS_SCCH_Codes value; } *_seqof1; <em>编译</em>出的<em>错误</em> D:\gcctest\in
javascript错误 Expected identifier, string, or number
遇到一个比较低级,又难以排出的javascript<em>错误</em>。 用户登录页面,ie8、火狐、谷歌浏览器显示正常;ie6、ie7出现javascript<em>错误</em>: Expected identifier, string or number  在网上查了一下,原因是这样的: var RecaptchaOptions = { lang : "fr" , }; ie6、ie7 在解释这
JAVA中容易出现的编译错误解决方式
1、<em>错误</em>显示:如果请求时出现java.lang.ClassNotFoundException<em>错误</em>,如下: j 解决方式如下:1、第一步,去web.xml中查看  &amp;lt;servlet-class&amp;gt;是否正确  &amp;lt;servlet&amp;gt;   &amp;lt;servlet-name&amp;gt;Hello&amp;lt;/servlet-name&amp;gt;   &amp;lt;servlet-class&amp;gt;j...
SSH框架,ant出现 expected ';' expected
真是太假了,我SSH框架是没有一点问题的;但是用ant,它就报错: Buildfile: E:\workSpace\Struts2.1\build.xml init: compile: Compili
高等数学 同济大学 第七版 上下册+习题全解指南高清PDF 共四册下载
高等数学 第七版 上下册+习题全解指南 高清PDF 共四册,这套资源花了我不少积分,其中一个下册的习题全解,就花了50积分。现在把它贡献给大家,希望能帮到更多需要的人。 相关下载链接://downlo
Linux下常见的编译错误及解决方法
1、/bin/bash: bison: command not foundmake: *** [out/host/linux-x86/obj/EXECUTABLES/aidl_intermediates/aidl_language_y.cpp] Error 127解决方法:sudo apt-get install bison2、make: *** [out/host/linux-x86/obj/E...
error: identifier "CUDA_SAFE_CALL" is undefined
64位win7 cuda4.2 出现error: identifier "CUDA_SAFE_CALL" is undefined,已包含cutil.h 请高手指教。
编译错误问题
warning C4554: “&”: 检查运算符优先级可能存在的<em>错误</em>;使用圆括号阐明优先级,这个我用圆括号改怎么没用《源程序为: if(ch2DH&0x9f==0x98 && ch2EH==0x0
一些编译错误及解决方法
初学C++编程时,总会遇到这样那样的<em>错误</em>。因此,总结一些经常遇到的<em>编译</em><em>错误</em>及解决方法,方便自己和他人,不定期更新中~ <em>错误</em>1:cannot declare member function ‘static ......’ to have static linkage 解决方法:.cpp文件里的函数就不要带 static 了,删除就好 <em>错误</em>2:在生成动态库时遇到以下问题 relocation R_X86
identifier NULL is undefined
在VS中,如果我们不使用任何标准头文件的话会出现这个bug。解决方案很简单,在文件中添加一个STL文件就可以了,如下: #include&lt;vector&gt;
Ubuntu14.04下搭建Kinect V2的环境以及出现的问题解决方案
请各位注意是kinect V2,kinect有两个版本,V1和V2一、安装1、Download libfreenect2 sourcegit clone git@github.com:DongdongBai/libfreenect2.git cd libfreenect22、Download upgrade deb filescd depends; ./download_debs_trusty.sh
expected">错误:"."expected
我在d:\temp中写了一个printer类 在CLASSPATH中已设置了路径 我在e:\myfile中的app.java 中import printer; 为什么<em>编译</em>时说:"."<em>expected</em>
xcode5.1 中使用c++中的nullptr时报错:Use of undeclares identifier 'nullptr'
如题,如何解决? 坐等答案,解决问题立即给分!
IAR 7.2 identifier "size_t" is undefined
-
ARMCC编译错误Error: #40: expected an identifier
我在ARMCC下<em>编译</em>一个库,宏定义如下 头文件utf16.h中 #define U16_FWD_N(s, i, length, n) { \ int32_t __N=(n); \ while(__N>
Delphi常见错误代码及中文解释
Delphi常见<em>错误</em>代码及中文解释 ';' not allowed before 'ELSE'                                             ElSE前不允许有“;” '' clause not allowed in OLE automation section                   在OLE自动区段不允许“”子句 '' is not
Line: 1772 Expression: _p != nullptr
程序运行就出错定位到这include "Utils.h" //definitions namespace global { DWORD_PTR pUWorld = 0; DWORD_PTR pGame
常见编译错误信息
原文地址: http://wenku.baidu.com/link?url=XWerSn3b1uBQf3HdHfsXE3_pnqtkNqx_oMdSSYF_lROyD7KYywY69pjO1Ac3g4icAe_x_l3EZQvMYfj8pgn1T_YrqUH8OvM_UzEHC9lunkW————————————————————————————————————————————————————常见编
KEIL编译错误精心整理
KEIL<em>编译</em>器<em>错误</em>精心整理
编译错误集锦
1、 mkdir改写为 _mkdir  fopen”改写为 fopen_s  stricmp改写为 stricmp_s strcpy改写为strcpy_s strcpy_s和strcpy()函数的功能几乎是一样的。strcpy函数,就象gets函数一样,它没有方法来保证有效的缓冲区尺寸,所以它只能假定缓冲足够大来容纳要拷贝的字符串。在程序运行时,这将导致不可预料的行为。用strc
常见c语言编译错误解析
C语言<em>编译</em><em>错误</em>信息及说明 1、 在函数 ‘transform’ 中:7: <em>错误</em>:<em>expected</em> ‘;’ before ‘{’ token     解释:‘{’之前的某个语句缺少分号‘;’;   2、 在函数 ‘Insert_SqList’ 中:6: <em>错误</em>:‘listsize’ 未声明 (在此函数内第一次使用)     解释:‘listsize’这个变量未声明;
常见编译错误
这个<em>错误</em>修正方法详见http://review.cyanogenmod.org/#/c/120824/2/build/Android.common_build.mk---
keil中编译stdint.h报错 identifier "__int8" is undefined
RT 建立的工程里包含stdint.h这个文件。但是<em>编译</em>是报错。。。 类似的<em>错误</em>很多。但是这个文件是我网上下载的,为什么会有问题? ..\Libraries\STM32F4xx_StdPeriph_D
maven 编译java工程: expected
根据Plugin tutorial去写Jenkins的plugin. 一步一步做下来,到执行以下命令时报错$ mvn package<em>错误</em>信息:[ERROR] Failed to execute goal org.apache.maven.plugins:maven-compiler-plugin:2.5:compile (default-compile) on project first.try:
ndk编译错误:error: 'nullptr' was not declared in this scope
nullptr是C++11引入的新特性,解决C和C++中NULL的定义不一致所带来的<em>编译</em>器兼容问题。C中NULL是指向0地址的指针(void *)0,c++中则是定义为整数0.       ndk中解决这个问题的办法就是添加对C++11的支持,在Application.mk中添加: NDK_TOOLCHAIN_VERSION = 4.9 APP_CPPFLAGS := -frtti -std=
Intel caffe 安装及用gpu训练即去掉CPU-Only的方法
能找到这里估计你也是快被气吐血了intel caffe针对cpu进行了优化,可以达到与gpu相同的性能(据说然而intel caffe<em>编译</em>过程中,若是把CPU_ONLY=1一行注释掉(即intel caffe使用gpu运行) 会出现无数莫名其妙的bug,
请问如何解决error: identifier out of scope问题?
我现在有一个ReturnStockHolding的web services,然后我想在一个web application里调用它,可它给了个error: identifier 'ReturnStock
identifier expected but 'begin' found 这个是怎么回事急!!!!!!!!!
program Project1; uses Forms, Unit2 in 'Unit2.pas' {Form2}, Unit1 in 'Unit1.pas' {Form1}, Unit3 in '
expected ';' identifier or '(' before 'struct'
#ifndef _IPV4_H #define _IPV4_H struct ipv4_h { #if __BYTE_ORDER == __LITTLE_ENDIAN unsigned int hl
Expected identifier or'('报错
承接ARVR项目开发: QQ 2118590660 文件后缀改为.mm就好了,我也是醉了 让我还研究了半天
Expected identifier or '('
两台电脑,完全相同的代码(u盘拷贝),一台电脑<em>编译</em>和链接都正常,另外一台出现了这个<em>错误</em>,出错的文件在pod目录下。       进入项目的目录:cd **       执行: pod update       执行失败,需要重新安装和设备Cocoapods:    sudo gem install cocoapods    pod setup    测试能否找到:pod sea
编译错误和运行错误要怎么区分
-
编译错误
创建create函数建立单向动态链表,<em>编译</em>时出错,出错行已在注释中标出。希望得到高人指点。 #include #include struct node { i
深入理解java异常处理机制
1. 引子        try…catch…finally恐怕是大家再熟悉不过的语句了,而且感觉用起来也是很简单,逻辑上似乎也是很容易理解。不过,我亲自体验的“教训”告诉我,这个东西可不是想象中的那么简单、听话。不信?那你看看下面的代码,“猜猜”它执行后的结果会是什么?不要往后看答案、也不许执行代码看真正答案哦。如果你的答案是正确,那么这篇文章你就不用浪费时间看啦。
编译错误:'QFrame' is not a base or member
qt<em>编译</em><em>错误</em>,提示如下: E:\work\code\Projects\splitter-vs\main.cpp:36: error: C2614: 'Content' : illegal member
C语言,C++常见编译错误
fatal error C1003:  error count exceeds number; stopping compilation 中文对照:<em>错误</em>太多,停止<em>编译</em> 分析:修改之前的<em>错误</em>,再次<em>编译</em>     fatal  error  C1004: un<em>expected</em> end of file found 中文对照:文件未结束   分析:一个函数或者一个结构定义缺少“}”、或者在
gcc在出现错误的时候停止编译 -Wfatal-errors
有时候我们<em>编译</em>一个大的项目的时候,会出现很多<em>错误</em>使得屏幕堆满了很多无用的信息。一般情况下我们需要找到首次出现<em>错误</em>的地方,在gcc中添加<em>编译</em>选项可以使<em>编译</em>停止在第一次出现<em>错误</em>的地方:$ gcc -Wfatal-errors foo.c // GCC 4.0 and later $ g++ -Wfatal-errors foo.cpp $ g++ -fmax-errors=N foo.cpp
常见编译错误解决
<em>编译</em><em>错误</em>1:  goto 语句<em>错误</em> dtcp_ake_state_machine.c:742:1: error: jump to label ‘error_exit’ [-fpermissive]  error_exit:  ^ dtcp_ake_state_machine.c:706:14: error:   from here [-fpermissive]          goto
opencv常见编译错误
OpenCV的全称是:Open Source Computer Vision Library,于1999年由Intel建立,现在由Willow Garage提供支持。OpenCV是一个基于BSD许可证授权(开源)发行的跨平台计算机视觉库,可以运行在Linux、Windows和Mac OS操作系统上。它轻量级而且高效——由一系列 C 函数和少量 C++ 类构成,同时提供了Python、Ruby、MA
C++编译错误汇总(持续更新)
error C2061: 语法<em>错误</em>: 标识符“_TCHAR”         解决方法:添加一条 #include 即可成功<em>编译</em>
编译错误解决:implicit declaration of function 'close' is invalid in C99
<em>编译</em><em>错误</em>error: implicit declaration of function 'close' is invalid in C99 [-Werror,-Wimplicit-function-declaration] close(tfd); ^ 1 error generated.解决方案在出错的这个文件中添加头文件包含:#include
iis 错误 -2146232576
将mvc的网站部署到服务器上,运行时报错-2146232576,输出的报错内容里包含:roslyn、csc.exe等, window 2008 r2服务器确定安装了IIS所需要的一些组件,比如.net framework 4.0,.net framework 4.5等,因为其他的网站运行都正常。 网上查询了一下,很少有这方面的说明,只能自己排除问题,首先其他的网站为什么可以运行,开始查找项目创建
编译错误:若要在64位系统上使用,则必须更新此项目中的代码。。。。
在matlab中使用notebook时,出现如下<em>编译</em><em>错误</em>: 解决方案:将红色字体部分替换成以下内容即可#If Win64 Then Private Declare PtrSafe Sub sleepp Lib "kernel32.dll" Alias "Sleep" (ByVal dwMilliseconds As LongLong) Private Declare PtrSafe
常见的五个编译时异常和常见的五个编译时异常
常见的五个<em>编译</em>时异常:SQLException 、IOexception 、 FileNotFoundException 、 ClassNotFoundException 、 EOFException 、 IllegaArguementException  常见的五个RunTimeException异常:StringIndexOutOfBoundsException 、 ArrayInd
ACM之编译错误
1.Main函数必须返回int类型(正式比赛)2.不要在for语句中定义类型3.__int64不支持,可以用long long代替4.使用了汉语的标点符号5.itoa不是ansi函数,能将整数转换为字符串而且与ANSI标准兼容的方法是使用sprintf()函数        int num = 100;    char str[25];    sprintf(str, &quot; %d&quot; , num);6...
编译错误处理
1.<em>编译</em>报错信息 Caused by: Error: java.util.concurrent.ExecutionException: com.android.builder.internal.aapt.v2.Aapt2Exception: AAPT2 error: check logs for details at com.android.ide.common.res2.MergedResou...
编译错误error: invalid storage class
<em>编译</em><em>错误</em>error: invalid storage class2013年02月01日 09:54:41阅读数:5809昨天遇到一个莫名其妙的<em>编译</em><em>错误</em>,以前没有见过,而且代码流程看起来也没有太多的奇异之处。后来忍无可忍,百度了下,发现别人也有遇到这个<em>错误</em>的,他的解决方法是:少了“}”。嘿嘿,我开始跟踪每一个函数,终于找到了这个地方。对的。就是因为少了一个“}”。所以要注意了,仔细仔细哈。下面就是m...
C/C++编译错误代码大全
<em>编译</em>器<em>错误</em> C2001  <em>错误</em>消息                            常数中有换行符                           字符串常数不能继续到第二行,除非进行下列操作:                           •用反斜杠结束第一行。                          •用一个双引号结束第一行上的字符串,并在下一行用另一个双引号
inno setup编译报错:line 69 Identifier expected
下面是代码: if bInsForAllUser then RegWriteStringValue(HKEY_LOCAL_MACHINE, 'SYSTEM/CurrentControlSet/Cont
expected">Syntax error on token "default", Identifier expected
这个问题我百度大都是说:语法不正确,因为js的default这个我用的很少,这是我复制的一段代码,相关的js ,CSS我都已经引入了,但这里还是报错了,我没辙了,
关于expected identifier or ‘(’ before***的错误
今天早上在<em>编译</em>工程的时候,总是会报出<em>expected</em> identifier or ‘(’ before***的<em>错误</em>,查看了代码没有任何问题,后来又在网上找原因受到启发,原来是我的代码里有未被识别的字符,将那段字符注释掉就可以了,还好是小问题,写出来记录下自己曾经踩过的坑,防止再次出错。
expected identifier 报错怎么办?
多了一对[ ]。
程序员实用工具网站
目录 1、搜索引擎 2、PPT 3、图片操作 4、文件共享 5、应届生招聘 6、程序员面试题库 7、办公、开发软件 8、高清图片、视频素材网站 9、项目开源 10、在线工具宝典大全 程序员开发需要具备良好的信息检索能力,为了备忘(收藏夹真是满了),将开发过程中常用的网站进行整理。 1、搜索引擎 1.1、秘迹搜索 一款无敌有良心、无敌安全的搜索引擎,不会收集私人信息,保...
我花了一夜用数据结构给女朋友写个H5走迷宫游戏
起因 又到深夜了,我按照以往在csdn和公众号写着数据结构!这占用了我大量的时间!我的超越妹妹严重缺乏陪伴而 怨气满满! 而女朋友时常埋怨,认为数据结构这么抽象难懂的东西没啥作用,常会问道:天天写这玩意,有啥作用。而我答道:能干事情多了,比如写个迷宫小游戏啥的! 当我码完字准备睡觉时:写不好别睡觉! 分析 如果用数据结构与算法造出东西来呢? ...
别再翻了,面试二叉树看这 11 个就够了~
写在前边 数据结构与算法: 不知道你有没有这种困惑,虽然刷了很多算法题,当我去面试的时候,面试官让你手写一个算法,可能你对此算法很熟悉,知道实现思路,但是总是不知道该在什么地方写,而且很多边界条件想不全面,一紧张,代码写的乱七八糟。如果遇到没有做过的算法题,思路也不知道从何寻找。面试吃了亏之后,我就慢慢的做出总结,开始分类的把数据结构所有的题型和解题思路每周刷题做出的系统性总结写在了 Github...
asp.net程序设计教程 金旭亮 实例源码与基本素材下载
asp.net程序设计教程 金旭亮 实例源码与基本素材 相关下载链接:[url=//download.csdn.net/download/jasonchansj/3431759?utm_source=bbsseo]//download.csdn.net/download/jasonchansj/3431759?utm_source=bbsseo[/url]
COPC4.1简体中文版下载
COPC4.1,全中文,原版,PDF文档,适合呼叫中心等 相关下载链接:[url=//download.csdn.net/download/www700123/4997808?utm_source=bbsseo]//download.csdn.net/download/www700123/4997808?utm_source=bbsseo[/url]
MyMoonWarrior源码(一)下载
这个源码运行正确:功能是创建一个菜单和点击菜单进入游戏 相关下载链接:[url=//download.csdn.net/download/u012184326/8143555?utm_source=bbsseo]//download.csdn.net/download/u012184326/8143555?utm_source=bbsseo[/url]
相关热词 c# oracle 开发 c#选择字体大小的控件 c# usb 批量传输 c#10进制转8进制 c#转base64 c# 科学计算 c#下拉列表获取串口 c# 如何防止参数被修改 c#开发微信公众号例子 c# null
我们是很有底线的