shell 下面如何将PATH="/usr/gnu/bin:/usr/local/bin:/usr/ucb:/bin:/usr/bin"分解 [问题点数:0分]

Bbs1
本版专家分:0
结帖率 100%
#!/usr/bin/expect
NULL 博文链接:https://j2ee2009.iteye.com/blog/824829
误操作 /usr/bin/ld
求解答,rn最近在linux上误操作,执行了如下命令:rnsudo cp /home/bizhi/Desktop/libusb-compat-0.1.5/libusb/.libs/libusb.so /<em>usr</em>/<em>bin</em>/ldrn然后执行了 ll /<em>usr</em>/<em>bin</em>/ld*rnlrwxrwxrwx 1 root root 6 2013-05-24 16:56 ld -> ld.bfd*rn-rwxr-xr-x 1 root root 49410 2013-06-09 19:34 ld.bfd*rn-rwxr-xr-x 1 root root 5279 2011-10-05 06:06 ldd*rn-rwxr-xr-x 1 root root 1796268 2011-09-22 21:07 ld.gold*rn好像并没有被覆盖掉。rn但是我接着用 gcc 或者 g++编译时,就会出现了如下错误rnubuntu:~/test$ gcc a.c -o arncollect2: ld terminated with signal 11 [Segmentation fault]rna.c的源码如下rnrn#include rn#include rnint main(int argc,char *argv[])rnrn printf("test\n");rn return 0;rnrnrn因为之前gcc和g++是可以用的。不知道是不是由于我的误操作导致的,还是因为其他原因,请帮忙查看一下。谢谢!
#!/usr/bin/perl -w
#!/<em>usr</em>/<em>bin</em>/perl -w 这个-w是什么意思啊,有没有传入其他参数的,都分别是什么意思?
解释一下/usr/bin/env
      #!/<em>usr</em>/<em>bin</em>/env python 系统看到后,首先会到env设置里查找python的安装路径,再调用对应路径下的解析器 #!/<em>usr</em>/<em>bin</em>/python 告诉系统执行这个脚本的时候,调用/<em>usr</em>/<em>bin</em>下的python解析器       ...
usr/bin/ld 问题
大家好,我不小心覆盖了<em>usr</em>/<em>bin</em>/ld 文件,现在用g++可以编译 但是不能生成目标文件,请问大家如何才能恢复<em>usr</em>/<em>bin</em>/ld文件 或是 重新安装?????谢谢谢谢谢谢
“/usr/bin”的权限问题
今天安装一个程序,报错,提示如下:rncp: 无法创建一般文件“/<em>usr</em>/<em>bin</em>/cmsd”: 权限不够rnrn于是查看/<em>usr</em>/<em>bin</em>文件夹的权限,rndrwxr-xr-x 2 root root 61440 06-25 00:40 <em>bin</em>rnrn随便复制一个文件,到/<em>usr</em>/<em>bin</em>/,也报相同的错误。rnrn我重新make了一个文件夹,也是这个权限,经测试可以在他<em>下面</em>创建文件夹的。rnrn求高手指点
#!/usr/bin/perl
在 windows XP 下运行 perl 程序 #!/<em>usr</em>/<em>bin</em>/perl 这样写为什么不行 ? 怎么解决?
/usr/bin/yum: /usr/bin/python2.6: bad interpreter
redhat7.0更新了yum后报错n -bash: /<em>usr</em>/<em>bin</em>/yum: /<em>usr</em>/<em>bin</em>/python2.6: bad interpreter: No such filen n[root@<em>local</em>host <em>bin</em>]# whereis pythonnpython: /<em>usr</em>/<em>bin</em>/python2.6 /<em>usr</em>/<em>bin</em>/python /<em>usr</em>/lib/python2.7 /<em>usr</em>/lib/python2.6 /<em>usr</em>/lib64/python2.7 /<em>usr</em>/lib64/python2.6 /<em>usr</em>/include/python2.7 /<em>usr</em>/share/man/man1/python.1.gzn#vi yum改成nn#!/<em>usr</em>/<em>bin</em>/python2.6n还是不行nn执行了sudo ln -s /<em>usr</em>/<em>bin</em>/python2.6 /<em>usr</em>/<em>bin</em>/python
/usr/bin/ld:-lc解决方法
背景: 使用海思交叉编译器编译库文件中出现。 原因: ld表示连接,-lc表示需要连接libc.a。出现这个,说明需要的libc.a文件。 解决过程: 刚开始以为是海思交叉编译器的问题,便在安装目录find libc.a,找到很多个,排除这个原因;然后检查路径问题,发现路径也没问题。回想一下,虚拟机是mini安装,有可能没有安装libc.a,当前使用的虚拟机是centos mini6.6
修改 /usr/bin/java 的指向
修改 /<em>usr</em>/<em>bin</em>/java 的指向update-alternatives --install "/<em>usr</em>/<em>bin</em>/java" "java" "/<em>usr</em>/java/<em>bin</em>/java" 1 update-alternatives --config java
Error loading /usr/bin/sudo
大家好!rn 我在Ubuntu的命令行<em>下面</em>输入需要加sudo的指令时,终端总是提示:Error loading /<em>usr</em>/<em>bin</em>/sudo,请问这是怎么回事啊,如何解决,请高人指点,谢谢了!
/usr/bin/X11/X11/X11.........
问题描述:rn写了个程序, 递归查找。 谁知有些目录要用非常长的时间 ----------- 比如/<em>usr</em>/<em>bin</em>, 经过分析得知/<em>usr</em>/<em>bin</em> 下有个链接 X11 -> ./rn如此以来有个无穷循环了, 可是程序最终还是跳了出来, 我数了一下,X11/X11。。。。。。共有40层。 rnrn我的迷惑:rn1. 这个链接有什么用, 为什么要设置这个链接, 我能否给它删除。rn2. 为什么理论上有无数层 X11/X11....., 但是为什么最多达到40层
/usr/bin/ld 找不到 -lcuda
1,这是一个压缩文件,解压后名称应为libcuda.so,是cuda库中的一个重要文件。 2,这个文件用于不具备cuda显卡的电脑在ubuntu平台配置gpgpu-sim时,绕过因为找不到lcuda而无法顺利编译的错误,将其放在/<em>usr</em>/<em>local</em>/cuda/lib64下即可解决问题。
误删/usr/bin 下的所有文件
误删/<em>usr</em>/<em>bin</em> 下的所有文件 咋办? 这里面的文件都是一些程序的执行文件,没了它,好多命令都没用,比如 last,ssh 等等 solution: 用u盘 到其他的相同系统的/<em>usr</em>/<em>bin</em> ,把这个目录下的所有的东西 考到u盘,当然u盘的文件系统可能是fat 或ntfs 有些链接文件拷不出来,跳过,把能拷的考出来。 再把u盘插到服务器,这时会发现在/media下没看到u盘。 不要...
Mac下/usr/bin无权限
1.重启Mac,按住command + R,进入修复模式 2.选择 实用工具 -&gt; 终端,输入 csrutil disable 3.回车出现successful字样即可,表示权限已被修改。 恢复系统保护模式,再次上述操作,终端输入 csrutil enable 查看csrutil 状态: csrutil status ----------...
如何进入usr/local/bin目录?
我在终端里面输入cd ~/<em>usr</em>/<em>local</em>/<em>bin</em>,终端提示没有这个目录。即使是root用户也没用。操作系统是Ubuntu 12.10。请问应该如何进入这个目录。
/usr/bin下面奇怪的命令识别问题
从百问网下载了dnw工具,放在Ubuntu下执行,报了错误bash: /<em>usr</em>/<em>bin</em>/dnw: 没有那个文件或目录。这个命令能够自动补全,也设置了可执行权限。有些百思不得其解,上网百度了一下,原来是在Ubuntu64位环境下因其缺乏相应的32位运行库导致出错,需要安装ia32-libs库。运行命令sudo apt-get install ia32-libs,提示的信息如下:再次运行命令sudo a
请问:我发现如果在/usr/local/bin 与/usr/bin下都有同一个执行文件时,当在shell下执行时,只会执行/usr/local/bin,下的,怎么改过来?
而别人的机子上只会执行/<em>usr</em>/<em>bin</em>下的,不一样rn怎样改啊?,改profile吗,rn请赐教 
/bin/sh /usr/bin/safe_mysqld --defaults-file=/etc/my.
linux下mysql这个/<em>bin</em>/sh /<em>usr</em>/<em>bin</em>/safe_mysqld --defaults-file=/etc/my.经常死掉是什么原因?正常时是KILL也KILL不掉的。但不正常时,/etc/rc.d/init.d/mysqld start或service mysqld restart都启不来,必须重启系统才能启动。
(菜鸟之路)/bin和/usr/bin下的内容有差别吗?
/<em>bin</em>和/<em>usr</em>/<em>bin</em>rn/s<em>bin</em>和/<em>usr</em>/s<em>bin</em>rn内容有差别吗?rn是否其中一个为副本?rnrn知道的大虾能详细解释下吗?
linux crontab不执行 `/usr/bin:/bin': not a valid identifier
crontab 不自动执行,手动执行没有问题。rn于是我在sh文件中加入export $<em>PATH</em>rnrnexport $<em>PATH</em>rnsource /etc/profilernant syncAllrnrn/sync.sh: line 3: export: `/<em>usr</em>/<em>bin</em>:/<em>bin</em>': not a valid identifierrn请看我的$<em>PATH</em>,<em>PATH</em>里面没有这个“/<em>usr</em>/<em>bin</em>:/<em>bin</em>”啊。为什么呢?rnecho $<em>PATH</em>rn/<em>usr</em>/<em>local</em>/ant/<em>bin</em>:/<em>usr</em>/java/jrrt-3.1.0-1.6.0/<em>bin</em>:/<em>usr</em>/kerberos/s<em>bin</em>:/<em>usr</em>/kerberos/<em>bin</em>:/<em>usr</em>/<em>local</em>/s<em>bin</em>:/<em>usr</em>/<em>local</em>/<em>bin</em>:/s<em>bin</em>:/<em>bin</em>:/<em>usr</em>/s<em>bin</em>:/<em>usr</em>/<em>bin</em>:/<em>usr</em>/X11R6/<em>bin</em>:/root/<em>bin</em>:/root/servers/dstat-0.6.6rnline 5: ant: command not found
-bash: /usr/bin/top: Input/output error
AS4 重装LINUX后,上去一切正常,但是过了一会后,再上去,运行一些基本命令,如setup top reboot 都会提示错误,具体错误如下, rn[root@hawkco ~]# top rn'vt100': unknown terminal type. rn[root@hawkco ~]# reboot rn-bash: /s<em>bin</em>/reboot: 杈撳叆/杈撳嚭閿欒 rn[root@hawkco ~]# setup rn-bash: /<em>usr</em>/s<em>bin</em>/setup: 杈撳叆/杈撳嚭閿欒 rnrn这个乱码的意思是 输入或输出错误rn如,-bash: /<em>usr</em>/<em>bin</em>/top: Input/output errorrnrn然后手动重启下机器又会好,但是过了一会又是如此。后来觉得硬盘有问题,就换了个全新的,但是装完系统后还是这样的情况,这到底怎么回事呢?权限上的问题吗?rn
/usr/bin/X 占CPU很高
mm@R1- ~/var/log $ iostatrnLinux 2.6.38-gentoo-r6 (MULTIVEND1123) 07/13/2012 _i686_ (2 CPU)rnrnavg-cpu: %user %nice %system %iowait %steal %idlern 10.75 0.00 2.37 0.71 0.00 86.17rnrnDevice: tps kB_read/s kB_wrtn/s kB_read kB_wrtnrnsda 3.23 3.36 27.09 622114 5019720rnrnmm@R1- ~/var/log $ uptimern 21:24:32 up 2 days, 3:27, 4 users, load average: 2.20, 1.92, 1.43rnrnmm@R1- ~/var/log $ vmstatrnprocs -----------memory---------- ---swap-- -----io---- -system-- ----cpu----rn r b swpd free buff cache si so bi bo in cs us sy id warn 3 0 1196 268356 418896 644276 0 0 2 14 11 68 11 2 86 1rnrnmm@R1- ~/var/log $ free -mrn total used free shared buffers cachedrnMem: 2021 1762 259 0 409 629rn-/+ buffers/cache: 724 1297rnSwap: 2096 1 2095rnrnmm@R1- ~/var/log $ grep MemTotal /proc/meminfornMemTotal: 2070520 kBrnrnmm@R1-A007 ~/var/log $ grep MemFree /proc/meminfornMemFree: 267992 kBrnrnmm@R1-A007 ~/var/log $ cat /proc/loadavgrn1.90 1.94 1.67 3/205 16899rn PID USER PR NI VIRT RES SHR S %CPU %MEM TIME+ COMMANDrn 1072 mm 20 0 299m 228m 18m S 101 11.3 44:22.93 /home/gui/<em>bin</em>/python /home/gui/gui.py -display :0 -style windowsrn 2230 root 20 0 629m 336m 3408 R 95 16.6 337:28.88 /<em>usr</em>/<em>bin</em>/X :0 -audit 0 +extension XEVIE -auth /var/gdm/:0.Xauth -nolisten tcp vt7rnrnrn这个时候看到gui.py占cpu也很高,可以肯定是gui.py引起的,但是gui.py并不是每次都占cpu很高。rnrn从log来看一切都很正常,有什么方法可以调试吗?rn我已经没招了。rnrn
报错信息/usr/bin/ld: cannot find -lclntsh
程序没有任何问题,编译提示:rnrn/<em>usr</em>/<em>bin</em>/ld: cannot find -lclntshrnrnrn在makefile中查看rnrnLDFLAGS=-L$(ORACLE_HOME)/rdbms/lib32 -L$(ORACLE_HOME)/lib32 rnLLIBPSO=`cat $(ORACLE_HOME)/rdbms/lib32/psoliblist`rnrnrn在Oracle路径中,是有这个so文件的 ---- libclntsh.so rnrnoracle路径:/home/oracle/product/db1/lib32rnrn请问是什么原因造成的。如何解决,谢谢。
/usr/bin/ld: cannot find -lncurses
1: Install: out/host/linux-x86/<em>bin</em>/dalvikrnInstall: out/host/linux-x86/<em>bin</em>/ctsrn/<em>usr</em>/<em>bin</em>/ld: cannot find -lncursesrncollect2: ld returned 1 exit stat<em>usr</em>nmake: *** [out/host/linux-x86/obj/EXECUTABLES/adb_intermediates/adb] Error 1rn=>不知道为什么ubuntu12.04编译android4.0.1_r1总是出现这个问题;我第一编译完全通过了;再编译就一直在这个问题;网上说;rn=〉$ sudo apt-get install libncurses5-devrn=>Reading package lists... DonernBuilding dependency tree rnReading state information... Donernlibncurses5-dev is already the newest version.rn0 upgraded, 0 newly installed, 0 to remove and 23 not upgraded.rn我主机显示明明是最新版本了;……期待解决;
/usr/bin/ld: cannot find -ltcl
[oracle@tmlhcopy DataServer]$ makern/<em>usr</em>/<em>bin</em>/g++ -D_NETPBX_USE_CPP_ -g -I/<em>usr</em>/include -c SocketBase.cpprn/<em>usr</em>/<em>bin</em>/g++ -D_NETPBX_USE_CPP_ -g -I/<em>usr</em>/include -c TcpSocket.cpprn/<em>usr</em>/<em>bin</em>/g++ -D_NETPBX_USE_CPP_ -g -I/<em>usr</em>/include -c Thread.cpprn/<em>usr</em>/<em>bin</em>/g++ -D_NETPBX_USE_CPP_ -g -I/<em>usr</em>/include -c SocketThread.cpprn/<em>usr</em>/<em>bin</em>/g++ -D_NETPBX_USE_CPP_ -g -I/<em>usr</em>/include -c csvrmain.cpprn/<em>usr</em>/<em>bin</em>/g++ -D_NETPBX_USE_CPP_ -g -I/<em>usr</em>/include -c csvrdb.cpprnIn file included from /<em>usr</em>/lib/gcc/i386-redhat-linux/3.4.3/../../../../include/c++/3.4.3/backward/iostream.h:31,rn from csvrdb.cpp:220:rn/<em>usr</em>/lib/gcc/i386-redhat-linux/3.4.3/../../../../include/c++/3.4.3/backward/backward_warning.h:32:2: warning: #warning This file includes at least one deprecated or antiquated header. Please consider using one of the 32 headers found in section 17.4.1.2 of the C++ standard. Examples include substituting the headerfor the header for C++ includes, or instead of the deprecated h eader . To disable this warning use -Wno-deprecated.rn/<em>usr</em>/<em>bin</em>/g++ -D_NETPBX_USE_CPP_ -g -I/<em>usr</em>/include -c csvrsvr.cpprn/<em>usr</em>/<em>bin</em>/ld: cannot find -ltclrncollect2: ld returned 1 exit stat<em>usr</em>nmake: *** [db8800.r] Error 1rn[oracle@tmlhcopy DataServer]$rnMAKE时的错误。那个能看看,,,,帮忙
Mac OSX10.11更新后sudo竟然不能写/bin,/usr/bin /usr/sbin等系统目录了。
做了一个脚本,调试成功后 sudo mv到/<em>usr</em>/s<em>bin</em>目录下,竟然提示 Operation not permitted以为是自己的系统权限设置错误,其它机器上一试,都是之样了。只能放到 /<em>usr</em>/<em>local</em>/<em>bin</em>目录下。当然强制修改权限肯定可以,可是默认的sudo竟然不能操作了。
Qt5.7.1下编译时出现的“/usr/bin/ld: 找不到 -lx264”,“/usr/bin/ld: 找不到 -lx265”的解决方法
环境 系统:Ubuntu16.04 Qt版本:5.7.1 问题描述 Qt在编译运行与FFmepg库相关的项目时,报错“/<em>usr</em>/<em>bin</em>/ld: 找不到 -lx264”,“/<em>usr</em>/<em>bin</em>/ld: 找不到 -lx265”,但实际上在本机中时可以找到相关的文件的,报错信息中出现了”-l“,这一般指的是链接出错,所以只要找到相应的”.so“文件,创建链接到相应的位置即可。 解决办法 ...
gcc -B/usr/bin -B的含义
CC="gcc -B/<em>usr</em>/<em>bin</em>" ../sources/<em>bin</em>utils-2.17/configure rn中的 -B什么含义啊,我查过bash手册里面只说了单独的 -B 是 括号扩展的意思rn-B/<em>usr</em>/<em>bin</em>连在一起是什么意思啊,这是一个什么语法现象呢。。
export LD_ASSUME_KERNEL=2.2.5 and . /usr/i386-glibc21-linux/bin/i386-glibc21-linux-env.sh
export LD_ASSUME_KERNEL=2.2.5 and . /<em>usr</em>/i386-glibc21-linux/<em>bin</em>/i386-glibc21-linux-env.sh rnrn怎么理解?rn是在pro
mac 操作 修改 usr/bin 目录权限
修改 <em>usr</em>/<em>bin</em> 目录权限 1)重启,过程中按住 command+R,进入保护模式,点击实用工具 2)打开terminal终端,输入 csrutil disable 3)再次重启,即可对 <em>usr</em>/<em>bin</em> 目录下文件进行修改 如果要恢复保护机制,重新进入保护模式,输入 csrutil enable ...
/usr/bin/ld: cannot find -ltermcap
我在make的时候出现以下错误信息:rngcc -g -L.. -L./lib/termcap -o fileman fileman.o ../libreadline.a -ltermcaprn/<em>usr</em>/<em>bin</em>/ld: cannot find -ltermcaprncollect2: ld 返回 1rnmake: *** [fileman] 错误 1rn请教各位高手如何解决rn系统:ubuntu9.0.4
解决: Mac的usr/bin 无法修改
解决方案: 查看 链接:Mac SIP系统完整性保护如何关闭启动启用教程
qt编译出错 /usr/bin/ld 找不到 -lGL
第一次使用Qt,编译过程出现以下错误: /<em>usr</em>/<em>bin</em>/ld: 找不到 -lGL上网找到这篇博客:http://blog.csdn.net/u010159842/article/details/56833030 虽然他出错的编译器不同,不过原因一样:~$ locate libGL.so /<em>usr</em>/lib/i386-linux-<em>gnu</em>/mesa/libGL.so.1 /<em>usr</em>/lib/i386
关于archlinux误删/usr/bin/ld的解决办法
今天手滑,不小心把/<em>usr</em>/<em>bin</em>/ld删除了,结果运行gcc的时候总是报段错误。查了一大圈资料,得到了解决办法。 重新安装<em>bin</em>utils即可。具体命令: sudo pacman -S <em>bin</em>utils 安装成功之后,gcc可以正常使用了。 ...
有效的方法解决mac误删/usr/bin
如果你通过sudo误删了/<em>usr</em>/<em>bin</em>下的所有文件,并且有没有备份,那你的内心一定是崩溃的。你的很多命令使用不了了,如果你是新手可以跟着我说的一步一步做,保证恢复,你需要的材料只是另一台跟你相同系统的健康的机器。 我先说原理再说操作: 原理是从“健康”的电脑拷贝/<em>usr</em>/<em>bin</em>到你的电脑并修复权限即可,但因为 <em>bin</em><em>下面</em>有很多符号链接文件,cp命令会复制链所指向的文件,而我们需要的是链接文件
编译android源码错误:/usr/bin/ld…
编译时出现/<em>usr</em>/<em>bin</em>/ld: skipping incompatible /<em>usr</em>/lib/gcc/x86_64-linux-<em>gnu</em>/4.4.5/../../../libz.so when searching for -lz错误============================================ PLATFORM_VERSION_CODENAME=AOSP PLATFOR
/usr/bin/ld: cannot find -lssl
cyrus-imap 安装问题!rnrnroot@192 imap]# make installrngcc -c -I../../lib -D_REENTRANT -D_GNU_SOURCE -DTHREADS_HAVE_PIDS -DDEBUGGING -fno-strict-aliasing -I/<em>usr</em>/<em>local</em>/include -D_LARGEFILE_SOURCE -D_FILE_OFFSET_BITS=64 -I/<em>usr</em>/include/gdbm -O2 -march=i386 -mcpu=i686 -g -DVERSION=\"1.00\" -DXS_VERSION=\"1.00\" -fPIC "-I/<em>usr</em>/lib/perl5/5.8.0/i386-linux-thread-multi/CORE" -DPERL_POLLUTE IMAP.crnRunning Mkbootstrap for Cyrus::IMAP ()rnchmod 644 IMAP.bsrnrm -f blib/arch/auto/Cyrus/IMAP/IMAP.sornLD_RUN_<em>PATH</em>="/<em>usr</em>/<em>local</em>/lib:/lib" gcc -shared -L/<em>usr</em>/<em>local</em>/lib IMAP.o -o blib/arch/auto/Cyrus/IMAP/IMAP.so ../../lib/libcyrus.a -lsasl2 -lssl -lcrypto rn/<em>usr</em>/<em>bin</em>/ld: cannot find -lsslrncollect2: ld returned 1 exit stat<em>usr</em>nmake: *** [blib/arch/auto/Cyrus/IMAP/IMAP.so] Error 1rn出现错误不知道如何解决!
无法使用命令 /usr/bin/xdpyinfo
正在启动 Oracle Universal Installer...rnrn检查临时空间: 必须大于 80 MB。 实际为 4399 MB 通过rn检查交换空间: 必须大于 150 MB。 实际为 999 MB 通过rn检查监视器: 监视器配置至少必须显示 256 种颜色rn >>> 无法使用命令 /<em>usr</em>/<em>bin</em>/xdpyinfo 自动检查显示器颜色。请检查是否设置了 DISPLAY 变量。 未通过 <<<>> 忽略未通过的必需先决条件。继续...rn准备从以下地址启动 Oracle Universal Installer /tmp/OraInstall2013-01-01_08-55-51PM. 请稍候...rnrnrn各位,求解。。。
Linux下/usr/bin/python被删除的后果
可能部分的人使用linux都有直接root登陆的习惯,这有很大的便利性,因为很多的命令不需要使用sudo请求root权限。但是使用root权限,所有的命令都会立即被执行,即使这个命令是对系统有害处的。 我们还知道,Linux下自带的有python,很多人不会利用里面的python,因为版本略低,但是在这里需要重点说明一下:Linux的内部命令是与python有依赖性的,而这个依赖性也就体现在低版本
/usr/bin/ld: 找不到 -lgcc_s怎么办?
解决问题的步骤 在本地电脑上查找是否有这个库文件 sudo find /<em>usr</em>/ -name libgcc_s.so 结果如下所示 /<em>usr</em>/lib/gcc/x86_64-linux-<em>gnu</em>/7/32/libgcc_s.so /<em>usr</em>/lib/gcc/x86_64-linux-<em>gnu</em>/7/libgcc_s.so /<em>usr</em>/lib/gcc/x86_64-linux-<em>gnu</em>/7/x32/libgcc...
/usr/bin/ld: cannot find -lcutil
我的样本代码在/opt/NVIDIA_GPU_Computing_SDK/C/src/rn里面,我在这个里面直接sudo make 可以生成相应的可执行文件。rn但是我把 整个 deviceQuery这个文件夹拷贝到 ~/rn我的根目录下,发现提示rn/<em>usr</em>/<em>bin</em>/ld: cannot find -lcutil rnrn我在我的/opt/NVIDIA_GPU_Computing_SDK/C/lib 目录中rn可以找到libcutil.a文件rnrn请教怎么解决,谢谢
/usr/bin/ld:cannot find -lbootstrap
在交叉编译qt-everywhere 4.7的./configure后,rn第一次make是报出这个错误rn/<em>usr</em>/<em>bin</em>/ld:cannot find -lbootstraprncollect2:ld returned 1 exit stat<em>usr</em>nmake[1]: *** [../../<em>bin</em>/lrelease]Error 1rnrn不知道,哪位大哥,能不能提供些解决方案了
#!/usr/bin/env 脚本解释程序的作用
#!/<em>usr</em>/<em>bin</em>/env 在linux的一些bash的脚本,需在开头一行指定脚本的解释程序,如: #!/<em>usr</em>/<em>bin</em>/env python 再如: #!/<em>usr</em>/<em>bin</em>/env perl #!/<em>usr</em>/<em>bin</em>/env zimbu #!/<em>usr</em>/<em>bin</em>/env ruby 但有时候也用 #!/<em>usr</em>/<em>bin</em>/python 和 #!/<em>usr</em>/<em>bin</em>/perl 那么 env到底...
/usr/bin/ld: cannot find -lcutil_i386
急,急。。。。。rnrn刚刚装完SDK的包,之后执行src里面的程序,使用make编译时,提示/<em>usr</em>/<em>bin</em>/ld: cannot find -lcutil_i386rn错误,请问是什么原因呢..
/usr/bin/ld: cannot find -l:libjpeg.so.8.3.0
在摄像头采集完图像后采用libjpeg库将内存中的JPEG图像转换为BMP图像进行后续处理,但是在编译程序时出现了rn /<em>usr</em>/<em>bin</em>/ld: cannot find -l:libjpeg.so.8.3.0rn collect2: ld returned 1 exit stat<em>usr</em>nrn 的错误,我安装了libjpeg库,该路径下也有libjpeg.so.8.3.0.百度了但是一直没有解决,论坛里的朋友们遇到过这样的问题吗?请大家帮帮忙,卡了好几天了,不胜感激
【linux编译】/usr/bin/ld: ...错误
编译出错:rn/<em>usr</em>/<em>bin</em>/ld: skipping incompatible ./xerces-c-src2_1_0/lib/libxerces-c.so when searching for -lxerces-crn/<em>usr</em>/<em>bin</em>/ld: cannot find -lxerces-crncollect2: ld returned 1 exit stat<em>usr</em>nmake: *** [h2482] Error 1rnrn找这个文件rnfile ./xerces-c-src2_1_0/lib/libxerces-c.sornrn./xerces-c-src2_1_0/lib/libxerces-c.so: ELF 64-bit LSB shared object, x86-64, version 1 (SYSV), dynamically linked, not strippedrnrn然后rnuname -arnLinux ubuntu 2.6.38-8-generic #42-Ubuntu SMP Mon Apr 11 03:31:50 UTC 2011 i686 i686 i386 GNU/Linuxrnrn在能编译过的机器上输入同样的命令rn发现rnuname -arnLinux <em>local</em>host.<em>local</em>domain 2.6.32-71.el6.x86_64 #1 SMP Wed Sep 1 01:33:01 EDT 2010 x86_64 x86_64 x86_64 GNU/Linuxrnrn我郁闷了。64位和32位系统。rnrn我这个错误是不是由于系统原因引起的。是的话怎么决绝rn求教rnrn
/usr/bin/ld: cannot find -lmysqlclient
linux c连接mysql,我已经正确安装了mysql开发包,mysql库目录为/<em>usr</em>/lib/mysql,当我通过gcc -o mysql mysql.c -lmysqlclient编译程序时出现/<em>usr</em>/<em>bin</em>/ld: cannot find -lmysqlclient错误,然后我将/<em>usr</em>/lib/mysql目录添加到LD_LIBRARY_<em>PATH</em>环境变量中,继续执行,出现同样的问题,将/<em>usr</em>/lib/mysql添加到 /etc/ld.so.conf中,然后执行ldconfig命令,还是出现同样的问题,gcc -o mysql mysql.c -lmysqlclient -L /<em>usr</em>/lib/mysql/这样执行就可以了,或者ln -s /<em>usr</em>/lib/mysql/libmysqlclient.so /<em>usr</em>/lib/libmysqlclient.so,然后gcc -o mysql mysql.c -lmysqlclient也时可以的。rnrnrn上面就是我遇到的情况,我命名将/<em>usr</em>/lib/mysql添加到系统环境变量,也通过ldconfig导入共享库了(难道没有导入成功?怎么查看是否成功),可为什么编译的时候还必须指定共享库的路径呢?求高人指点~~~
usr/bin/ld: cannot find -ly"">编译错误 "/usr/bin/ld: cannot find -ly"
如题,make一个源码包时出现 “/<em>usr</em>/<em>bin</em>/ld: cannot find -ly”错误,请问ly是哪个库文件,到哪下载啊?
编译错误:/usr/bin/ld: cannot find -lldap50
编译错误:/<em>usr</em>/<em>bin</em>/ld: cannot find -lldap50rncollect2: ld returned 1 exit stat<em>usr</em>nrn我在/<em>usr</em>/<em>bin</em>/ <em>下面</em>找到ld。但是没有这个所谓的 lldap50 这是什么东西啊,在哪可以找到?rnrn我的makefile 文件如下: rnLIBNAME= libtdldaprnHEADERDIR= ../../includernLIBLDAPDIR= ../../librnrn#CXXFLAGS= $(CFLAGS) -Wno-error -Wno-unused -Wl,-BdynamicrnCXXFLAGS= $(CFLAGS)rnrnCXXFLAGS+= -I$(HEADERDIR) rnrnLDFLAGS+= -L$(LIBLDAPDIR) rnrnrnPROGS= tdldap ldaperror ldapattribute ldapentryrnrnrnobjs= tdldap.o ldaperror.o ldapattribute.o ldapentry.ornall: $(PROGS)rn rn $(CXX) -g -shared -lc -Wall -o $(LIBNAME).so $(objs) rn ar rcs $(LIBNAME).a $(objs)rn# $(CXX) -g -o test test.cpp $(CXXFLAGS) $(LDFLAGS) -L. -lldap50 -lpthread -ltdldap -lgstring -l<em>bin</em>data -I.rn $(CXX) -o ldapattrtest ldapattrtest.cpp $(CXXFLAGS) $(LDFLAGS) -L. -lldap50 -lpthread -ltdldap -lgstring -l<em>bin</em>data -I.rn $(CXX) -o ldapentrytest ldapentrytest.cpp $(CXXFLAGS) $(LDFLAGS) -L. -lldap50 -lpthread -ltdldap -lgstring -l<em>bin</em>data -I.rn $(CXX) -g -o test test.cpp $(CXXFLAGS) $(LDFLAGS) -L. -lldap50 -lpthread -ltdldap -lgstring -l<em>bin</em>data -I.rnrn$(PROGS): % : %.cpprnrn $(CXX) -g -c -shared -Wall -fpic -g $@.cpp $(CXXFLAGS) $(LDFLAGS) rnrn.PHONY: submakernrnclean: rn rm -f *.orn rm -f $(LIBNAME).sorn rm -f $(LIBNAME).arn rm -f ldapattrtest ldapentrytest testrn
#! /usr/bin/env在脚本中的作用
#!/<em>usr</em>/<em>bin</em>/env  在linux的一些bash的脚本,需在开头一行指定脚本的解释程序,如:  #!/<em>usr</em>/<em>bin</em>/env python  再如:  #!/<em>usr</em>/<em>bin</em>/env perl  #!/<em>usr</em>/<em>bin</em>/env zimbu  #!/<em>usr</em>/<em>bin</em>/env ruby  但有时候也用  #!/<em>usr</em>/<em>bin</em>/python  和  #!/<em>usr</em>/<em>bin</em>/perl
ubuntu系统误删/usr/bin/ld文件
sudo apt install dlocate$ dlocate /<em>usr</em>/<em>bin</em>/ld<em>bin</em>utils: /<em>usr</em>/<em>bin</em>/ld.gold<em>bin</em>utils: /<em>usr</em>/<em>bin</em>/ld.bfd<em>bin</em>utils: /<em>usr</em>/<em>bin</em>/ldlibc-<em>bin</em>: /<em>usr</em>/<em>bin</em>/lddsudo apt-get install --reinstall <em>bin</em>utils
su - root的时候出现-bash: /iprscan/bin/Linux:/usr/local/genome/iprscan:/usr/local/genome/iprscan/bin: No such file or directory
su - root的时候出现-bash: /iprscan/<em>bin</em>/Linux:/<em>usr</em>/<em>local</em>/genome/iprscan:/<em>usr</em>/<em>local</em>/genome/iprscan/<em>bin</em>: No such file or directoryrn不知道是什么原因
Cacti不出图,查看日志报错为:/usr/local/bin/rrdtool: /usr/local/lib/libpng12.so.0: no versio
这个问题折腾好些天了,就是找不到答案,请各位大虾帮忙啊。rnCacti处于debug模式,具体的报错信息如下:rnRRDTool Command:rnrn/<em>usr</em>/<em>local</em>/<em>bin</em>/rrdtool graph - \rn--imgformat=PNG \rn--start=-86400 \rn--end=-300 \rn--title="Localhost - Processes" \rn--base=1000 \rn--height=120 \rn--width=500 \rn--alt-autoscale-max \rn--lower-limit=0 \rn--vertical-label="processes" \rn--slope-mode \rn--font TITLE:12: \rn--font AXIS:8: \rn--font LEGEND:10: \rn--font UNIT:8: \rnDEF:a="/<em>usr</em>/<em>local</em>/apache/htdocs/cacti/rra/<em>local</em>host_proc_7.rrd":proc:AVERAGE \rnDEF:b="/<em>usr</em>/<em>local</em>/apache/htdocs/cacti/rra/<em>local</em>host_proc_7.rrd":proc:MAX \rnAREA:a#F51D30FF:"Running Processes" \rnGPRINT:a:LAST:"Current\:%8.0lf" \rnGPRINT:a:AVERAGE:"Average\:%8.0lf" \rnGPRINT:b:MAX:"Maximum\:%8.0lf" rnrnRRDTool Says:rnrn/<em>usr</em>/<em>local</em>/<em>bin</em>/rrdtool: /<em>usr</em>/<em>local</em>/lib/libpng12.so.0: no version information available (required by /<em>usr</em>/<em>local</em>/rrdtool/lib/librrd.so.2)rn
Mac下怎么将/usr/local/mysql/bin/添加到环境变量
打开终端,输入: sudo vim ~/.bash_profile(执行root权限,当前用户的根目录下的.bash_profile) 然后在里面输入: export <em>PATH</em>=$<em>PATH</em>:/<em>usr</em>/<em>local</em>/mysql/<em>bin</em> 按ESC,然后输入: :wq source ~/.bash_profile(重新加载)
/usr/local/arm/arm-2007q1/bin/../lib/gcc/arm-none-linux-gnueabi/4.2.0/../../../.
/<em>usr</em>/<em>local</em>/arm/arm-2007q1/<em>bin</em>/../lib/gcc/arm-none-linux-<em>gnu</em>eabi/4.2.0/../../../../arm-none-linux-<em>gnu</em>eabi/<em>bin</em>/ld: skipping incompatible /<em>usr</em>/<em>local</em>/qwt-6.0.1/lib/libqwt.so when searching for -lqwtrn/<em>usr</em>/<em>local</em>/arm/arm-2007q1/<em>bin</em>/../lib/gcc/arm-none-linux-<em>gnu</em>eabi/4.2.0/../../../../arm-none-linux-<em>gnu</em>eabi/<em>bin</em>/ld: cannot find -lqwtrncollect2: ld returned 1 exit stat<em>usr</em>nmake: *** [qwt1] 错误 1rnrn移植qwt时遇到问题,求高手指教!
usr/local/bin/zsh"没有文件或目录问题">"/usr/local/bin/zsh"没有文件或目录问题
本人正在学linux 装ubuntu 16.04后按网上教程 安装zsh后发现无法root  显示: /<em>usr</em>/<em>local</em>/<em>bin</em>/zsh 没有文件或目录 百度了一下需要更改 /etc/passwd 第一项"root:x:0:0:root:/root:/<em>usr</em>/<em>local</em>/<em>bin</em>/zsh"中正确的"zsh目录"  我的zsh目录是"/<em>usr</em>/<em>bin</em>/zsh" 所以应改为"root:x:0:0:
/usr 的由来及/usr目录结构
linux 文件结构中,有一个很神奇的目录 —— /<em>usr</em>。之前一直没有怎么关注过它,反正程序都是安装在里边的,也没有什么值得追根溯源的东西。直到有一天 fedora 要简化整个文件系统体系,看到讨论才想到,<em>usr</em> 到底是什么的缩写呢,它又是怎么来的呢? 本文转自Delectat.com 讨论中,大部分观点认为: •<em>usr</em> 是 unix system resources 的缩写; ...
/usr/bin/hdfs: 行 35: /usr/bin/../libexec/hdfs-config.sh: 没有那个文件或目录 什么原因,怎么解决。谢谢
root@igmainc-P65-67RSRP:/<em>usr</em>/<em>local</em>/hadoop/etc/hadoop# hdfs namenode -formatrn/<em>usr</em>/<em>bin</em>/hdfs: 行 35: /<em>usr</em>/<em>bin</em>/../libexec/hdfs-config.sh: 没有那个文件或目录rn/<em>usr</em>/<em>bin</em>/hdfs: 第 305 行: exec: : 未找到rnrn我hdfs加软链接了rn配置文件是按照 http://www.jianshu.com/p/6b37cec76439 配置的rnjdk环境为9.0
linux下make是出错:/usr/bin/ld: cannot find -lqt-mt
red hat linux2.4版本rn在使用QT时,qmake -project、qmake都好着rn但make编译时出错了,rnrng++ -c -pipe -Wall -W -O2 -march=i386 -mcpu=i686 -g -DGLX_GLXEXT_LEGACY -fno-use-cxa-atexit -fno-exceptions -DQT_NO_DEBUG -I/<em>usr</em>/lib/qt-3.1/mkspecs/default -I. -I. -I/home/liu/arm2410s/qt-2.3.10/include -o hello.o hello.cpprng++ -o hello hello.o -L/home/liu/arm2410s/qt-2.3.10/lib -L/<em>usr</em>/X11R6/lib -lqt-mt -lXext -lX11 -lmrnrn/<em>usr</em>/<em>bin</em>/ld: cannot find -lqt-mtrnrncollect2: ld returned 1 exit stat<em>usr</em>nmake: *** [hello] Error 1rn[root@<em>local</em>host hello]# lsrnhello.cpp hello.o hello.pro Makefilern求指点是哪出错了,怎么解决啊
#!/usr/bin/ python 如何在Linux系统下运行python代码
  方法一: 1、在Linux系统下创建一个test.py文件 print(123) 2、Python test.py 方法二: 1、在Linux系统下创建一个test.py文件 #!/<em>usr</em>/<em>bin</em>/ python print(123) 2、执行,会出现 bash: ./test.py: Permission denied 表示权限不够,此时Python文件还属于不可执...
/usr/bin/ld: cannot find -lX11 如何解决?
请高人指点。。。先谢过了
服务器上有很多/usr/bin/script xxx.log的解决办法
删掉 /etc/profile.d/user_script.sh  脚本 /<em>usr</em>/<em>bin</em>/scirpt 这个进程就是user_script.sh 这个脚本启的进程,是一个对普通用户操作监控 如果要停掉这个进程,把 /etc/profile.d/user_script.sh  这个脚本删掉or重命名
/usr/bin/g++ -c logftp_src/FtpClient.cpp -o logftp_src/FtpClient.o -Ilogftp_src
/<em>usr</em>/<em>bin</em>/g++ -c logftp_src/FtpClient.cpp -o logftp_src/FtpClient.o -Ilogftp_src -Iinclude_extrn/<em>usr</em>/<em>bin</em>/g++ -c logftp_src/main.cpp -o logftp_src/main.o -Ilogftp_src -Iinclude_extrn/<em>usr</em>/<em>bin</em>/g++ -o log_ftp logftp_src/FtpClient.o logftp_src/main.o -Llib/ -llog4cpp -lm -ldl -Wl -Bdynamic -lgcc_srnlib//liblog4cpp.a: could not read symbols: »ûÐεĹ鵵rncollect2: ld returned 1 exit stat<em>usr</em>nmake: *** [log_ftp] Error 1rn
关于/usr/bin/ld: cannot find -lpthread问题
写了一个基于udp的聊天室服务器,在makefile中编译时候出现了奇葩的错误cannot find -lpthread。rn网上说这类问题一般是没有那个动态库或者静态库,但是pthread库不是linux自带的吗?rnrn错误:rng++ -o udp_server server.o udp_server.o data_pool.o my_json.o udp_data.o -L/home/lee/Test/udp_chat/server/../json_lib/lib -L/<em>usr</em>/lib/ -ljson -static -lpthread rn/<em>usr</em>/<em>bin</em>/ld: cannot find -lpthreadrnrn还有去到/<em>usr</em>/lib/下也有.so文件rn[code=c]rn[lee@<em>local</em>host lib]$ cat libpthreadrnlibpthread_nonshared.a libpthread.so libpthread.so.1rn[lee@<em>local</em>host lib]$ cat libpthreadrn[/code]rnrn补充一下:我的系统是centosrn我是Linux新手,求大神指导[img=https://forum.csdn.net/PointForum/ui/scripts/csdn/Plugin/003/monkey/5.gif][/img]
/usr/bin/ld: .libs/dev2gif.o: Relocations in generic ELF (EM: 40)
我用arm-none-linux-<em>gnu</em>eabi-gcc做交叉编译器,可总是编译不过去,错误提示如下:rnrngcc -shared .libs/dev2gif.o .libs/dgif_lib.o .libs/egif_lib.o .libs/gif_err.o .libs/gif_font.o .libs/gif_hash.o .libs/gifalloc.o .libs/qprintf.o .libs/quantize.o -Wl,-soname -Wl,libgif.so.4 -o .libs/libgif.so.4.1.6rn/<em>usr</em>/<em>bin</em>/ld: .libs/dev2gif.o: Relocations in generic ELF (EM: 40)rn/<em>usr</em>/<em>bin</em>/ld: .libs/dev2gif.o: Relocations in generic ELF (EM: 40)rn/<em>usr</em>/<em>bin</em>/ld: .libs/dev2gif.o: Relocations in generic ELF (EM: 40)rn/<em>usr</em>/<em>bin</em>/ld: .libs/dev2gif.o: Relocations in generic ELF (EM: 40)rn/<em>usr</em>/<em>bin</em>/ld: .libs/dev2gif.o: Relocations in generic ELF (EM: 40)rn/<em>usr</em>/<em>bin</em>/ld: .libs/dev2gif.o: Relocations in generic ELF (EM: 40)rn.libs/dev2gif.o: could not read symbols: File in wrong formatrncollect2: ld returned 1 exit stat<em>usr</em>nmake[2]: *** [libgif.la] Error 1rnmake[2]: Leaving directory `/home/ema/lzq/giflib-qq4.1.6/lib'rnmake[1]: *** [all-recursive] Error 1rnmake[1]: Leaving directory `/home/ema/lzq/giflib-qq4.1.6'rnmake: *** [all] Error 2rnrnrn我试了很多方法,总是不成功,希望详解,谢谢~ ~ ~
usr/bin/prel 坏的解释器,没有那个文件或目录
安装VMware tools的时候,输入./vmware-install.pl提示说 :<em>usr</em>/<em>bin</em>/prel 坏的解释器,没有那个文件或目录,我查看了下,果然没有那个目录,但是那个vmware-install.pl文件里面的确是这样写的啊,我难道需要改它的内容么,求教大神啊!rn[img=https://img-bbs.csdn.net/upload/201404/02/1396404436_987186.png][/img]
linux下安装出现/usr/bin/ld: crt1.o: No such file: No such file or directory
[color=#800000][/color]本来安装的时候出现了rnchecking for gawk... gawkrnchecking whether make sets $(MAKE)... yesrnchecking for gcc... nornchecking for cc... nornchecking for cl.exe... nornconfigure: error: no acceptable C compiler found in $<em>PATH</em>rnSee `config.log' for more details.rn[szb@<em>local</em>host libtool-1.5.22]$rnrn之后用rpm安装gcc rn之后configure报错rnrnrn./configure rnchecking build system type... x86_64-unknown-linux-<em>gnu</em>rnchecking host system type... x86_64-unknown-linux-<em>gnu</em>rnchecking for gcc... gccrnchecking for C compiler default output file name... rnconfigure: error: in `/home/szb/trs/swftools-0.9.1':rnconfigure: error: C compiler cannot create executablesrnSee `config.log' for more details.rnrnrn运行了一些gcc -vrn[img=https://img-bbs.csdn.net/upload/201409/28/1411915677_677403.png][/img]rnrn现在很是纳闷 到底是什么情况啊
这是 /usr/bin/ld: cannot find -lc 什么错误?
不懂!rn怎么改正?
关于MAC系统没有修改/usr/bin和/usr/sbin文件夹权限问题
在看ffmpeg教程的时候有一个操作是把脚本拷贝到s<em>bin</em>目录下,这时候我发现系统管理员也没有权限进行写操作,于是查了一番资料,由于系统启用了SIP(System Integerity Protection)导致root用户也没有修改权限,所以我们需要屏蔽掉这个功能,具体做法是: 1.重启电脑 2.command + R 进入recover模式 3.点击最上方菜单使用工具,选择终端 4.运
mac修改/usr/bin/权限后导致控制台无法使用
再次打开终端提示:Last login: Fri Jul 13 10:09:35 on ttys001login: login: Could not determine audit condition[进程已完成] 解决方法如下: 首先需要切换到root用户恢复sudo命令 打开系统偏好设置 退出当前用户,点击其他,登录输入root用户名和密码,进入root 重置sudo属性 $ c...
请问python在linux系统下的安装目录就是/usr/bin
rt,很多版本的linux系统都是默认安装python,我想知道装到哪个目录下去了?有没有一个类似于windows系统的专门目录呢,就像python2.5安装到windows后就有一个python25的目录。我在linux下找来找去,相关的目录就是/<em>usr</em>/<em>bin</em>和/<em>usr</em>/lib,后者是py的系统路径,但是我却找不到相关的python文件。rn新人没什么分,请高手指点,谢谢
/usr/bin/ld: cannot find -lxxx 的解决办法
/<em>usr</em>/<em>bin</em>/ld: cannot find -lxxx 的解决办法 在软件编译过程中,经常会碰到类似这样的编译错误: /<em>usr</em>/<em>bin</em>/ld: cannot find -lhdf5 这表示找不到库文件 libhdf5.so,若是其它库文件,则是 cannot find -lxxx 了,其中 xxx 是库文件的名字。 解决方法有: 1. 安装此库文件和相关软件 一般库文件属于某个软件,g...
记一次危险的操作——误删/usr/bin目录
做事要专一,否则就会出问题。 误删了/<em>usr</em>/<em>bin</em>/目录,我能想到的同步命令都不能用,wget、nc、rsync(后来运维说是可以在server端强行推,这个倒是没试过,当然你肯定得先配置client端的rsync配置文件,让其可以接收来自server端的推),好在我的服务器上都有go,我的解决办法是用go语言写了一套cs,具体如下: 1、在同样配置的服务器上打包一份/<em>usr</em>/<em>bin</em>/为bi...
linux 下编译 /usr/bin/ld canot find -luuid
出现这个错误 应该如何处理 各位大大!!!!!!rnrn
g++编译报错:/usr/bin/ld: cannot find -lstdc++,lc,lm
使用如下命令:rng++ -I/<em>usr</em>/<em>local</em>/include -o aaa -lboost_system *.cpp -staticrnrn返回错误:rn/<em>usr</em>/<em>bin</em>/ld: cannot find -lstdc++rn/<em>usr</em>/<em>bin</em>/ld: cannot find -lmrn/<em>usr</em>/<em>bin</em>/ld: cannot find -lcrncollect2: ld returned 1 exit stat<em>usr</em>nrn怎么解决这个问题?我希望是可以静态连接。rn
/usr/bin/ld:cannot find -lqpe是什么问题?
今天准备学习qt,结果照着手册上的步骤按部就班,不料在make 一个例子hello的时候出错了rn/<em>usr</em>/<em>bin</em>/ld:cannot find -lqterncollect2:ld returned 1 exit stat<em>usr</em>nmake:***[/<em>bin</em>/hello]Error 1rn哪位大侠来搭救我呀,这问题如何搞定......先谢过!
/usr/bin/ld -L"~/project/lib" -ltinyxmllib.so 失败
如题,当执行这条命令是,报:rnrn/<em>usr</em>/<em>bin</em>/ld: cannot find -ltinyxmllibrnrn但在该目录下确实有这个.so文件,请问是哪里出错了呢?谢谢
usr/bin/perl" is needed by mysql,已安装perl">"/usr/bin/perl" is needed by mysql,已安装perl
我在Oracel Linux 下安装mysql5.6(rpm),rnrn执行rpm -ivh MySQL-server-advanced-5.6.16-1.el6.x86_64.rpm 后,提示:rn"/<em>usr</em>/<em>bin</em>/perl is needed by mysql-server-advanced..."rnrn可是我已经安装了perl,安装路径为:/url/<em>local</em>/perlrnrn并且执行 /<em>usr</em>/<em>bin</em>/perl -v 后出现版本信息,说明安装成功,为什么安装mysql还会有“/<em>usr</em>/<em>bin</em>/perl is needed”这样的提示呢?rnrn应该如何解决?rnrn[color=#FF0000]ps: 我设置过软连接,也把/url/<em>local</em>/perl/<em>bin</em>加入过环境变量,都不好使。[/color]
php脚本#!/usr/bin/env php写法的好处
https://www.cnblogs.com/bigclould/p/9317485.html
/usr/bin/env: node: 没有那个文件或目录
/<em>usr</em>/<em>bin</em>/env: node: 没有那个文件或目录
新版本caffe脚本运行无权限,#!/usr/bin/env sh
今天运行新版caffe(150818)运行脚本老师提示 无权限。  在论坛里看到<em>下面</em>这个解释 应该就是没有指定bash作为此脚本的解释器,在最var这个脚本 的最上面加上#!/<em>bin</em>/bash看看。 我马上打开自带的一个脚本:如下 #!/<em>usr</em>/<em>bin</em>/env sh ./build/tools/caffe train --solver=examples/mnist/lenet_
/usr/bin/env: "python\r": 没有那个文件或目录
在Ubuntu终端中运行python文件,报错因为这个文件是直接从别处复制的,可能创建在windows下,多了\r字符。解决方法 使用VIM打开文本 :set ff 然后回车,我这个文件显示为dos格式。 :set ff=unix 回车,设置为unix格式。 :wq 修改后正常运行了!
linux系统中usr/bin/ld被误删/覆盖解决方案
今天使用ubuntu系统时,误讲<em>usr</em>/<em>bin</em>/ld文件覆盖,导致系统库链接失败。解决方案如下: 1、 sudo apt-get install dlocate  安装dlocate 2、dlocate ld   查看是否有ld安装包 3、dlocate ld|less 4、sudo apt-get install --reinstall <em>bin</em>utils 输入ld,显示有该指令,说明安
wall环境变量在ssh下总报/usr/bin/env git 错误
  wall环境变量在ssh下总报/<em>usr</em>/<em>bin</em>/env git 错误 解决方案:echo  $<em>PATH</em>                     然后在walle源代码修改成$<em>PATH</em>中的git地址;这样就检查通过了; 主要原因还是因为ssh登录的环境可能无法使用环境变量;     另外还有一个原因经常性的报错: 基本都按照文档配置相应的参数后,但是检测的时候还是会弹出报错:...
请问/usr/java/jdk1.5/bin/java -DSmsCent -Xms128m -Xmx512m什么意思
我看服务器上有个启动程序的.sh文件,内容如题,我不明白的是 -DSmsCent是什么意思,有没有高人指点一下
求助一个编译中的/usr/bin/ld错误
在编译别人的一个程序时,出现了如下错误:rnrn/<em>usr</em>/<em>bin</em>/ld: cannot find -lXextrn/<em>usr</em>/<em>bin</em>/ld: cannot find -lX11rncollect2: ld returned 1 exit stat<em>usr</em>nrn请求高手怎么解决,谢谢~才接触Unix
#!/usr/bin/php 如何不显示在网页中
我为了让PHP脚本可以作为LINUX <em>shell</em>去执行,加了这段声明。但是如何不显示在网页中?
redhat系统误删了/usr/bin目录,导致无法登陆系统
怎么解决呢~rn谢谢各位了!
/usr/bin/ld: cannot find -lgcc_s . 求前辈帮忙
我的问题是在用到gcc的时候rn/<em>usr</em>/<em>bin</em>/ld: cannot find -lgcc_srncollect2: ld returned 1 exit stat<em>usr</em>n我在/<em>usr</em>/lib/ 和 /<em>usr</em>/<em>local</em>/lib 下都没有找到libgcc_s 这个东西。rn我的gcc是4.2.4. rn求大家帮我看下,是什么问题?rn如果真的是libgcc_s这个东西,我没有造成的话,我去哪里下啊?rn谢谢啊rn
介绍python脚本中的#!/usr/bin/python...一堆是什么意思
很多初学Python的朋友在看到大部分的.py文件里边的第一句话就是#!/<em>usr</em>/<em>bin</em>/python,但我们又隐隐约约记得#号后边的内容是被注释掉的呀?怎么回事呢?<em>下面</em>我一一道来: 这里边运行.py文件要分两种情况来运行: (1)如果调用python脚本来运行时,即使用: $ python test.py #!/<em>usr</em>/<em>bin</em>/python 被忽略,等同于注释。 (2)如果直接用<em>shell</em>脚本运...
linux下编译不过去~/usr/bin/ld: skipping incompatible ...
makefile 如下:rn#文件类型定义rn.SUFFIXES: .ec .c .o .hrnrn#编译器定义rnEC=esqlrnrn#编译参数定义rnEC_FLAGS= $(CC_CPCMT) $(CC_64BIT) -I. -I../include -I../../includernrn#目标存放路径rnBUILD=../../build/rnrn#目标文件rnAPP=$(BUILD)s_daily_ctrl $(BUILD)s_daily rnrn#中间文件定义rnOBJS=../../lib/comm.arnrnCLEANOBJ = $(APP) *.o *.crnrnall:$(APP)rn$(BUILD)s_daily_ctrl:s_daily_ctrl.ec rn $(EC) $(EC_FLAGS) -o $@ $? $(OBJS)rn$(BUILD)s_daily:s_daily.ec rn $(EC) $(EC_FLAGS) -o $@ $? $(OBJS)rn rm -rf *.o *.crnclean:rn rm -rf $(CLEANOBJ)rnrnrn编译的报错:rnesql -I. -I../include -I../../include -o ../../build/s_daily_ctrl s_daily_ctrl.ec ../../lib/comm.arn/<em>usr</em>/<em>bin</em>/ld: skipping incompatible /home/informix/lib/esql/libifsql.so when searching for -lifsqlrn/<em>usr</em>/<em>bin</em>/ld: skipping incompatible /home/informix/lib/esql/libifsql.a when searching for -lifsqlrn/<em>usr</em>/<em>bin</em>/ld: cannot find -lifsqlrncollect2: ld returned 1 exit stat<em>usr</em>nmake: *** [../../build/s_daily_ctrl] Error 1rnrn大家帮忙给看看是什么问题,rn就是换了个主机,然后编译就不行了,以前没问题的
层次分析法.ppt下载
层次分析的最新Ppt介绍 能够对已有的课程进行总结 辅助课堂教育和独立研究的参考资料。 相关下载链接:[url=//download.csdn.net/download/meleo/4175649?utm_source=bbsseo]//download.csdn.net/download/meleo/4175649?utm_source=bbsseo[/url]
CodeVeil_chs-v1.3下载
CodeVeil_chs-v1.3 相关下载链接:[url=//download.csdn.net/download/fanpin88/6192791?utm_source=bbsseo]//download.csdn.net/download/fanpin88/6192791?utm_source=bbsseo[/url]
Android规范下载
关于Android开发命名规范,字段,数据库,代码规范,让初学者更加规范 相关下载链接:[url=//download.csdn.net/download/coderwang123/8819863?utm_source=bbsseo]//download.csdn.net/download/coderwang123/8819863?utm_source=bbsseo[/url]
相关热词 c# 线程结束时执行 c# kb mb 图片 c# 替换第几位字符 c#项目决定成败 c# 与matlab c# xml缩进 c#传感器基础 c#操作wps c# md5使用方法 c# 引用父窗口的组件
我们是很有底线的