Compile failed; see the compiler error output for details. [问题点数:20分,结帖人fiele]

Bbs2
本版专家分:138
结帖率 95%
Bbs7
本版专家分:12441
Blank
红花 2009年6月 Java大版内专家分月排行榜第一
Bbs2
本版专家分:215
Bbs2
本版专家分:138
Bbs1
本版专家分:0
Bbs1
本版专家分:1
Bbs1
本版专家分:0
Bbs1
本版专家分:15
Bbs1
本版专家分:0
Android studio 调试错误 - 记录
1、Android Studio3.0以上,gradle.build中dependencie依赖由<em>compile</em>变为implementation  错误: Configuration '<em>compile</em>' is obsolete and has been replaced with 'implementation' and 'api'. 在App的build gradle 中: depende...
Android Studio 编译常见问题解决办法
1.dexDebug ExecException finished with non-zero exit value 2 需要在gradle中配置下面的代码,原因是引用了多个libraries文件 defaultConfig { multiDexEnabled true } 2.Exe
Error:Compilation failed; see the compiler error output for details.
我们来看看这个博主:http://blog.csdn.net/runner__1/article/details/53482565我就是借鉴他找错的经历找到错误的在命令行中进入项目的根目录,或者可以在Android studio的Terminal中直接操作也可以,然后敲入一个命令: gradlew <em>compile</em>Debug --stacktrace 就可以输出较详细的信息,然后根据命令行给出的提...
Compilation failed; see the compiler error output for details.类似错误导致崩溃
此类崩溃其一原因:是id设置错误导致编译错误,使Android连安装都不可进行
Android解决app:compileDebugJavaWithJavac>Compilation failed; see the compiler error output for details
Build -&amp;gt; Clean Project Build -&amp;gt; Rebuild Project 解决! 找不到 R,也可以用这个方法
引入recyclerview报错问题
详细:http://www.cnblogs.com/freexiaoyu/p/5022602.html 今天打算将另一个项目的ListView控件也替换成RecyclerView以同样的方式引用了RecyclerView,引用地址请点击上面的链接查看 引用成功后创建类并继承RecyclerView.Adapter只要一继承这个类 pageckage地方就提示错误 "The typ
第一个测试案例
第一个测试案例 本章讲述如何用qing-automation框架去写测试案例, 首先进入下载页https://git.oschina.net/xhyspring/qing-automation, 点击 下载zip 这个按钮。代码下载完成后,解压zip包。 [+]查看原图 接下来就是准备启动项目,在启动项目之前,确保你电脑已经安装JDK7和Ant。 JDK7安装,
给钱解决问题 Androidstudio调用java里的错误
来人啊 org.gradle.api.tasks.TaskExecutionException: Execution <em>failed</em> for task ‘:app:<em>compile</em>DebugJavaWithJavac’. at org.gradle.api.internal.tasks.execution.ExecuteActionsTaskExecuter.executeActions(Exec...
如何解决Databinding和Dagger冲突
1.在使用dataBinding时,Android Studio出现警告Warning:Using incompatible plugins for the annotation processing: android-apt. This may result in an unexpected behavior.Error:(6, 53) 错误: 程序包com.example.liuguirong
react-native 打包遇到aapt错误解决方案
打包android项目的时候会遇到这样的aapt错误,有两个解决方案,就是升级aapt的编译,另一个是关掉使用aapt编译。使用方法方法一升级aapt 将Android SDK Build-Tools勾选,然后确定方法二关闭aapt编译... android.enableAapt2=false ...
jdk问题Compile failed; see the compiler error output for details.
jdk 1.5 下运行正常,jdk1.4启动正常,输入网址,就报错
JAVA -- ant编译时出现Compile failed; see the compiler error output for details异常
出错的原因: 1.模块中有可能命名时出现"_"(下划线)等特殊字符 解决方案: 1.模块重新命名,或者是重新建立模块,将其下方的各个部分进行复制/粘贴
Compilation failed; see the compiler error output for details.
很久没开发android 今天突然被要求 去改一个android的项目,因为更新svn的时候很多冲突,直接删除了自己项目的所有本地代码,更新最新的代码。打开的时候各种报错,但是百度上基本都能解决,只有这个,模糊不清的解释,百度上也众说风云,找到了一个说是通过android studio 最下面一栏的 Terminal 输入 gradlew <em>compile</em>DebugSources就可以出现详细报错 ...
centos 7安装xunsearch遇到的问题及解决方法
1、确定(:gcc、gcc-c++、gcc46、gcc46-c++)都已安装 yum install gcc-c++ libstdc++-devel 2、确定能解压压缩包 yum -y install bzip2 3、确定能编译文件 yum install zlib-devel 4、报错 ERROR: <em>failed</em> to <em>compile</em> xapian-co
关于怎样在AS里找错误
例:Compilation <em>failed</em>; <em>see</em> the <em>compile</em>r <em>error</em> <em>output</em> for <em>details.</em> 在练习AS共享数据时莫名其妙运行就出现了这个错误。百度了一下,看到在AS里自行找错误的方法。 在Terminal中操作:输入 gradlew <em>compile</em>Debug --stacktrace或 gradlew <em>compile</em>DebugSources --sta...
无法安装 rJava 的解决方法
安装 R 后,如果你想安装 rJava,可能会遇到一个问题 configure:4130: <em>error</em>: Cannot <em>compile</em> a simple JNI program. See config.log for <em>details.</em> 打开 config.log interpreter : '/usr/lib64/jvm/java/jre/bin/java' archiver : '
D:\MyProject\build.xml:69: Compile failed; see the compiler error output for details.
rn用ant打包的时候出错:rn [javac] D:\MyProject\src\java\com\freeze\test\XMLTester.java:14: cannot resolve symbolrn [javac] symbol : class SAXReaderrn [javac] location: class com.freeze.test.XMLTesterrn [javac] Document aDoc = new SAXReader().read(new File("D://test//Person.xml"));rn [javac] ^rnrn昨天还好好的,而且XMLTester在eclipse上能跑起来的。rn好像是我在配置窗口上按了一下“还原默认”,就出问题了。rnrnHelp!!!rn
AndroidStudio 编译中遇到问题总结
  1. 问题:运行项目中遇到,Error:Execution <em>failed</em> for task ':app:processDebugResources'. &amp;gt; com.android.ide.common.process.ProcessException: org.gradle.process.internal.ExecException: Process 'command 'E:\And...
compilation failed: see the compiler error outpur for details解决方案
    在android项目的开发过程中,时常在运行时遇到compilation <em>failed</em>: <em>see</em> the <em>compile</em>r <em>error</em> outpur for details这个错误提示,但是在项目中又找不到错误的代码行。    这是你可以通过cmd命令提示符进入项目的gradle所在目录,运行gradlew <em>compile</em>Debug -- stacktrace我的错误提示是:Caused ...
see the compiler error output for details
Compilation <em>failed</em>; <em>see</em> the <em>compile</em>r <em>error</em> <em>output</em> for details:   这个错误一般是引入的库的版过国道导致的
Android Realm数据库:Compilation failed; see the compiler error output for details.
   最近在项目中使用Realm数据库,然后就出现了一个莫名其妙的报错: Compilation <em>failed</em>; <em>see</em> the <em>compile</em>r <em>error</em> <em>output</em> for <em>details.</em> 如果再详细点: org.gradle.api.tasks.TaskExecutionException: Execution <em>failed</em> for task ':wallet:<em>compile</em>De...
安装rails出错:未能构建本机gem的扩展
在执行gem install rails -v 5.0.0时出错: bogon:~ jinzesu$ gem install rails -v 5.0.0 Building native extensions. This could take a while… ERROR: Error installing rails: ERROR: Failed to build gem native ext...
安装 xunsearch 报错 与安装步骤
官方给的安装步骤:http://www.xunsearch.com/doc/php/guide/start.installation 安装目录:/usr/local/xunsearch 1. 开启/重新开启 xunsearch 服务程序,命令如下:  /usr/local/xunsearch/bin/xs-ctl.sh restart 2. 所有的索引数据将被保存在下面这个目录中:
ubuntu16.04 安装apache2报错 解决方案
apache2无法启动,如下报错:Starting apache2 (via systemctl): apache2.serviceJob for apache2.service <em>failed</em> because the control process exited with <em>error</em> code.
centOS 7下无法启动网络(service network start)错误解决办法(应该是最全的了。。。)
今天在centOS 7下更改完静态ip后发现network服务重启不了,翻遍了网络,尝试了各种方法,终于解决了。      现把各种解决方法归纳整理,希望能让后面的同学少走点歪路。。。 首先看问题:执行service network restart命令后出现下面的错误: Restarting network (via systemctl): Job for network.servic
ubuntu nginx重启失败
Restarting nginx (via systemctl): nginx.serviceJob for nginx.service <em>failed</em> because the control process exited with <em>error</em> code. See &quot;systemctl status nginx.service&quot; and &quot;journalctl -xe&quot; for details 如...
compileDebugJavaWithJavac"错误解决">"compileDebugJavaWithJavac"错误解决
在AS中进行编译,出现如下错误: Error:Execution <em>failed</em> for task ':xxx:<em>compile</em>DebugJavaWithJavac'. > Compilation <em>failed</em>; <em>see</em> the <em>compile</em>r <em>error</em> <em>output</em> for <em>details.</em>
Compile failed; see the compiler error output for details. 解决
android编译某些java文件的时候,就是javac的时候,要设置编码格式。 这个问题就是项目中的某个文件的编码格式和你设定的不一样导致的。 (备份下,纠结了很久)
出现异常Compile failed; see the compiler error output for details
出现 Compile <em>failed</em>; <em>see</em> the <em>compile</em>r <em>error</em> <em>output</em> for details错误,请大家帮忙解决!!! public class CopyOfComplie
Some file crunching failed, see logs for details解决方案 以及.9patch点9图片的报错的详细修改方法
报的错误是:Error:java.lang.RuntimeException: Some file crunching <em>failed</em>, <em>see</em> logs for details ? 出现这个错误的原因是一般有以下几种情况: 一、构建Gradle的时候,Gradle会去检查一下是否修改过文件的后缀名。一般大多数是出现在图片上,.jpg修改成了.png就会出现这个问题; 二、点9(.9)图片有问题也可能出现这个问题,原因是AndroidStudio对图片的审核非常严格,在ECLIPSE上
Eclipse安装SVN插件的问题
今天给Eclipse安装个SVN插件,然后访问远程仓库时就出现以下的错误了: SVN: '0x00400006:Validate Repository Location' operation finished with <em>error</em>: Selected SVN connector library is not available or cannot be loaded. 看这个提示,原
idea启动maven项目jar未导入到Compiler output路径中
今天在导入maven依赖的web项目时候,遇到一个问题。出现了没有找到对应的类。一看发现,Project <em>compile</em>r <em>output</em> 路径下的项目Lib文件夹没有东西。也就是说jar没有编译进来,一直在寻找问题。结果在我细心观察下,终于找到原因。下面我来给大家讲解一下原因。 1.点开Settings—-》搜索maven查看maven本地库配置。 2.点击项目结构,查看Libraries底
SLF4J用户手册
SLF4J用户手册     简单Java日志外观(SLF4J)提供了不同的日志框架,例如java.util.logging、logback和log4j,的外观。SLF4J允许最终用户在部署时插入期望的日志框架。请注意SLF4J意味着你的库或者应用只有一个强制的依赖,即slf4j-api-1.7.12.jar。     从1.6.0版本开始,如果在类路径没有发现绑定(的日志框架),那么SLF4J
react-native遇到过的错误
记录下使用react-native过的错误,实习期间一直没空写博客~~~ 1、development return response <em>error</em> 500:一般是引用文件组件等的路径错误,找不到; 2、cannot excute importjavascriptexception: 一般是写错变量名称等; 3、导入图片资源时,需要重新打包; 4、Application has not been
gradle与jenkins编译常见报错及解决
一、jenkins编译错误总结 1.错误一:   /data/jenkins/workspace/tv-child-release/tvApp/libraryPrj/lecore/src/com/letv/core/utils/DevicesUtils.java:1335: <em>error</em>: cannot find symbol
D:\miles28370\miles28370\application\core\build.xml:18: Compile failed; see the compiler error outpu
编译出问题,不知道该如何解决,帖一下错误代码 D:\miles28370\miles28370\application\core\build.xml:18: Compile <em>failed</em>; <em>see</em> the <em>compile</em>r <em>error</em> <em>output</em> for <em>details.</em> at org.apache.tools.ant.taskdefs.Javac.<em>compile</em>(Javac.java:
Android Studio Compilation failed; see the compiler error output for details.
Compilation <em>failed</em>; <em>see</em> the <em>compile</em>r <em>error</em> <em>output</em> for <em>details.</em> 这个问题看起来很头痛,找不到在哪里!!!!!                                                                      其实     问题就一目了然啦~~~~  ...
Compilation failed:internal java compiler error错误解决
在使用idea进行开发的时候,遇到了以下问题:进行编译运行的时候报Compilation <em>failed</em>:internal java <em>compile</em>r <em>error</em>错误解决办法:选择左上角file->setting->java <em>compile</em>r,将target bytecode version 修改为你对应的版本,如下,本人是将1.5改为1.8重新编译运行,问题解决
Android resource compilation failed 一定能搞定的办法
这个问题的原因网上有很多,就不多说了,下面是我的比较笨的解决办法,大家可以试试; 当大家看到这个问题的时候,可能会有一行是可以点击的文件目录,点击到报错的地方。 如果没有可以点击的地方,也可以根据目录和 “行号” 找到具体的地方; 在这里可以看到,是因为有个 name 的格式有问题,我们搜索这个 ‘split’ 是在哪个地方定义的(这个错误一定是xml文件有问题,我们只找xml文件对应的...
安装atom插件
今天早上没事干,受够了sublime给我出的一些问题,现在的3版本中文的文件夹不显示,而且查找功能也不行,在尾部都不能查找前面的,让我很恼火。最近看网上说的最多的前端编辑器就是atom,所以决定尝试一番。  对于一个编辑器来说,当然可以直接用,但是为了提高我们的开发效率,当然得先安装一些插件来提高我们的生产效率。这里首先要安装的就是Emmet这个插件了,这个不用多说,做前端的应该都知道这个插件的功能
docker 启动报错
请教下centos7启动docker异常? 启动docker [root@centos7-linux--wd ~]# service docker start Starting docker (via systemctl): Job for docker.service <em>failed</em>. See 'systemctl status docker.service' and 'journalctl ...
关于Nginx不能正常启动的问题
Job for nginx.service <em>failed</em> because the control process exited with <em>error</em> code. See “systemctl status nginx.service” and “journalctl -xe” for details 关于执行 systemctl start nginx 命令出现上述错误。 执行 syst...
第一章:我的入门级rocketMQ
使用环境:windows 7. 服务地址下载:rocketMQ windows环境服务 代码转载自: RocketMQ 消息队列单机部署及使用  上代码: 1、maven依赖 com.alibaba.rocketmq rocketmq-client 3.2.6 2、创建生产者 package org.apache.rocketmq.test.demo; im
Compile Error出现的原因
1.提交时所用的语言不对,比如c++的程序用c交了(c写的程序用c++提交可以过); 2.程序连编译都不能过,有各种错误。
大家看看,这是什么错误:Compile failed; see the compiler error output for details.
JSP页面的内容如下: <!DOCTYPE HTML PUBLIC "-//W3C//DTD HTML 4.0 Transitional//EN"> tex
异常:“app:compileDebugJavaWithJavac”> Compilation failed; see the compiler error output for details.
 碰到这个异常我也是挺无语的,因为Android Studio根本不会提示你详细的错误信息。我们来看看这个博主:http://blog.csdn.net/runner__1/article/details/53482565我就是借鉴他找错的经历找到错误的在命令行中进入项目的根目录,或者可以在Android studio的Terminal中直接操作也可以,然后敲入一个命令: gradlew comp...
Compile failed; see the compiler error output for details
 出现 Compile <em>failed</em>; <em>see</em> the <em>compile</em>r <em>error</em> <em>output</em> for details错误,请大家帮忙解决!!!public class CopyOfComplierToClass2 {  public boolean sourceConvertClass() {  boolean flag = false;  File f = new File("d:/gener
Cmake 编译配置失败
配置选项 选择的  VS 12 2013 The C <em>compile</em>r identification is MSVC 18.0.21005.1 The CXX <em>compile</em>r identification is MSVC 18.0.21005.1 Check for working C <em>compile</em>r: C:/Program Files (x8
解决Installation error: INSTALL_FAILED_INSUFFICIENT_STORAGE
解决 Installation <em>error</em>: INSTALL_FAILED_INSUFFICIENT_STORAGE 试试修改一下manifest文件
centos7.4中ntpd无法启动,并且journalctl命令报错
使用systemctl restart ntpd重启ntpd服务时报错无法重启: Job for ntpd.service <em>failed</em> because a configured resource limit was exceeded. See “systemctl status ntpd.service” and “journalctl -xe” for <em>details.</em> 使用jou...
搜索引擎xunsearch的配置、安装
前言 搜索引擎、文本识别这一块自己suo'ra
latex写论文 问题集锦
LaTeX FAQ Where can I get LaTeX for Windows?How can I run LaTeX on a Unix/Linux platform?I have a problem with amstex and \BbbDVIPS can't find tx8r.encWhich EPS settings do I have to use in Mic
快速解决Error:Execution failed for task ':app:compileReleaseJavaWithJavac'. > Compilation failed; see th
> 自从AS升级2.3之后,偶尔遇到一个问题 Error:Execution <em>failed</em> for task ':appmain:<em>compile</em>ReleaseJavaWithJavac'. > Compilation <em>failed</em>; <em>see</em> the <em>compile</em>r <em>error</em> <em>output</em> for <em>details.</em> 并没有提示错误的具体地方,然后查看代码也没有报错的地方 一分钟之内可以解决
Android 使用RecyclerView的方法
1.在build.gradle(Module:app)中添加依赖 implementation 'com.android.support:recyclerview-v7:26.1.0' 注:版本号应该与implementation 'com.android.support:appcompat-v7:26.1.0'中的版本号相同...
Bmob之Error:Execution failed for task ':app:compileDebugJavaWithJavac'. > Compilation failed; see the
最近在写Bmob相关内容,又遇到了这个问题,之前遇到过该问题,忘记怎么解决的了,今天又遇到调试了好久,特发一贴来记录一下,防止再走老路。 问题描述:Error:(19, 55) 错误: 无法访问Subscription,找不到rx.Subscription的类文件;Error:Execution <em>failed</em> for task ':app:<em>compile</em>DebugJavaWithJavac'.
Android Studio加载第三方jar包,出现包重复加载的问题解决(:app:compileInsideDebugJava FAILED)
最近在做一个项目的时候,引用了好多第三方包,确实,开源就是不错,用起来舒服,但是,他就是编译不通过了,报以下错误: :app:<em>compile</em>InsideDebugJava FAILED FAILURE: Build <em>failed</em> with an exception. * What went wrong: Execution <em>failed</em> for task ':app:<em>compile</em>Ins
compileDebugJavaWithJavac
现象: 在AS中进行编译,出现如下错误: Error:Execution <em>failed</em> for task ‘:xxx:<em>compile</em>DebugJavaWithJavac’. Compilation <em>failed</em>; <em>see</em> the <em>compile</em>r <em>error</em> <em>output</em> for <em>details.</em> 2 在网上找了几种方案:.1解决: 缺少了一个lib的引用,在iml文件中,加上
Xcode9 在Swift 4.0下编译时第三方框架报错Swift compiler Error的解决方案
更多原创文章,请访问:https://takioo.cn 随着 Xcode9 Swift 4.0 的到来,一些小问题也接踵而至。   许多优秀的 Swift 第三方框架还没有来得及迎接 Swift 4.0 的到来,它们还停留在 Swift3.x 的状态。 这个时候新建一个项目,使用cocoapods 引入所需的第三方,即使 pod install 成功后,一编译工程就是满屏红, 且报错 ...
eclipse使用中遇到的坑和解决办法链接(未完待续)
An <em>error</em> has occurred. See <em>error</em> log for more <em>details.</em> java.lang.NullPointerException 参考链接
Docker——启动问题
前言   最近很幸运有机会和一个小组一起尝试学习K8S,小菜还是个新新手,只知道K8S的Logo像一张渔网又像一个罗盘,Docker的Logo是一个驮着集装箱的鲸鱼在海上遨游,光从Logo看,他们两者之间肯定有很大的关系。所以决定先大概知道一下Docker是干啥的,然后安装一下Docker捣鼓捣鼓!   捣鼓捣鼓嘴上说当然很简单,实际上做时才发现问题是一个接一个,尤其是安装过程,多亏了美女相助...
unity3d打APK包时出现的内部构建错误(笔记)
Internal <em>compile</em>r <em>error</em>. See the console log for more information. <em>output</em> was; Error building Player because scripts had <em>compile</em>r <em>error</em>s unity打包APK包出现内部构建错误的时候。 1。关闭unity,打开工程项目文件。 2。删除Library文件夹,
Android Error:Execution failed for task ':app:compileDebugJavaWithJavac' 解决方案
最近Android项目开发中碰到一个异常 Google、百度搜索前两页内容浏览了一遍,总结了几种方案:   1、升级更新buildToolsVersion 到最新版本 2、升级Android Studio 2.2.2版本,JDK 1.8版本 android { <em>compile</em>SdkVersion 25 buildToolsVersion "25.
Android studio 报错修改
错误: Error:Unable to start the daemon process. This problem might be caused by incorrect configuration of the daemon. For example, an unrecognized jvm option is used. Please refer to the user guide
no classfiles specifiedBUILD FAILED C:\Android\sdk\tools\ant\uibuild.xml:198: null returned: 1 解决方案
[dx] no classfiles specifiedBUILD FAILED C:\Android\sdk\tools\ant\uibuild.xml:198: null returned: 1 出现以上报错原因就是在生成buil.xml和jar包时的路径不对,应该是工程的根目录而不是java文件那层目录,不信你可以试试哦~ 生成build文件: android create
IntelliJ IDEA 编译报错:Error:java: Compilation failed: internal java compiler error
IntelliJ IDEA使用教程 (总目录篇) 报错内容: Information:Using javac 1.8.0_73 to <em>compile</em> java sources Information:java: javacTask: 源发行版 1.8 需要目标发行版 1.8 Information:java: Errors occurred while compiling module 'EZS...
AndroidStudio编译时出现的几个问题
开发环境 OS:Windows 10 AndroidStudio version:2.1.3 Gradle version:2.14.1 JDK:1.8 问题1: 无效的源版本1.7 问题2:adb命令
调用 Ant api 出现Compile failed; see the compiler error output for details异常
[b][color=red][color=red][color=red]该方法是把d:/generator-<em>output</em>/hibernate/code/这个文件夹下的多个.java编译为.class文件[/color][/color][/color][/b]rnrn但是出现Compile <em>failed</em>; <em>see</em> the <em>compile</em>r <em>error</em> <em>output</em> for details异常,希望大家帮忙解决,谢了rnrnpublic boolean sourceConvertClass() rn boolean flag = false;rn File f = new File("d:/generator-<em>output</em>/hibernate/code/");rnrn // 找到所有的文件rn File[] files = f.listFiles();rn Javac <em>compile</em>r = new Javac();rn File destFile = null;rn for (File file : files) rn // 找出不含.java文件rn if (file.getName().contains(".java")) rn <em>compile</em>r.setProject(new Project());rn // 编译后的.class文件存放的路径rn destFile = new File("d:/generator-<em>output</em>/hibernate/code/");rn destFile.mkdirs();rn // 要编译的源文件目录rn Path srcPath = new Path(<em>compile</em>r.getProject(),rn "d:/generator-<em>output</em>/hibernate/code/");rn <em>compile</em>r.setFork(true);rn <em>compile</em>r.setSrcdir(srcPath);rn <em>compile</em>r.setDestdir(destFile);rn try rn <em>compile</em>r.execute();rn flag = true;rn catch (BuildException e) rnrn //System.out.println("编译.class文件出现错误");rn rn rnrn rnrn return flag;rn rn
使用lifecycle时,1.0.0和1.0.3问题解决方法
lifecycle报错
Linux系列:解决Ubuntu或Fedora虚拟机重启网络时出现的“No such device eth0”或“Job failed”错误
首先声明:下面是出现在Ubuntu和Fedora下面的问题,如果其它虚拟机也出现这样的问题,也可参看这些方法解决。 1. 错误症状 (1)Ubuntu下 用命令service networking restart重启网络或ifconfig eth0 up重启网卡时出现下面错误: eth0: ERROR while getting interface flags: N
自己用jasperreports写一个pdf格式报表
package mypackage.jasperreport; import java.io.IOException;import java.io.OutputStream;import java.util.HashMap;import java.util.List;import java.util.Map; import javax.servlet.ServletException;import...
调用 Ant api 出现Compile failed; see the compiler error output for details异常
-
codeblocks编译出错问题的解答!(编译c++ 或者c程序)
典型错误: execution of 'mingw32-g++.exe ……faile! codeblocks cannot exec `cc1plus': No such file or directory 出现这样的错误,都是因为编译器没安装成功,或者没有设置好! 从设置过程就可以知道有没有安装g++编译器。 设置方法:Settings——Compiler… 一般默认c
Eclipse中的插件冲突解决方法
今天打开Eclipse建项目,编辑,每一步操作都会弹出一个错误提示框,提示:An <em>error</em> has occurred.<em>see</em> <em>error</em> log for more details。 上网搜了搜才知道是因为安装插件产生了冲突,想到之前为了搭建Seam框架的开发环境,没少折腾这Eclipse,最近又配JBPM的开发环境,又折腾了一番,还真可能是这问题。 又查找了一下解决方案,按部就班的操作了一遍...
MyEclipse安装VSS插件步骤及错误解决
MyEclipse安装VSS插件会一直报错an <em>error</em> has occurred <em>see</em> <em>error</em> log for more details:org/eclipse/ui/internal/activeeditoraction;一番麻烦后总算解决,看到有不少人也有类似问题,就共享到这里,希望有所帮助
CCS5.5 C2000v15.12 compile ti_cgt_c2000_15.12.7.LTS_windows_installer
CCS5.5导入工程时出现See details below. Error: Import <em>failed</em> for project 'can_external_transmit_cpu01' because its <em>compile</em>r definition is not available. Please install the C2000v15.12 <em>compile</em>r before importing this project.
eclipse转android studio的各种蓝瘦香菇 android studio的各种编译问题及解决方法
1.android studio编译错误
Maven 编译命令错误之编译错误的解决
引言: 解决在Linux系统中,运行mvn命令碰到的一个编译问题,看看如何分析并加以解决的?
AndroidStudio项目导入问题
不定期更新 1. 还是万恶的打开项目就出错,这个可爱的Error模样 use embedded JDK(recommended) Download JDK 8 Select a JDK from the File System 解决方法: 1. 升级到JDK8 2. 点击 Select a JDK from the File System或者点击File选择other se
在使用systemctl start docker启动失败时解决办法
在使用systemctl start docker启动失败时,使用systemctl status docker.service.报告如下: root@localhost ~]# systemctl status docker.service ● docker.service - Docker Application Container Engine    Loaded: loaded (/us...
linux系统下CRF++及GCC安装
转载: http://blog.sina.com.cn/s/blog_8e1edee90101pp6x.html 折腾了好几天,但还未成功安装和应用,小抓狂,但做事情本不就是如此,总会走点弯路,但只要坚持,总会成功的,所以,一定要挺住,抓狂的时候放松放松,然后接着干!     1、起初自己PC上装的Ubuntu13.10,工作过程中总是出现死机情况,至今不知原因在哪里,不知
jwplayer-7.1.4下载
最新版本的jw播放器,完整的js文件,官方源码 相关下载链接:[url=//download.csdn.net/download/w610949252/9168253?utm_source=bbsseo]//download.csdn.net/download/w610949252/9168253?utm_source=bbsseo[/url]
protues安装与keil安装过程下载
protues安装与keil安装过程 1.安装Proteus Version 7.1 SET71UP。 2.安装keil C518.08 uVision3 setup。 3.protues与keil联调 相关下载链接:[url=//download.csdn.net/download/lake521/2033680?utm_source=bbsseo]//download.csdn.net/download/lake521/2033680?utm_source=bbsseo[/url]
java3d 自由落体的例子下载
使用java3d编制的自由落体的例子,刚学不要见笑。 需要编译一下才能运行哦。 相关下载链接:[url=//download.csdn.net/download/sduvec/2040974?utm_source=bbsseo]//download.csdn.net/download/sduvec/2040974?utm_source=bbsseo[/url]
文章热词 设计制作学习 机器学习教程 Objective-C培训 交互设计视频教程 颜色模型
相关热词 mysql关联查询两次本表 native底部 react extjs glyph 图标 长江师范学院大数据 大数据最新视频
我们是很有底线的