jdk问题Compile failed; see the compiler error output for details. [问题点数:50分]

Bbs1
本版专家分:0
结帖率 74.07%
Bbs1
本版专家分:0
Bbs1
本版专家分:0
Bbs1
本版专家分:0
Bbs3
本版专家分:728
Bbs1
本版专家分:0
Bbs1
本版专家分:0
Bbs1
本版专家分:0
Bbs3
本版专家分:967
Bbs1
本版专家分:0
Bbs3
本版专家分:835
Bbs2
本版专家分:259
Bbs1
本版专家分:26
Android解决app:compileDebugJavaWithJavac>Compilation failed; see the compiler error output for details
Build -> Clean Project Build -> Rebuild Project 解决! 找不到 R,也可以用这个方法
引入recyclerview报错问题
详细:http://www.cnblogs.com/freexiaoyu/p/5022602.html 今天打算将另一个项目的ListView控件也替换成RecyclerView以同样的方式引用了RecyclerView,引用地址请点击上面的链接查看 引用成功后创建类并继承RecyclerView.Adapter只要一继承这个类 pageckage地方就提示错误 "The typ
第一个测试案例
第一个测试案例 本章讲述如何用qing-automation框架去写测试案例, 首先进入下载页https://git.oschina.net/xhyspring/qing-automation, 点击 下载zip 这个按钮。代码下载完成后,解压zip包。 [+]查看原图 接下来就是准备启动项目,在启动项目之前,确保你电脑已经安装JDK7和Ant。 JDK7安装,
react-native 打包遇到aapt错误解决方案
打包android项目的时候会遇到这样的aapt错误,有两个解决方案,就是升级aapt的编译,另一个是关掉使用aapt编译。使用方法方法一升级aapt 将Android SDK Build-Tools勾选,然后确定方法二关闭aapt编译... android.enableAapt2=false ...
centos 7安装xunsearch遇到的问题及解决方法
1、确定(:gcc、gcc-c++、gcc46、gcc46-c++)都已安装 yum install gcc-c++ libstdc++-devel 2、确定能解压压缩包 yum -y install bzip2 3、确定能编译文件 yum install zlib-devel 4、报错 ERROR: <em>failed</em> to <em>compile</em> xapian-co
给钱解决问题 Androidstudio调用java里的错误
来人啊 org.gradle.api.tasks.TaskExecutionException: Execution <em>failed</em> for task ‘:app:<em>compile</em>DebugJavaWithJavac’. at org.gradle.api.internal.tasks.execution.ExecuteActionsTaskExecuter.executeActions(Exec...
JAVA -- ant编译时出现Compile failed; see the compiler error output for details异常
出错的原因: 1.模块中有可能命名时出现"_"(下划线)等特殊字符 解决方案: 1.模块重新命名,或者是重新建立模块,将其下方的各个部分进行复制/粘贴
Compilation failed; see the compiler error output for details.
很久没开发android 今天突然被要求 去改一个android的项目,因为更新svn的时候很多冲突,直接删除了自己项目的所有本地代码,更新最新的代码。打开的时候各种报错,但是百度上基本都能解决,只有这个,模糊不清的解释,百度上也众说风云,找到了一个说是通过android studio 最下面一栏的 Terminal 输入 gradlew <em>compile</em>DebugSources就可以出现详细报错 ...
Compile failed; see the compiler error output for details.
哪位侠客帮我看看,真的找不出办法了!,在JDK下编译也出这错,JDK版本已一样! 2009-05-27 22:56:25,250 ERROR Javac exception Compile faile
如何解决Databinding和Dagger冲突
1.在使用dataBinding时,Android Studio出现警告Warning:Using incompatible plugins for the annotation processing: android-apt. This may result in an unexpected behavior.Error:(6, 53) 错误: 程序包com.example.liuguirong
关于怎样在AS里找错误
例:Compilation <em>failed</em>; <em>see</em> the <em>compile</em>r <em>error</em> <em>output</em> for <em>details.</em> 在练习AS共享数据时莫名其妙运行就出现了这个错误。百度了一下,看到在AS里自行找错误的方法。 在Terminal中操作:输入 gradlew <em>compile</em>Debug --stacktrace或 gradlew <em>compile</em>DebugSources --sta...
无法安装 rJava 的解决方法
安装 R 后,如果你想安装 rJava,可能会遇到一个<em>问题</em> configure:4130: <em>error</em>: Cannot <em>compile</em> a simple JNI program. See config.log for <em>details.</em> 打开 config.log interpreter : '/usr/lib64/jvm/java/jre/bin/java' archiver : '
D:\MyProject\build.xml:69: Compile failed; see the compiler error output for details.
rn用ant打包的时候出错:rn [javac] D:\MyProject\src\java\com\freeze\test\XMLTester.java:14: cannot resolve symbolrn [javac] symbol : class SAXReaderrn [javac] location: class com.freeze.test.XMLTesterrn [javac] Document aDoc = new SAXReader().read(new File("D://test//Person.xml"));rn [javac] ^rnrn昨天还好好的,而且XMLTester在eclipse上能跑起来的。rn好像是我在配置窗口上按了一下“还原默认”,就出<em>问题</em>了。rnrnHelp!!!rn
安装rails出错:未能构建本机gem的扩展
在执行gem install rails -v 5.0.0时出错: bogon:~ jinzesu$ gem install rails -v 5.0.0 Building native extensions. This could take a while… ERROR: Error installing rails: ERROR: Failed to build gem native ext...
compilation failed: see the compiler error outpur for details解决方案
    在android项目的开发过程中,时常在运行时遇到compilation <em>failed</em>: <em>see</em> the <em>compile</em>r <em>error</em> outpur for details这个错误提示,但是在项目中又找不到错误的代码行。    这是你可以通过cmd命令提示符进入项目的gradle所在目录,运行gradlew <em>compile</em>Debug -- stacktrace我的错误提示是:Caused ...
see the compiler error output for details
Compilation <em>failed</em>; <em>see</em> the <em>compile</em>r <em>error</em> <em>output</em> for details:   这个错误一般是引入的库的版过国道导致的
Android Realm数据库:Compilation failed; see the compiler error output for details.
   最近在项目中使用Realm数据库,然后就出现了一个莫名其妙的报错: Compilation <em>failed</em>; <em>see</em> the <em>compile</em>r <em>error</em> <em>output</em> for <em>details.</em> 如果再详细点: org.gradle.api.tasks.TaskExecutionException: Execution <em>failed</em> for task ':wallet:<em>compile</em>De...
安装 xunsearch 报错 与安装步骤
官方给的安装步骤:http://www.xunsearch.com/doc/php/guide/start.installation 安装目录:/usr/local/xunsearch 1. 开启/重新开启 xunsearch 服务程序,命令如下:  /usr/local/xunsearch/bin/xs-ctl.sh restart 2. 所有的索引数据将被保存在下面这个目录中:
ubuntu16.04 安装apache2报错 解决方案
apache2无法启动,如下报错:Starting apache2 (via systemctl): apache2.serviceJob for apache2.service <em>failed</em> because the control process exited with <em>error</em> code.
AndroidStudio项目导入问题
不定期更新 1. 还是万恶的打开项目就出错,这个可爱的Error模样 use embedded JDK(recommended) Download JDK 8 Select a JDK from the File System 解决方法: 1. 升级到JDK8 2. 点击 Select a JDK from the File System或者点击File选择other se
AndroidStudio 编译中遇到问题总结
  1. <em>问题</em>:运行项目中遇到,Error:Execution <em>failed</em> for task ':app:processDebugResources'. &amp;gt; com.android.ide.common.process.ProcessException: org.gradle.process.internal.ExecException: Process 'command 'E:\And...
eclipse使用中遇到的坑和解决办法链接(未完待续)
An <em>error</em> has occurred. See <em>error</em> log for more <em>details.</em> java.lang.NullPointerException 参考链接
compileDebugJavaWithJavac"错误解决">"compileDebugJavaWithJavac"错误解决
在AS中进行编译,出现如下错误: Error:Execution <em>failed</em> for task ':xxx:<em>compile</em>DebugJavaWithJavac'. > Compilation <em>failed</em>; <em>see</em> the <em>compile</em>r <em>error</em> <em>output</em> for <em>details.</em>
Compile failed; see the compiler error output for details. 解决
android编译某些java文件的时候,就是javac的时候,要设置编码格式。 这个<em>问题</em>就是项目中的某个文件的编码格式和你设定的不一样导致的。 (备份下,纠结了很久)
出现异常Compile failed; see the compiler error output for details
出现 Compile <em>failed</em>; <em>see</em> the <em>compile</em>r <em>error</em> <em>output</em> for details错误,请大家帮忙解决!!! public class CopyOfComplie
ubuntu nginx重启失败
Restarting nginx (via systemctl): nginx.serviceJob for nginx.service <em>failed</em> because the control process exited with <em>error</em> code. See &quot;systemctl status nginx.service&quot; and &quot;journalctl -xe&quot; for details 如...
Some file crunching failed, see logs for details解决方案 以及.9patch点9图片的报错的详细修改方法
报的错误是:Error:java.lang.RuntimeException: Some file crunching <em>failed</em>, <em>see</em> logs for details ? 出现这个错误的原因是一般有以下几种情况: 一、构建Gradle的时候,Gradle会去检查一下是否修改过文件的后缀名。一般大多数是出现在图片上,.jpg修改成了.png就会出现这个<em>问题</em>; 二、点9(.9)图片有<em>问题</em>也可能出现这个<em>问题</em>,原因是AndroidStudio对图片的审核非常严格,在ECLIPSE上
Docker——启动问题
前言   最近很幸运有机会和一个小组一起尝试学习K8S,小菜还是个新新手,只知道K8S的Logo像一张渔网又像一个罗盘,Docker的Logo是一个驮着集装箱的鲸鱼在海上遨游,光从Logo看,他们两者之间肯定有很大的关系。所以决定先大概知道一下Docker是干啥的,然后安装一下Docker捣鼓捣鼓!   捣鼓捣鼓嘴上说当然很简单,实际上做时才发现<em>问题</em>是一个接一个,尤其是安装过程,多亏了美女相助...
VS2017 for linux 新建项目编译异常
 错误信息:g++ exited with code 1, please <em>see</em> the Output Window - Build <em>output</em> for more details (NOTE: the build <em>output</em> verbosity might need to be changed in Tools Options to <em>see</em> more information in the Ou...
Eclipse安装SVN插件的问题
今天给Eclipse安装个SVN插件,然后访问远程仓库时就出现以下的错误了: SVN: '0x00400006:Validate Repository Location' operation finished with <em>error</em>: Selected SVN connector library is not available or cannot be loaded. 看这个提示,原
gradle与jenkins编译常见报错及解决
一、jenkins编译错误总结 1.错误一:   /data/jenkins/workspace/tv-child-release/tvApp/libraryPrj/lecore/src/com/letv/core/utils/DevicesUtils.java:1335: <em>error</em>: cannot find symbol
D:\miles28370\miles28370\application\core\build.xml:18: Compile failed; see the compiler error outpu
编译出<em>问题</em>,不知道该如何解决,帖一下错误代码 D:\miles28370\miles28370\application\core\build.xml:18: Compile <em>failed</em>; <em>see</em> the <em>compile</em>r <em>error</em> <em>output</em> for <em>details.</em> at org.apache.tools.ant.taskdefs.Javac.<em>compile</em>(Javac.java:
Android Studio Compilation failed; see the compiler error output for details.
Compilation <em>failed</em>; <em>see</em> the <em>compile</em>r <em>error</em> <em>output</em> for <em>details.</em> 这个<em>问题</em>看起来很头痛,找不到在哪里!!!!!                                                                      其实     <em>问题</em>就一目了然啦~~~~  ...
Compilation failed:internal java compiler error错误解决
在使用idea进行开发的时候,遇到了以下<em>问题</em>:进行编译运行的时候报Compilation <em>failed</em>:internal java <em>compile</em>r <em>error</em>错误解决办法:选择左上角file->setting->java <em>compile</em>r,将target bytecode version 修改为你对应的版本,如下,本人是将1.5改为1.8重新编译运行,<em>问题</em>解决
Android resource compilation failed 一定能搞定的办法
这个<em>问题</em>的原因网上有很多,就不多说了,下面是我的比较笨的解决办法,大家可以试试; 当大家看到这个<em>问题</em>的时候,可能会有一行是可以点击的文件目录,点击到报错的地方。 如果没有可以点击的地方,也可以根据目录和 “行号” 找到具体的地方; 在这里可以看到,是因为有个 name 的格式有<em>问题</em>,我们搜索这个 ‘split’ 是在哪个地方定义的(这个错误一定是xml文件有<em>问题</em>,我们只找xml文件对应的...
idea启动maven项目jar未导入到Compiler output路径中
今天在导入maven依赖的web项目时候,遇到一个<em>问题</em>。出现了没有找到对应的类。一看发现,Project <em>compile</em>r <em>output</em> 路径下的项目Lib文件夹没有东西。也就是说jar没有编译进来,一直在寻找<em>问题</em>。结果在我细心观察下,终于找到原因。下面我来给大家讲解一下原因。 1.点开Settings—-》搜索maven查看maven本地库配置。 2.点击项目结构,查看Libraries底
关于Nginx不能正常启动的问题
Job for nginx.service <em>failed</em> because the control process exited with <em>error</em> code. See “systemctl status nginx.service” and “journalctl -xe” for details 关于执行 systemctl start nginx 命令出现上述错误。 执行 syst...
SLF4J用户手册
SLF4J用户手册     简单Java日志外观(SLF4J)提供了不同的日志框架,例如java.util.logging、logback和log4j,的外观。SLF4J允许最终用户在部署时插入期望的日志框架。请注意SLF4J意味着你的库或者应用只有一个强制的依赖,即slf4j-api-1.7.12.jar。     从1.6.0版本开始,如果在类路径没有发现绑定(的日志框架),那么SLF4J
ReactNative 错误锦集
错误1: ......android/app/build/intermediates/res/merged/release/drawable-hdpi/node_modules_reactnavigationstack_dist_views_assets_backicon.png: <em>error</em>: un<em>compile</em>d PNG file passed as argument. Must be c...
react-native遇到过的错误
记录下使用react-native过的错误,实习期间一直没空写博客~~~ 1、development return response <em>error</em> 500:一般是引用文件组件等的路径错误,找不到; 2、cannot excute importjavascriptexception: 一般是写错变量名称等; 3、导入图片资源时,需要重新打包; 4、Application has not been
大家看看,这是什么错误:Compile failed; see the compiler error output for details.
JSP页面的内容如下: <!DOCTYPE HTML PUBLIC "-//W3C//DTD HTML 4.0 Transitional//EN"> tex
异常:“app:compileDebugJavaWithJavac”> Compilation failed; see the compiler error output for details.
 碰到这个异常我也是挺无语的,因为Android Studio根本不会提示你详细的错误信息。我们来看看这个博主:http://blog.csdn.net/runner__1/article/details/53482565我就是借鉴他找错的经历找到错误的在命令行中进入项目的根目录,或者可以在Android studio的Terminal中直接操作也可以,然后敲入一个命令: gradlew comp...
Compile failed; see the compiler error output for details
 出现 Compile <em>failed</em>; <em>see</em> the <em>compile</em>r <em>error</em> <em>output</em> for details错误,请大家帮忙解决!!!public class CopyOfComplierToClass2 {  public boolean sourceConvertClass() {  boolean flag = false;  File f = new File("d:/gener
Compile Error出现的原因
1.提交时所用的语言不对,比如c++的程序用c交了(c写的程序用c++提交可以过); 2.程序连编译都不能过,有各种错误。
安装atom插件
今天早上没事干,受够了sublime给我出的一些<em>问题</em>,现在的3版本中文的文件夹不显示,而且查找功能也不行,在尾部都不能查找前面的,让我很恼火。最近看网上说的最多的前端编辑器就是atom,所以决定尝试一番。  对于一个编辑器来说,当然可以直接用,但是为了提高我们的开发效率,当然得先安装一些插件来提高我们的生产效率。这里首先要安装的就是Emmet这个插件了,这个不用多说,做前端的应该都知道这个插件的功能
Cmake 编译配置失败
配置选项 选择的  VS 12 2013 The C <em>compile</em>r identification is MSVC 18.0.21005.1 The CXX <em>compile</em>r identification is MSVC 18.0.21005.1 Check for working C <em>compile</em>r: C:/Program Files (x8
centOS 7下无法启动网络(service network start)错误解决办法(应该是最全的了。。。)
今天在centOS 7下更改完静态ip后发现network服务重启不了,翻遍了网络,尝试了各种方法,终于解决了。      现把各种解决方法归纳整理,希望能让后面的同学少走点歪路。。。 首先看<em>问题</em>:执行service network restart命令后出现下面的错误: Restarting network (via systemctl): Job for network.servic
docker 启动报错
请教下centos7启动docker异常? 启动docker [root@centos7-linux--wd ~]# service docker start Starting docker (via systemctl): Job for docker.service <em>failed</em>. See 'systemctl status docker.service' and 'journalctl ...
快速解决Error:Execution failed for task ':app:compileReleaseJavaWithJavac'. > Compilation failed; see th
> 自从AS升级2.3之后,偶尔遇到一个<em>问题</em> Error:Execution <em>failed</em> for task ':appmain:<em>compile</em>ReleaseJavaWithJavac'. > Compilation <em>failed</em>; <em>see</em> the <em>compile</em>r <em>error</em> <em>output</em> for <em>details.</em> 并没有提示错误的具体地方,然后查看代码也没有报错的地方 一分钟之内可以解决
Android 使用RecyclerView的方法
1.在build.gradle(Module:app)中添加依赖 implementation 'com.android.support:recyclerview-v7:26.1.0' 注:版本号应该与implementation 'com.android.support:appcompat-v7:26.1.0'中的版本号相同...
Bmob之Error:Execution failed for task ':app:compileDebugJavaWithJavac'. > Compilation failed; see the
最近在写Bmob相关内容,又遇到了这个<em>问题</em>,之前遇到过该<em>问题</em>,忘记怎么解决的了,今天又遇到调试了好久,特发一贴来记录一下,防止再走老路。 <em>问题</em>描述:Error:(19, 55) 错误: 无法访问Subscription,找不到rx.Subscription的类文件;Error:Execution <em>failed</em> for task ':app:<em>compile</em>DebugJavaWithJavac'.
Android Studio加载第三方jar包,出现包重复加载的问题解决(:app:compileInsideDebugJava FAILED)
最近在做一个项目的时候,引用了好多第三方包,确实,开源就是不错,用起来舒服,但是,他就是编译不通过了,报以下错误: :app:<em>compile</em>InsideDebugJava FAILED FAILURE: Build <em>failed</em> with an exception. * What went wrong: Execution <em>failed</em> for task ':app:<em>compile</em>Ins
compileDebugJavaWithJavac
现象: 在AS中进行编译,出现如下错误: Error:Execution <em>failed</em> for task ‘:xxx:<em>compile</em>DebugJavaWithJavac’. Compilation <em>failed</em>; <em>see</em> the <em>compile</em>r <em>error</em> <em>output</em> for <em>details.</em> 2 在网上找了几种方案:.1解决: 缺少了一个lib的引用,在iml文件中,加上
weblogic问题以及解决方法
一、 weblogic异常Error parsing descriptor in Web appplication 解决方法 使用weblogic部署war项目里,有些项目可以部署,但有些不行,出现以下异常。 异常如下: An <em>error</em> occurred during activation of changes, please <em>see</em> the log for <em>details.</em> ...
使用lifecycle时,1.0.0和1.0.3问题解决方法
lifecycle报错
Maven 编译命令错误之编译错误的解决
引言: 解决在Linux系统中,运行mvn命令碰到的一个编译<em>问题</em>,看看如何分析并加以解决的?
搜索引擎xunsearch的配置、安装
前言 搜索引擎、文本识别这一块自己suo'ra
ionic4开发(遇到的问题)[不更新了推荐使用UniApp]
&gt; ionic cordova platform add android C:\Users\lenovo\AppData\Roaming\npm\node_modules\cordova\node_modules\configstore\index.js:65 throw err; Error: EPERM: operation not pe...
Android Error:Execution failed for task ':app:compileDebugJavaWithJavac' 解决方案
最近Android项目开发中碰到一个异常 Google、百度搜索前两页内容浏览了一遍,总结了几种方案:   1、升级更新buildToolsVersion 到最新版本 2、升级Android Studio 2.2.2版本,JDK 1.8版本 android { <em>compile</em>SdkVersion 25 buildToolsVersion "25.
Android studio 报错修改
错误: Error:Unable to start the daemon process. This problem might be caused by incorrect configuration of the daemon. For example, an unrecognized jvm option is used. Please refer to the user guide
IntelliJ IDEA 编译报错:Error:java: Compilation failed: internal java compiler error
IntelliJ IDEA使用教程 (总目录篇) 报错内容: Information:Using javac 1.8.0_73 to <em>compile</em> java sources Information:java: javacTask: 源发行版 1.8 需要目标发行版 1.8 Information:java: Errors occurred while compiling module 'EZS...
调用 Ant api 出现Compile failed; see the compiler error output for details异常
-
解决Installation error: INSTALL_FAILED_INSUFFICIENT_STORAGE
解决 Installation <em>error</em>: INSTALL_FAILED_INSUFFICIENT_STORAGE 试试修改一下manifest文件
maven 编译时遇到的问题 resources 与 compiler
 maven编译时遇到<em>问题</em>: [FATAL ERROR] Plugin realm = app0.child-container[org.apache.maven.plugins:maven-resources-plugin:2.3] urls[0] = file:/C:/Documents and Settings/Administrator/.m2/repository/org/apa...
Xcode9 在Swift 4.0下编译时第三方框架报错Swift compiler Error的解决方案
更多原创文章,请访问:https://takioo.cn 随着 Xcode9 Swift 4.0 的到来,一些小<em>问题</em>也接踵而至。   许多优秀的 Swift 第三方框架还没有来得及迎接 Swift 4.0 的到来,它们还停留在 Swift3.x 的状态。 这个时候新建一个项目,使用cocoapods 引入所需的第三方,即使 pod install 成功后,一编译工程就是满屏红, 且报错 ...
unity3d打APK包时出现的内部构建错误(笔记)
Internal <em>compile</em>r <em>error</em>. See the console log for more information. <em>output</em> was; Error building Player because scripts had <em>compile</em>r <em>error</em>s unity打包APK包出现内部构建错误的时候。 1。关闭unity,打开工程项目文件。 2。删除Library文件夹,
关于ANT编译报错
BUILD FAILED E:\workspaceSit\antbuild\build.xml:56: The following <em>error</em> occurred while execut ing th
Caused by: org.gradle.tooling.BuildException: Failed to process resources, see aapt output above for
今天在写一个圆角边框的时候,可能是懵逼的吧,之前运行程序一直没错,再运行就出来Caused by: org.gradle.tooling.BuildException: Failed to process resources, <em>see</em> aapt <em>output</em> above for 这个错误,刚开始以为我的build tools 坏了,重新下载一个,还是不行。详细看了一下错误,说我另外一个文件找不到了...
org.gradle.tooling.BuildException: Failed to process resources, see aapt output above for details.
AS 升级3.1以后遇到了各种坑,比如:想让降低targetSdkVersion,然后开始了报错之旅:  直接删除mainfest中的roundIcon,因为低版本是没有这个SDK的; android:roundIcon=&quot;@mipmap/ic_launcher_round&quot; 再次build项目,发现还有一点小<em>问题</em>,原来新版本AS的res目录下会多出两个文件: 果断删除,重新编译...
关于 AAPT2 error: check logs for details.
在as3.0版本的项目有人出现这个 AAPT2 <em>error</em>: check logs for <em>details.</em><em>问题</em>,其中的一个解决办法就是在项目的gradle.properties中添加一行“android.enableAapt2=false ”代码就行了。但是这个办法只是一部分人的<em>问题</em>,有些的人但添加了这行代码就会出下 “ Process 'command 'E:\Android\Sdk\buil...
android studio3.2一个坑: Failed to process resources, see aapt output above for details.
最近升级了android studio 3.2,然后我使用的引用是: api 'com.android.support:appcompat-v7:28.0.0' 然后就报错了,编译不通过: org.gradle.api.tasks.TaskExecutionException: Execution <em>failed</em> for task ':app:processDebugResources'. a...
AndroidStudio编译时出现的几个问题
开发环境 OS:Windows 10 AndroidStudio version:2.1.3 Gradle version:2.14.1 JDK:1.8 <em>问题</em>1: 无效的源版本1.7 <em>问题</em>2:adb命令
【Unity3D】Unity3d打包APK出现的问题—无法找到tool.jar
1.Unable to merge android manifests.See the console for more <em>details.</em> See the console for details
centos7.4中ntpd无法启动,并且journalctl命令报错
使用systemctl restart ntpd重启ntpd服务时报错无法重启: Job for ntpd.service <em>failed</em> because a configured resource limit was exceeded. See “systemctl status ntpd.service” and “journalctl -xe” for <em>details.</em> 使用jou...
第一章:我的入门级rocketMQ
使用环境:windows 7. 服务地址下载:rocketMQ windows环境服务 代码转载自: RocketMQ 消息队列单机部署及使用  上代码: 1、maven依赖 com.alibaba.rocketmq rocketmq-client 3.2.6 2、创建生产者 package org.apache.rocketmq.test.demo; im
调用 Ant api 出现Compile failed; see the compiler error output for details异常
[b][color=red][color=red][color=red]该方法是把d:/generator-<em>output</em>/hibernate/code/这个文件夹下的多个.java编译为.class文件[/color][/color][/color][/b]rnrn但是出现Compile <em>failed</em>; <em>see</em> the <em>compile</em>r <em>error</em> <em>output</em> for details异常,希望大家帮忙解决,谢了rnrnpublic boolean sourceConvertClass() rn boolean flag = false;rn File f = new File("d:/generator-<em>output</em>/hibernate/code/");rnrn // 找到所有的文件rn File[] files = f.listFiles();rn Javac <em>compile</em>r = new Javac();rn File destFile = null;rn for (File file : files) rn // 找出不含.java文件rn if (file.getName().contains(".java")) rn <em>compile</em>r.setProject(new Project());rn // 编译后的.class文件存放的路径rn destFile = new File("d:/generator-<em>output</em>/hibernate/code/");rn destFile.mkdirs();rn // 要编译的源文件目录rn Path srcPath = new Path(<em>compile</em>r.getProject(),rn "d:/generator-<em>output</em>/hibernate/code/");rn <em>compile</em>r.setFork(true);rn <em>compile</em>r.setSrcdir(srcPath);rn <em>compile</em>r.setDestdir(destFile);rn try rn <em>compile</em>r.execute();rn flag = true;rn catch (BuildException e) rnrn //System.out.println("编译.class文件出现错误");rn rn rnrn rnrn return flag;rn rn
最新版记事狗微博客系统1.0.0 beta build 20100206版下载
最新版记事狗微博客系统1.0.0 beta build 20100206版 首发csdn.net 记事狗全名“记事狗微博客系统”,是一套全新的互动社区系统,其限定每个话题只有140个字(称为微博),即减轻了发帖人的压力,又节省了看帖人的时间;会员可在个人主页中即时查看到其所关注人发表的信息,并能通过参与评论,将原话题转发给关注自己的人,使有价值的话题得到极大的传播。 微博系统的出现,解决了BBS系统无法解决的“劣币驱逐良币”的问题,也解决了Blog系统中话题无法有效传播的问题,也解决了SNS系统双向好友泛滥的问题,是一个顺势而生的系统。 最新版本及描述见 http://www.jish 相关下载链接:[url=//download.csdn.net/download/foxis/2052820?utm_source=bbsseo]//download.csdn.net/download/foxis/2052820?utm_source=bbsseo[/url]
Java成绩管理系统下载
成绩管理系统,能管理学生的成绩,用到数据库 相关下载链接:[url=//download.csdn.net/download/talentchan/2113297?utm_source=bbsseo]//download.csdn.net/download/talentchan/2113297?utm_source=bbsseo[/url]
Struts2中文教程文档下载
里面用实例和java代码来讲解struts2的内容 ,冲用户的请求开始讲 相关下载链接:[url=//download.csdn.net/download/wanglujiawl/2238419?utm_source=bbsseo]//download.csdn.net/download/wanglujiawl/2238419?utm_source=bbsseo[/url]
文章热词 设计制作学习 机器学习教程 Objective-C培训 交互设计视频教程 颜色模型
相关热词 mysql关联查询两次本表 native底部 react extjs glyph 图标 java jdk 学习 java学习中的jdk
我们是很有底线的