运行tomcat6.exe后出现错误 [问题点数:20分,结帖人jtyzyz]

Bbs1
本版专家分:29
结帖率 100%
Bbs3
本版专家分:624
Bbs5
本版专家分:4567
Bbs4
本版专家分:1144
网站发布后,运行messagebox出现错误
在本地<em>运行</em>是没有<em>错误</em>的,发布后,比如说点了“购买”按钮后,应该跳出messagebox的提示框,提示“是否确定购买”,但是却报错,不知道什么原因,用的是.net,版本是3.5的,语言是C#,请各位高手帮我想想办法啊!下面是报错信息:大家帮我看一下啊rn当应用程序不是以 UserInteractive 模式<em>运行</em>时显示模式对话框或窗体是无效操作。请指定 ServiceNotification 或 DefaultDesktopOnly 样式,以显示服务应用程序发出的通知。 rn说明: 执行当前 Web 请求期间,<em>出现</em>未处理的异常。请检查堆栈跟踪信息,以了解有关该<em>错误</em>以及代码中导致<em>错误</em>的出处的详细信息。 rnrn异常详细信息: System.InvalidOperationException: 当应用程序不是以 UserInteractive 模式<em>运行</em>时显示模式对话框或窗体是无效操作。请指定 ServiceNotification 或 DefaultDesktopOnly 样式,以显示服务应用程序发出的通知。rnrn源<em>错误</em>: rnrn执行当前 Web 请求期间生成了未处理的异常。可以使用下面的异常堆栈跟踪信息确定有关异常原因和发生位置的信息。 rnrn堆栈跟踪: rnrnrn[InvalidOperationException: 当应用程序不是以 UserInteractive 模式<em>运行</em>时显示模式对话框或窗体是无效操作。请指定 ServiceNotification 或 DefaultDesktopOnly 样式,以显示服务应用程序发出的通知。]rn System.Windows.Forms.MessageBox.ShowCore(IWin32Window owner, String text, String caption, MessageBoxButtons buttons, MessageBoxIcon icon, MessageBoxDefaultButton defaultButton, MessageBoxOptions options, Boolean showHelp) +2<em>6</em><em>6</em>2442rn System.Windows.Forms.MessageBox.Show(String text, String caption, MessageBoxButtons buttons, MessageBoxIcon icon) +23rn Front_Master_productDetail.btnBuy_Click(Object sender, EventArgs e) +<em>6</em>9rn System.Web.UI.WebControls.Button.OnClick(EventArgs e) +111rn System.Web.UI.WebControls.Button.RaisePostBackEvent(String eventArgument) +110rn System.Web.UI.WebControls.Button.System.Web.UI.IPostBackEventHandler.RaisePostBackEvent(String eventArgument) +10rn System.Web.UI.Page.RaisePostBackEvent(IPostBackEventHandler sourceControl, String eventArgument) +13rn System.Web.UI.Page.RaisePostBackEvent(NameValueCollection postData) +3<em>6</em>rn System.Web.UI.Page.ProcessRequestMain(Boolean includeStagesBeforeAsyncPoint, Boolean includeStagesAfterAsyncPoint) +15<em>6</em>5rnrn rnrnrn--------------------------------------------------------------------------------rn版本信息: Microsoft .NET Framework 版本:2.0.50727.3<em>6</em>03; ASP.NET 版本:2.0.50727.3082
运行成功后,出现runtime error错误
vc<em>6</em>.0操作sql server 2000数据库。那位高手熟悉_RecordsetPtr指针操作,帮小弟看看下面的代码吧,能够实现我要的向TwoConditionSet表中插入数据,但是结束后就<em>出现</em>rnrn Runtime error!rn this application has requested the runtime to terminate it in an unusual way.rn please contact the application's support team for more information.rn 的<em>错误</em>。rn是因为结束后没有对指针处理导致的吗??? 求指点!!!rnrnvoid Createtwice()rnrnrn ADOConn ado;rn int countnumber=0;rn int circletime=0;rn CString strsql="select * from OneConditionSet where oncehouse=1";rn _bstr_t bstrsql(strsql);rnrn _variant_t varconditionstr1;rn _variant_t varconditionstr2;rn _variant_t varcondition1;rn _variant_t varcondition2;rn _variant_t varhouse;rn _variant_t varhousespt;rnrnrnrn _RecordsetPtr m_pRecordset1=ado.GetRecordSet(bstrsql);rn _RecordsetPtr m_pRecordset2;rnrn varconditionstr1=m_pRecordset1->GetCollect("oncecondit");rn conditionstr1=(char *)_bstr_t(varconditionstr1);rnrn varcondition1=m_pRecordset1->GetCollect("onceeducat");rn condition1=(char *)_bstr_t(varcondition1);rnrn while(!m_pRecordset1->adoBOF)rn rnrnrn for(int j=0;jMoveNext();rn if(circletime==0)rn m_pRecordset1->MoveNext();rnrn if(circletime!=0)rn rn varconditionstr1=m_pRecordset1->GetCollect("oncecondit");rn conditionstr1=(char *)_bstr_t(varconditionstr1);rnrn varcondition1=m_pRecordset1->GetCollect("onceeducat");rn condition1=(char *)_bstr_t(varcondition1);rn m_pRecordset1->MoveNext();rn rnrn rn m_pRecordset2=m_pRecordset1;rnrn while(!m_pRecordset2->adoEOF)rn rn varconditionstr2=m_pRecordset2->GetCollect("oncecondit");rn conditionstr2=(char *)_bstr_t(varconditionstr2);rnrn varcondition2=m_pRecordset2->GetCollect("onceeducat");rn condition2=(char *)_bstr_t(varcondition2);rnrn if(conditionstr1!=conditionstr2)rn rn countnumber++;rn CString string="insert into TwoConditionSet(twiceid,twiceconditstr1,twicecondit1,twiceconditstr2,twicecondit2,";rn string+="twicecondit12spt,twicehouse,twicehousespt)values(%d,'%s','%s','%s','%s',%d,%d,%d)";rn CString str;rn str.Format(string,countnumber,conditionstr1,condition1,conditionstr2,condition2,conditionspt,house,housespt);rn _bstr_t bstrsql1(str);rn ado.ExecuteSQL(bstrsql1);rn rn m_pRecordset2->MoveNext();rnrn rn circletime++;rn m_pRecordset1->MoveFirst();rn rn rn
编译后运行出现Automation错误
在vb中<em>运行</em>没问题,编译后在Windows 2000 Server 中<em>运行</em><em>出现</em>Automation<em>错误</em>rnrn<em>错误</em>:rn<em>运行</em>时<em>错误</em> '-214702472<em>6</em>(800700aa)':rnAutomation <em>错误</em>.
打包安装后运行出现错误
我做了一个数据库的程序,原来是用VB中自带的打包工具来打包的,后来发现说有些系统文件过期在一些系统上安装不上,后来在这个论坛上有人介绍了一个专业的打包工具SETUP FACTORY,我使用这个工具打包后在原先不能安装的机器上均可以安装了,但是后来我的朋友拿到另外一台没有安装VB的机器上发现可以安装上了可是在程序在<em>运行</em>的时候却说<em>运行</em>时<em>错误</em>,<em>错误</em>代码好像是为什么173,是他告诉我的。后来我想到是不是需要安装MDAC_TYP这个数据库的访问工具,安装后还是<em>出现</em>那个<em>运行</em>时的<em>错误</em>,此时我把原先的源程序直接让他拷贝过去直接<em>运行</em>可执行文件还是<em>出现</em>同样的<em>错误</em>,说明不是安装的问题,不知道这个问题应该如何解决?是不是需要什么.DLL文件啊,我不太明白!有人告诉我说是那台机器没有安装SP5的原因,我上网搜索了一下发现VBSP5这个文件特别打,难道是必须安装这些文件用VB开发的程序才可以<em>运行</em>吗???rn
运行phpmyadmin后,出现错误:MySQL said:
PHP:--------------------------------------------------------------------------------rnWelcome to phpMyAdmin 2.4.0-rc1rnrnrnErrorrnrnMySQL said: rnrnLost connection to MySQL server during queryrn页面标题为:Access denied
关于android mediaplayer 多次运行出现错误
public void voulce() rn rn if (STR.length() >= n * 3&&STR!=null) rn for (int k = 0; k < 2; k++) rn int x = 0;rn for (int i = 0; i < n; i++) rn if (STR.subSequence(x, (x + 3)).equals("00 ")) rn music = MediaPlayer.create(this,R.raw.music0); rn music.start(); rn else if (STR.subSequence(x, (x + 3)).equals("01 ")) rn music = MediaPlayer.create(this,R.raw.music1);rn music.start();rn else if (STR.subSequence(x, (x + 3)).equals("02 ")) rn music = MediaPlayer.create(this,R.raw.music2);rn music.start();rn else if (STR.subSequence(x, (x + 3)).equals("03 ")) rn music = MediaPlayer.create(this,R.raw.music3);rn music.start();rn else if (STR.subSequence(x, (x + 3)).equals("04 ")) rn music = MediaPlayer.create(this,R.raw.music4);rn music.start();rn else if (STR.subSequence(x, (x + 3)).equals("05 ")) rn music = MediaPlayer.create(this,R.raw.music5);rn music.start();rn else if (STR.subSequence(x, (x + 3)).equals("0<em>6</em> ")) rn music = MediaPlayer.create(this,R.raw.music<em>6</em>);rn music.start();rn else if (STR.subSequence(x, (x + 3)).equals("07 ")) rn music = MediaPlayer.create(this,R.raw.music7);rn music.start();rn else if (STR.subSequence(x, (x + 3)).equals("08 ")) rn music = MediaPlayer.create(this,R.raw.music8);rn music.start();rn else if (STR.subSequence(x, (x + 3)).equals("09 ")) rn music = MediaPlayer.create(this,R.raw.music9); rn music.start();rn rn x += 3;rn try rn Thread.sleep(500);rn catch (InterruptedException e) rn // TODO Auto-generated catch blockrn e.printStackTrace();rn rn rn try rn Thread.sleep(800);rn catch (InterruptedException e) rn // TODO Auto-generated catch blockrn e.printStackTrace();rn rn rn music.stop();rn Log.i("mediaplayer", "music"+music);rn music=null;rn rn rn rn如题,这是我的部分代码,开始<em>运行</em>时候是正常的,但是播放10多次之后就会报ERROR(1,-19)这样的<em>错误</em>,接着就不再继续播放了,网上有人说在start前面加stop和prepare,实测会<em>出现</em>error(0.38)<em>错误</em>,求大神看过来rnPS:我是用真机测试的!
c++运行出现如图所示错误
[img=http://img.my.csdn.net/uploads/201211/30/13542781<em>6</em>5_799<em>6</em>.png][/img]rnrnrn代码如下:rnvoid CMy10_1<em>6</em>Dlg::On_Hist_Equal() rnrn // TODO: Add your control notification handler code herern char *pri_imgname = (LPSTR)(LPCTSTR)PathName;rn char *histequ_imgname= "2.bmp";rn readBmp(pri_imgname); rn //定义lpDIB,将像素数据赋给lpDIB(用于Fourier变换实参)rn// unsigned char * pixbuf;rn// pixbuf= new unsigned char[bmpWidth*bmpHeight];rn// memcpy(pixbuf,pBmpBuf,bmpWidth*bmpHeight);rn rn // 存放FFT之后像素数据 rn unsigned char *Hist_Norm = new unsigned char[bmpWidth*bmpHeight] ;rn memset(Hist_Norm,'\0',sizeof(Hist_Norm));rnrn HistEqual(pBmpBuf, Hist_Norm, bmpWidth, bmpHeight);rn rn saveBmp(histequ_imgname , Hist_Norm , bmpWidth, bmpHeight, 8, pColorTable);rn rn // Fourier变换之后图像显示rn CBitmap Bmp_show;rn Bmp_show.m_hObject = (HBITMAP)::LoadImage(GetModuleHandle(NULL),"2.bmp",IMAGE_BITMAP,0,0,LR_LOADFROMFILE);rn Source_Img.SetBitmap(Bmp_show);rn DeleteObject(Bmp_show.m_hObject);rn delete IFFT_Result;rnrn添加了以上代码之后<em>出现</em>的<em>错误</em>
apache运行一段时间后出现如下错误
ERROR: The requested URL could not be retrievedrnrn--------------------------------------------------------------------------------rnrnWhile trying to retrieve the URL: http://localhost/ rnrnThe following error was encountered: rnrnERROR 207 -- Cannot access the proxy-cache server through the URL that you entered. rnThis means that: rnrnYou may not use this proxy to connect to that url. rnrn中间没对apache做任何改动,<em>运行</em>一段时间后就<em>出现</em>这个<em>错误</em>
运行apt-get update后出现错误
一般<em>错误</em>是如下两种: 1、一般如果你的ubuntu是中文的设定了地区的,<em>错误</em>是如下: W: 无法下载http://ppa.launchpad.net/deluge-team/ppa/ubuntu/dists/natty/main/source/Sources 404 Not Found W: 无法下载http://ppa.launchpad.net/deluge-team/ppa/u
。net2.0发布到服务器后运行出现错误
。net2.0发布到服务器后<em>运行</em><em>出现</em><em>错误</em>rn[img=http://hi.csdn.net/attachment/20100<em>6</em>/12/3931419_127<em>6</em>307<em>6</em>85f7W<em>6</em>.jpg][/img]rn我修改了配置文件好像也不行
手工运行tomcat6.exe与设置开机启动区别??
手工<em>运行</em><em>tomcat</em><em>6</em>.<em>exe</em>与设置开机启动有什么区别??rnrn为什么我的网站某些功能要手工<em>运行</em><em>tomcat</em><em>6</em>.<em>exe</em>才可以使用,随机启动的<em>tomcat</em>功能失效??rnrn是什么原因?
对话框运行出现错误..
<em>错误</em>:fatal error C1083: Cannot open source file: 'D:\Documents and Settings\vc\对话框\MsgDlg.cpp': No such file or directoryrnError <em>exe</em>cuting cl.<em>exe</em>.rn说找不到源文件~这是什么回事呀~我什么都没动~清高手指教~在哪能恢复原文件
数据库运行出现错误
我学ACCESS数据库VBA编程,有下面这一段程序,rnPrivate Sub cmd_连接_Click()rnDim i As IntegerrnDim rcd As StringrnDim cn As ADODB.ConnectionrnDim rs As New ADODB.RecordsetrnSet cn = CurrentProject.Connectionrnrs.Open "T0040_原材料清单", cnrnDo Until rs.EOF = Truern For i = 0 To rs.Fields.Count - 1rn rcd = rcd & rs.Fields(i) & " "rn Next irn rs.MoveNextrn rcd = rcd & Chr(10)rnLooprnMsgBox rcd, , rs.Source & " 的记录集"rnrs.Close: Set rs = Nothingrncn.Close: Set cn = NothingrnEnd Subrn可是<em>运行</em>时<em>出现</em><em>错误</em>:rn[img=https://img-bbs.csdn.net/upload/201903/21/1553132918_191<em>6</em>7.jpg][/img]rn出错行代码:rnDim cn As ADODB.Connectionrn请高手指教,如何解决?谢谢!
opencv运行出现错误
当<em>出现</em><em>错误</em> AttributeError: 'NoneType' object has no attribute 'copy' 进行图像检测时,一般就是你读取的路径不对,没读取到图像,或是读取图像的格式不对,如JPG写成png格式 ...
运行程序出现错误
我点击“开始<em>运行</em>”,就<em>出现</em>一个提示框,内容是“JIT调试失败,<em>出现</em>以下<em>错误</em>:拒绝访问。JIT调试由用户帐户NT AUTHORITY\NETWORK SERVICE 启动。rn这是什么原因呢?
运行MVC出现错误
--------------------------------------------------------------------------------rnrn对控制器类型“StoreController”的操作“Details”的当前请求在下列操作方法之间不明确: rn类型 MvcApplication4.Controllers.StoreController 的 System.Web.Mvc.ActionResult Details(Int32)rn类型 MvcApplication4.Controllers.StoreController 的 System.String Details() rnrn这是程序相关代码:rn // GET: /Store/Browsernrn public ActionResult Details(int id)rn rnrn var book = new Book Title = "书籍 " + id ;rnrn return View(book);rnrnrnrn rnrn我是新手。谢谢
运行出现错误
我在编译我的程序是没有<em>错误</em>,但当<em>运行</em>到第5个窗体的时候,<em>出现</em>了这样的<em>错误</em>rn我不知道是怎么回事rnproject progect1.<em>exe</em> raised exception class eaccessviolation withrnmessage'access violation at addree 004038D9 in module'PROJECT1.EXE'.rnread of address FFFFFFFB' process stopped.use step or run to contiune.
Java运行出现错误
Java编程后<em>运行</em><em>出现</em><em>错误</em>: Java HotSpot™ <em>6</em>4-Bit Server VM warning: Sharing is only supported for boot loader classes because bootstrap classpath has been appended 搞了很久也没更改正确,在线请教,谢谢! ...
运行出现错误
请教,哪里错了。rn#includern#includernusing namespace std;rnint main()rn string text;rn const string sep=",.\"\n ";rn const int max_word=100;rn string word[max_word]=0;rn cout<);rn int start=text.find_first_not_of (sep);rn int end=0;rn int word_count=0;rn while(start!=string::npos&&word_count
FFmpeg运行出现错误
ffmpeg正常安装后执行ffmpeg时<em>出现</em>如下<em>错误</em>: ffmpeg: error while loading shared libraries: libavdevice.so.53: cannot open shared object file: No such file or directory 解决办法: vi /etc/ld.so.conf 加入:/usr/local/lib 执
qt5运行出现错误
<em>运行</em>qt项目的时候<em>出现</em>如下<em>错误</em>: usr/bin/ld: cannot find -lGL collect2: error: ld returned 1 exit status make: Leaving directory `/root/QT5/CH4/CH401/DialogExample' make: *** [DialogExample] Error 1 14:02:03: Th
运行java-plugin出现错误
我写了一个Applet (名字为Applet1.java)以及一个jar档案(dt5.jar),一个JSPrn页面。主要程序为rnrnrnNot Support!rnrnrn注册表里JAVA插件为1.3rn<em>运行</em>为Not Support!rn不知哪位能为我解决?先谢了
delphi 运行出现错误
如题 <em>运行</em> 点击某个按钮之后 <em>出现</em><em>错误</em>rnraise <em>exe</em>cption EInvalidGridOperation with message'Grid index out of range'rnrn不知道是什么问题? 看意思 好像是Grid超出界限了?rn要怎么解决rnrn还有一个问题 是关于DBGrid的 rn我把从数据库里面查询出来的数据放到DBGrid 滚动滚轮 可是数据到了显示的最下面就不继续下去了 rn实际上 还有好多数据在下面 而且 光标 也是停留在上面我刚一开始点中的那一行,并没有随着我的滚轮而相应的rn往下走 不知道高手 这个是属性里面设置的嘛?
运行出现错误
当我<em>运行</em>一个程序的时候<em>出现</em>下面的对话框,是什么意思?rn"0x00404ea0"指令引用的"0xcccccccc"内存。该内存不能为"read"。rn要终止程序,请单击“确定”。rn要调试程序,请单击“取消”。下面的程序是我<em>运行</em>的源代码.估计应该和代码没有关系rn源代码是:rn#includern#includernconst char null='\0';rnstatic char *strsave(char *s)rnrn char *p;rn p=new char[strlen(s)+1];rn strcpy(p,s);rn return p;rnrnclass Date_recrnrnprotected:rn char *name;rn char *id_number;rnpublic:rn Date_rec()rn rn name=null;rn id_number=null;rn rn Date_rec(char *name1,char *idnumber1)rn rn name=strsave(name1);rn id_number=strsave(id_number);rn rn ~Date_rec()rn rn delete []name;rn delete []id_number;rn rn void print()rn rn cout<<<
运行出现如下错误
import java.awt.Color;rnimport java.io.*; rnimport java.util.ArrayList;rnimport java.util.List;rnrnimport org.jfree.data.*; rnimport org.jfree.chart.*; rnimport org.jfree.chart.plot.*; rnimport org.jfree.chart.renderer.category.BarRenderer3D;rnimport org.jfree.data.category.CategoryDataset;rnimport org.jfree.data.category.DefaultCategoryDataset;rnimport org.jfree.chart.demo.BarChartDemo1;rnrn rnrnpublic class JFreeBarChartDemo rnrnrn public static void main(String[] args) throws IOExceptionrn //第一步:设置数据源 rn CategoryDataset dataset = getDataSet2(); rn //第二步:生成jfreechart图形rn JFreeChart chart = ChartFactory.createBarChart3D( rn "水果产量图", // 图表标题 rn "水果", // 目录轴的显示标签 rn "产量", // 数值轴的显示标签 rn dataset, // 数据集 rn PlotOrientation.VERTICAL, // 图表方向:水平、垂直 rn true, // 是否显示图例(对于简单的柱状图必须是false) rn false, // 是否生成工具 rn false // 是否生成URL链接 rn ); rn // 第三步:生成装载图形的特殊面板 [Jv5kl_Q rn chart.setTitle("这里设置标题"); rn CategoryPlot plot = chart.getCategoryPlot();rn //设置颜色rnrn BarRenderer3D renderer = new BarRenderer3D();rn renderer.setSeriesPaint(0, Color.green);rn renderer.setSeriesPaint(1, new Color(0, 100, 255));rn renderer.setSeriesPaint(2, Color.RED); plot.setRenderer(renderer);rnrn rn FileOutputStream fos_jpg = null; rn try rn fos_jpg = new FileOutputStream("D:\fruit.jpg"); rn ChartUtilities.writeChartAsJPEG(fos_jpg,1,chart,400,300,null); rn finally rn try rn fos_jpg.close(); rn catch (Exception e) rn rn rn rn private static CategoryDataset getDataSet() rn DefaultCategoryDataset dataset = new DefaultCategoryDataset(); rn dataset.addValue(100, null, "苹果"); rn dataset.addValue(200, null, "梨子"); rn dataset.addValue(300, null, "葡萄"); rn dataset.addValue(400, null, "香蕉"); rn dataset.addValue(500, null, "荔枝"); rn return dataset; rn rn rn private static CategoryDataset getDataSet2() rn DefaultCategoryDataset dataset = new DefaultCategoryDataset();rn rnrn dataset.addValue(100, "北京", "苹果"); rn dataset.addValue(100, "上海", "苹果"); rn dataset.addValue(100, "广州", "苹果"); rn dataset.addValue(200, "北京", "梨子"); rn dataset.addValue(200, "上海", "梨子"); rn dataset.addValue(200, "广州", "梨子"); rn dataset.addValue(300, "北京", "葡萄"); rn dataset.addValue(300, "上海", "葡萄"); rn dataset.addValue(300, "广州", "葡萄"); rn dataset.addValue(400, "北京", "香蕉"); rn dataset.addValue(400, "上海", "香蕉"); rn dataset.addValue(400, "广州", "香蕉"); rn dataset.addValue(500, "北京", "荔枝"); rn dataset.addValue(500, "上海", "荔枝"); rn dataset.addValue(500, "广州", "荔枝"); rn return dataset; rn rn rn rn rnrnrn<em>运行</em><em>出现</em>下面<em>错误</em>:rnException in thread "main"java.io.FileNotFoundException:D:fruit.jpgrnat java.io.FileOutputStream.openrnat java.io.FileOutputStream.rnat java.io.FileOutputStream.rnat JFreeBarChartDemo.main< JFreeBarChartDemo.java:4<em>6</em>>
运行过程中,出现错误
[img=http://img.my.csdn.net/uploads/201303/28/13<em>6</em>44749<em>6</em><em>6</em>_<em>6</em>118.jpg][/img]
运行PHP程序出现错误
PHP Warning: PHP Startup: Unable to load dynamic library 'c:/php/ext\php_xsl.dll' - 找不到指定的模块
运行 VS2005出现错误 ~!
error while trying to run project unable to start debugging on the web server.rn click help for more information
运行出现错误
我<em>运行</em>VC++程序,<em>出现</em>了这样的<em>错误</em>:rnfatal error C1083:cannot open precompiled header file :'Debug/DMS.pch':rnno such file or directory.rn光标指向#include"stdafx.h"rn这是什么问题,怎么解决?请高手指教
#include 后 出现错误!!!
[code=C/C++]rn#include rn#include rnrnrnvoid main()rnrn cout<<后,rn<em>出现</em>这么多<em>错误</em>,太迷糊了rn
重装系统后出现错误
我在重新安装系统后<em>出现</em>下面的<em>错误</em>,我使用的是WINSP HOMESP2 + VS2003  IIS使用特殊方法安装,但以前一直使用正常。在重装系统以后打开以前的PROJECT时<em>出现</em>下面的<em>错误</em>,而新建的工程就正常。<em>错误</em>如下:rnrn配置<em>错误</em> rn说明: 在处理向该请求提供服务所需的配置文件时出错。请检查下面的特定<em>错误</em>详细信息并适当地修改配置文件。 rnrn分析器<em>错误</em>信息: 在应用程序级别以外使用注册为 allowDefinition='MachineToApplication' 的节是<em>错误</em>的。导致该<em>错误</em>的原因可能是在 IIS 中没有将虚拟目录作为应用程序进行配置。rnrn源<em>错误</em>: rnrnrn行 44: 它为成员站点提供单独登录和核心配置文件服务。rn行 45: rn行 4<em>6</em>: rn行 47: rn行 48:
程序发布后出现错误
我的程序在debug版本时一切正常,发布为release版本后提示“内存不足”。请问大家这是为什么,程序中有一个周期为两秒的timer,还有一个接收数据的socket.
上传后出现错误
我是新手,第一次做.netrn我做好了一个上传<em>出现</em><em>错误</em>:rn“/”应用程序中的服务器<em>错误</em>。rn--------------------------------------------------------------------------------rnrn<em>运行</em>时<em>错误</em> rn说明: 服务器上<em>出现</em>应用程序<em>错误</em>。此应用程序的当前自定义<em>错误</em>设置禁止远程查看应用程序<em>错误</em>的详细信息(出于安全原因)。但可以通过在本地服务器计算机上<em>运行</em>的浏览器查看。 rnrn详细信息: 若要使他人能够在远程计算机上查看此特定<em>错误</em>信息的详细信息,请在位于当前 Web 应用程序根目录下的“web.config”配置文件中创建一个 标记。然后应将此 标记的“mode”属性设置为“Off”。rnrnrnrnrnrn rn rn rnrn rnrn注释: 通过修改应用程序的 配置标记的“defaultRedirect”属性,使之指向自定义<em>错误</em>页的 URL,可以用自定义<em>错误</em>页替换所看到的当前<em>错误</em>页。rnrnrnrnrnrn rn rn rnrn rn我也按照这个说法去改,但还是一样的提示,为什么啊
tomcat6.exetomcat6w.exe有什么区别?
我电脑上安装的是<em>tomcat</em><em>6</em>,现在一个项目里需要在servlet中创建一个JFrame,当使用Tomcat bin目录下的<em>tomcat</em><em>6</em>.<em>exe</em>启动时JFrame能正常显示rn使用<em>tomcat</em><em>6</em>w.<em>exe</em>启动时,JFrame显示不了rn我搜了一下,找到了这个帖子rnhttp://topic.csdn.net/t/20051212/19/445479<em>6</em>.htmlrn但是按上面说的把tools.jar拷到lib下没有作用rn想问一下,这两种启动方式到底有什么区别,从而造成了上面所说的问题?rn
vs2010运行出现0xc000007b错误
本人电脑<em>6</em>4位,安装的vs2010是32位,现在添加了fftw库函数,lib /def:libfftw3-3.def这种是在vs2010的兼容命令窗口进行的。rn测试时用的是这个代码:rnrn[code=c]#include "fftw3.h"rn#include rn#define N 8rnint main()rnrn int i;rn fftw_complex *din,*out;rn fftw_plan p;rn din = (fftw_complex*) fftw_malloc(sizeof(fftw_complex) * N);rn out = (fftw_complex*) fftw_malloc(sizeof(fftw_complex) * N);rn if((din==NULL)||(out==NULL))rn rn printf("Error:insufficient available memory\n");rn rn elsern rn for(i=0; i
运行tomcat出现错误!!求救
信息: Starting Servlet Engine: Apache Tomcat/<em>6</em>.0.20rn2009-11-24 1<em>6</em>:04:50 org.apache.<em>tomcat</em>.util.digester.Digester endElementrn严重: End event threw exceptionrnjava.lang.reflect.InvocationTargetExceptionrn at sun.reflect.NativeMethodAccessorImpl.invoke0(Native Method)rn at sun.reflect.NativeMethodAccessorImpl.invoke(Unknown Source)rn at sun.reflect.DelegatingMethodAccessorImpl.invoke(Unknown Source)rn at java.lang.reflect.Method.invoke(Unknown Source)rn at org.apache.<em>tomcat</em>.util.IntrospectionUtils.callMethod1(IntrospectionUtils.java:925)rn at org.apache.<em>tomcat</em>.util.digester.SetNextRule.end(SetNextRule.java:193)rn at org.apache.<em>tomcat</em>.util.digester.Rule.end(Rule.java:229)rn at org.apache.<em>tomcat</em>.util.digester.Digester.endElement(Digester.java:1140)rn at com.sun.org.apache.xerces.internal.parsers.AbstractSAXParser.endElement(Unknown Source)rn at com.sun.org.apache.xerces.internal.impl.XMLDocumentFragmentScannerImpl.scanEndElement(Unknown Source)rn at com.sun.org.apache.xerces.internal.impl.XMLDocumentFragmentScannerImpl$FragmentContentDriver.next(Unknown Source)rn at com.sun.org.apache.xerces.internal.impl.XMLDocumentScannerImpl.next(Unknown Source)rn at com.sun.org.apache.xerces.internal.impl.XMLDocumentFragmentScannerImpl.scanDocument(Unknown Source)rn at com.sun.org.apache.xerces.internal.parsers.XML11Configuration.parse(Unknown Source)rn at com.sun.org.apache.xerces.internal.parsers.XML11Configuration.parse(Unknown Source)rn at com.sun.org.apache.xerces.internal.parsers.XMLParser.parse(Unknown Source)rn at com.sun.org.apache.xerces.internal.parsers.AbstractSAXParser.parse(Unknown Source)rn at com.sun.org.apache.xerces.internal.jaxp.SAXParserImpl$JAXPSAXParser.parse(Unknown Source)rn at org.apache.<em>tomcat</em>.util.digester.Digester.parse(Digester.java:1<em>6</em>44)rn at org.apache.catalina.startup.ContextConfig.applicationWebConfig(ContextConfig.java:3<em>6</em>5)rn at org.apache.catalina.startup.ContextConfig.start(ContextConfig.java:10<em>6</em><em>6</em>)rn at org.apache.catalina.startup.ContextConfig.lifecycleEvent(ContextConfig.java:2<em>6</em>1)rn at org.apache.catalina.util.LifecycleSupport.fireLifecycleEvent(LifecycleSupport.java:119)rn at org.apache.catalina.core.StandardContext.start(StandardContext.java:4339)rn at org.apache.catalina.core.ContainerBase.start(ContainerBase.java:1045)rn at org.apache.catalina.core.StandardHost.start(StandardHost.java:722)rn at org.apache.catalina.core.ContainerBase.start(ContainerBase.java:1045)rn at org.apache.catalina.core.StandardEngine.start(StandardEngine.java:443)rn at org.apache.catalina.core.StandardService.start(StandardService.java:51<em>6</em>)rn at org.apache.catalina.core.StandardServer.start(StandardServer.java:710)rn at org.apache.catalina.startup.Catalina.start(Catalina.java:583)rn at sun.reflect.NativeMethodAccessorImpl.invoke0(Native Method)rn at sun.reflect.NativeMethodAccessorImpl.invoke(Unknown Source)rn at sun.reflect.DelegatingMethodAccessorImpl.invoke(Unknown Source)rn at java.lang.reflect.Method.invoke(Unknown Source)rn at org.apache.catalina.startup.Bootstrap.start(Bootstrap.java:288)rn at org.apache.catalina.startup.Bootstrap.main(Bootstrap.java:413)rnCaused by: java.lang.IllegalArgumentException: Filter mapping specifies an unknown filter name struts2rn at org.apache.catalina.core.StandardContext.addFilterMap(StandardContext.java:2237)rn ... 37 morern2009-11-24 1<em>6</em>:04:50 org.apache.catalina.startup.ContextConfig applicationWebConfigrn严重: Parse error in application web.xml file at jndi:/localhost/struts_2/WEB-INF/web.xmlrnjava.lang.IllegalArgumentException: Filter mapping specifies an unknown filter name struts2rn at org.apache.<em>tomcat</em>.util.digester.Digester.createSAXException(Digester.java:2808)rn at org.apache.<em>tomcat</em>.util.digester.Digester.createSAXException(Digester.java:2834)rn at org.apache.<em>tomcat</em>.util.digester.Digester.endElement(Digester.java:1143)rn at com.sun.org.apache.xerces.internal.parsers.AbstractSAXParser.endElement(Unknown Source)rn at com.sun.org.apache.xerces.internal.impl.XMLDocumentFragmentScannerImpl.scanEndElement(Unknown Source)rn at com.sun.org.apache.xerces.internal.impl.XMLDocumentFragmentScannerImpl$FragmentContentDriver.next(Unknown Source)rn at com.sun.org.apache.xerces.internal.impl.XMLDocumentScannerImpl.next(Unknown Source)rn at com.sun.org.apache.xerces.internal.impl.XMLDocumentFragmentScannerImpl.scanDocument(Unknown Source)rn at com.sun.org.apache.xerces.internal.parsers.XML11Configuration.parse(Unknown Source)rn at com.sun.org.apache.xerces.internal.parsers.XML11Configuration.parse(Unknown Source)rn at com.sun.org.apache.xerces.internal.parsers.XMLParser.parse(Unknown Source)rn at com.sun.org.apache.xerces.internal.parsers.AbstractSAXParser.parse(Unknown Source)rn at com.sun.org.apache.xerces.internal.jaxp.SAXParserImpl$JAXPSAXParser.parse(Unknown Source)rn at org.apache.<em>tomcat</em>.util.digester.Digester.parse(Digester.java:1<em>6</em>44)rn at org.apache.catalina.startup.ContextConfig.applicationWebConfig(ContextConfig.java:3<em>6</em>5)rn at org.apache.catalina.startup.ContextConfig.start(ContextConfig.java:10<em>6</em><em>6</em>)rn at org.apache.catalina.startup.ContextConfig.lifecycleEvent(ContextConfig.java:2<em>6</em>1)rn at org.apache.catalina.util.LifecycleSupport.fireLifecycleEvent(LifecycleSupport.java:119)rn at org.apache.catalina.core.StandardContext.start(StandardContext.java:4339)rn at org.apache.catalina.core.ContainerBase.start(ContainerBase.java:1045)rn at org.apache.catalina.core.StandardHost.start(StandardHost.java:722)rn at org.apache.catalina.core.ContainerBase.start(ContainerBase.java:1045)rn at org.apache.catalina.core.StandardEngine.start(StandardEngine.java:443)rn at org.apache.catalina.core.StandardService.start(StandardService.java:51<em>6</em>)rn at org.apache.catalina.core.StandardServer.start(StandardServer.java:710)rn at org.apache.catalina.startup.Catalina.start(Catalina.java:583)rn at sun.reflect.NativeMethodAccessorImpl.invoke0(Native Method)rn at sun.reflect.NativeMethodAccessorImpl.invoke(Unknown Source)rn at sun.reflect.DelegatingMethodAccessorImpl.invoke(Unknown Source)rn at java.lang.reflect.Method.invoke(Unknown Source)rn at org.apache.catalina.startup.Bootstrap.start(Bootstrap.java:288)rn at org.apache.catalina.startup.Bootstrap.main(Bootstrap.java:413)rn2009-11-24 1<em>6</em>:04:50 org.apache.catalina.startup.ContextConfig applicationWebConfigrn严重: Occurred at line 1<em>6</em> column 24rn2009-11-24 1<em>6</em>:04:50 org.apache.catalina.startup.ContextConfig startrn严重: Marking this application unavailable due to previous error(s)rn2009-11-24 1<em>6</em>:04:50 org.apache.catalina.core.StandardContext startrn严重: Error getConfiguredrn2009-11-24 1<em>6</em>:04:50 org.apache.catalina.core.StandardContext startrn严重: Context [/struts_2] startup failed due to previous errorsrn2009-11-24 1<em>6</em>:04:51 org.apache.coyote.http11.Http11Protocol startrn信息: Starting Coyote HTTP/1.1 on http-8080rn2009-11-24 1<em>6</em>:04:51 org.apache.jk.common.ChannelSocket initrn信息: JK: ajp13 listening on /0.0.0.0:8009rn2009-11-24 1<em>6</em>:04:51 org.apache.jk.server.JkMain startrn信息: Jk running ID=0 time=0/<em>6</em>2 config=nullrn2009-11-24 1<em>6</em>:04:51 org.apache.catalina.startup.Catalina startrn信息: Server startup in 1355 msrnrnrn我的jdk是1.<em>6</em>.0_10的,jre<em>6</em>rn请指点,快逼疯了
自动运行出现错误
写了一个自动<em>运行</em>类,让<em>tomcat</em>启动之后自动调用。但是总<em>运行</em>不成功,高手帮看看,谢谢!rnrn程序逻辑是这样的:rn1、<em>tomcat</em>调用一个定时器;rn2、定时器调用run方法;rn3、run方法首先到表里去查是否还有没有提醒的内容;rn4、如果有,则给相关的人员发送一条短信;rn内容涉及三个表,能够保证需要的内容都存在。rn另外,还想知道,在调试的时候如何把一些结果打印在屏幕上?rnrn从<em>tomcat</em>的日志来看,服务器已经找到这个类,<em>出现</em>了"定时器已启动321" 等字样。但是里面的内容好像没有执行。rnpublic class TimerListener implements ServletContextListener rn rn private Timer timer = null; rnrn public void contextInitialized(ServletContextEvent event) rn rn int rate; rn try rn rn rate = 7*24*<em>6</em>0*<em>6</em>0*1000; rn timer = new Timer(true);rn event.getServletContext().log("定时器已启动321");rn timer.scheduleAtFixedRate(new RemindTask(), 0, rate);rn// timer.scheduleAtFixedRate(new TimedoTask(), 0, rate);rn event.getServletContext().log("已经添加任务调度表321"); rn rn catch(Exception e) rn rn e.printStackTrace();rn rn rn public void contextDestroyed(ServletContextEvent event) rn rn timer.cancel(); rn event.getServletContext().log("定时器销毁244"); rn rnrnrn****************************************************************************rnrnpublic class RemindTask extends TimerTask rnrn public void run() rn rn try rn rn Connection conn = JdbcPool.getConnection(); rn Statement stmt = conn.createStatement(); rn String sqlstr= "select * from sys_mentioninfo where hasmention='no'"; rn ResultSet rs = stmt.<em>exe</em>cuteQuery(sqlstr); rn while(rs.next()) rn rn String mentiontime = rs.getString("mentiontime").substring(0,10);rn SimpleDateFormat formatter = new java.text.SimpleDateFormat("yyyy-MM-dd"); rn Date mentionTime = new java.util.Date();rn mentionTime = formatter.parse(mentiontime); // 字符串转换为时间类型rn Date currentTime = new Date();rn String sourcetime = formatter.format(currentTime); //将日期时间格式化rn long diffDays = (mentionTime.getTime()- currentTime.getTime())/(24*<em>6</em>0*<em>6</em>0*1000); rn System.out.print(diffDays);rn if(diffDays); rn rn rn rn catch(Exception ef)rn rn ef.printStackTrace();rn rn rnrnrn rn
编译无错误,运行出现错误??
[code=C/C++]rn#include rn#include rn#include rnusing namespace std;rnrn#define ERROR 0rn#define OK 1rn#define OVERFLOW -2 rn#define NULL 0rnrntypedef structrn char *ch;rn int length;rnHString;rnrntypedef int Status;rnrnStatus StrAssign(HString &T,char* chars) rn if(T.ch) free(T.ch); //如果存在则释放rn int i; //用来求长度rn char *c;rn for(i=0,c=chars;*c;++i,++c); //求得i rn if(!i)rn T.ch=NULL;rn T.length=0;rn rn elsern if(!(T.ch=(char*)malloc(i*sizeof(char))))rn exit(OVERFLOW);rn for(int j=0; j<
运行C程序出现错误
我<em>运行</em>C程序<em>出现</em>下面<em>错误</em>:rnLoaded 'ntdll.dll', no matching symbolic information found.rnLoaded 'C:\WINDOWS\system32\kernel32.dll', no matching symbolic information found.rnThe thread 0x<em>6</em>7C has exited with code -1073741510 (0xC000013A).rnThe thread 0xF4C has exited with code -1073741510 (0xC000013A).rnThe program 'E:\C program\pro\t\Debug\t.<em>exe</em>' has exited with code -1073741510 (0xC000013A).rn请问是什么意思?
运行Client的时候出现错误
javax.naming.NameNotFoundException: Unable to resolve 'EmployeesRemote' Resolved: '' Unresolved:'EmployeesRemote' ; remaining name 'EmployeesRemote'rnrn at weblogic.rmi.internal.BasicOutboundRequest.sendReceive(BasicOutboundRequest.java:109)rnrn at weblogic.rmi.cluster.ReplicaAwareRemoteRef.invoke(ReplicaAwareRemoteRef.java:2<em>6</em>3)rnrn at weblogic.rmi.cluster.ReplicaAwareRemoteRef.invoke(ReplicaAwareRemoteRef.java:230)-- Failed initializing bean access.rnrnrnrn at weblogic.jndi.internal.ServerNamingNode_WLStub.lookup(Unknown Source)rnrn at weblogic.jndi.internal.WLContextImpl.lookup(WLContextImpl.java:337)rnrn at weblogic.jndi.internal.WLContextImpl.lookup(WLContextImpl.java:332)rnrn at javax.naming.InitialContext.lookup(InitialContext.java:350)rnrn at cmpmodule2.EmployeesTestClient.(EmployeesTestClient.java:28)rnrn at cmpmodule2.EmployeesTestClient.main(EmployeesTestClient.java:1245)rnrnjava.lang.NullPointerExceptionrnrn at cmpmodule2.EmployeesTestClient.findByPrimaryKey(EmployeesTestClient.java:107)rnrn at cmpmodule2.EmployeesTestClient.main(EmployeesTestClient.java:1251)rnrn-- Calling findByPrimaryKey(1)rnrn-- Failed: findByPrimaryKey(1)rnrn-- Return value from findByPrimaryKey(1): null.rnrnErrorrnrn这是不是因为没有部署好?rn我是用JBuilder+WEBLOGICrn怎样知道有没有部署成功?rn谢谢rn
开始--运行--cmd 出现错误
[img=http://album.hi.csdn.net/app_uploads/zfh198<em>6</em>01/20081015/111238175.t.gif width=<em>6</em>00 height=300][/img]rnrn[img=http://album.hi.csdn.net/app_uploads/zfh198<em>6</em>01/20081015/111238175.t.gif][/img]
运行cfdemCFDEMuti编译时出现错误
<em>运行</em>cfdemCFDEMuti编译时<em>出现</em>的<em>错误</em>报错如下解决如下 在安装CFDEM时,输入 cfdemCFDEMuti 进行utilities的编译 报错如下 This routine will compile the utilities specified in utilities-list.txt Please provide the utilities to be compiled in ...
运行LoadRunner的VuGen出现错误
<em>运行</em>VuGen时,报错can't create object TDInManager! rn从没有预见过,请问这是什么问题啊!
phpMyAdmin 运行出现错误模…
<em>错误</em>信息: 应用程序“DEFAULT WEB SITE/PHPMYADMIN”中的服务器<em>错误</em> HTTP <em>错误</em> 500.21 - Internal Server Error 处理程序“phpStudy_FastCGI”在其模块列表中有一个<em>错误</em>模块“FastCgiModule” 最可能的原因: 使用了托管的处理程序,但是未安装或未完整安装 ASP.NET。 处理程序模块列表的配置中存在录入<em>错误</em>。
运行出现 divide overflow 错误
code segment rn assume cs:code,ds:codern music_exit db 'entry q to exit from the music',0dh,0ah,'$'rn messge_music db 'play the music',0dh,0ah,'$'rn mus_f dw 330,294,2<em>6</em>2,294,3 dup(330) ;音乐的频率值rn dw 3 dup (294),330,392,392rn dw 330,294,2<em>6</em>2,294,4 dup (330)rn dw 294,294,330,294,2<em>6</em>2,-1rn mus_time dw <em>6</em> dup(25),50 ;音乐的节拍rn dw 2 dup(25,25,50)rn dw 12 dup(25),100rnrn;************************************************************rnorg 100hrn start: rn jmp music rnrn;************************************************************rn music proc rn push sirn push bp rn push dirn push bxrn push dsrn sub ax,axrn push axrn lea si ,mus_frn lea bp ,mus_timern mov si,0rnfreq: mov di,[si]rn cmp di,-1rn je end_musrn mov bx,[bp]rn call gensoundrn ;gensound di,bxrn add si,2rn add bp,2rn jmp freqrnend_mus : in al,<em>6</em>1h ;关闭扬声器rn and al,0fchrn out <em>6</em>1h,alrn ; mov ah,4ch ;带返回码终止rn ;int 21hrn pop axrn pop dsrn pop bxrn pop di rn pop bprn pop sirnrn ret rnmusic endprnrn;************************************************************rngensound proc ;扬声器发声子程序rn push axrn push bxrn push cxrn push dxrn push dirnrnrn ;mov ah,09h ;提示放音乐rn ;mov dx,offset messge_musicrn ;int 21hrnrn mov al,0b<em>6</em>h ;设置定时器2工作方式3rn out 43h,al ;方式3、双字节写和二进制计数方式写到控制口rn mov dx,12h ;设置被除数rn mov ax,533h ;计算时钟频率,放在(dx,ax)中rn mov cx,89<em>6</em>rn mul cxrn div di ;计算定时器的计数值rn out 42h,al ;设置定时器的计数值 ;先送LSB rn mov al,ahrn out 42h,al ;后送MSBrn in al,<em>6</em>1h ;打开扬声器rn ;mov ah,al rn or al,3rn out <em>6</em>1h,alrnwait1: mov cx,0ffffh ;延时,由于不同计算机的cpu频率不同rndelay1: mov di,180h ;为了听清音乐,请对cx和di的值进行调整rndelay2: dec dirn jnz delay2rn loop delay1rn dec bxrn jnz wait1rnrn pop dirn pop dxrn pop cxrn pop bxrn pop axrn ret rn rngensound endprnrn;************************************************************rnrn code endsrn end start rn
运行出现错误,求解答,
代码rn#include rnint main()rnrnrn std::cout<<<<
在VS2008下运行出现连接错误
1>TEST.obj : error LNK2019: 无法解析的外部符号 "public: __thiscall CTESTDlg::CTESTDlg(class CWnd *)" (??0CTESTDlg@@QAE@PAVCWnd@@@Z),该符号在函数 "public: virtual int __thiscall CTESTApp::InitInstance(void)" (?InitInstance@CTESTApp@@UAEHXZ) 中被引用rnrnrn请各位大侠帮帮忙。
运行CKEDITOR编辑器时出现错误
rn<em>运行</em>CKEDITOR编辑器时<em>出现</em><em>错误</em>rnMicrosoft JScript <em>运行</em>时<em>错误</em>: [CKEDITOR.editor] The instance "txtcontent" already exists.rn而且下方多出了一个编辑器rn是怎么回事?怎么解决?
运行servlet时出现错误?
Error 500--Internal Server Error rnjava.lang.ArrayIndexOutOfBoundsException: 3rn at Servlet02.doGet(Servlet02.java:<em>6</em>3)rn at javax.servlet.http.HttpServlet.service(HttpServlet.java:743)rn at javax.servlet.http.HttpServlet.service(HttpServlet.java:85<em>6</em>)rn at weblogic.servlet.internal.StubSecurityHelper$ServletServiceAction.run(StubSecurityHelper.java:225)rn at weblogic.servlet.internal.StubSecurityHelper.invokeServlet(StubSecurityHelper.java:127)rn at weblogic.servlet.internal.ServletStubImpl.<em>exe</em>cute(ServletStubImpl.java:283)rn at weblogic.servlet.internal.ServletStubImpl.<em>exe</em>cute(ServletStubImpl.java:175)rn at weblogic.servlet.internal.WebAppServletContext$ServletInvocationAction.run(WebAppServletContext.java:3214)rn at weblogic.security.acl.internal.AuthenticatedSubject.doAs(AuthenticatedSubject.java:321)rn at weblogic.security.service.SecurityManager.runAs(SecurityManager.java:121)rn at weblogic.servlet.internal.WebAppServletContext.securedExecute(WebAppServletContext.java:1983)rn at weblogic.servlet.internal.WebAppServletContext.<em>exe</em>cute(WebAppServletContext.java:1890)rn at weblogic.servlet.internal.ServletRequestImpl.run(ServletRequestImpl.java:1344)rn at weblogic.work.ExecuteThread.<em>exe</em>cute(ExecuteThread.java:209)rn at weblogic.work.ExecuteThread.run(ExecuteThread.java:181)rn rn
运行过程中出现“连接失败”的错误
有少数客户的软件<em>运行</em>过程中会<em>出现</em>“连接失败”的<em>错误</em>,而且是某些个别的模块比较容易发生。初步认为和数据量大有关系,但不知道真正的原因是什么。rn<em>出现</em><em>错误</em>后轻微的需要关闭应用程序,严重的要重启电脑才能恢复正常。
Qt5.7新建工程运行出现错误
本人新学qt,建helloworld时<em>运行</em><em>出现</em><em>错误</em>。[img=https://img-bbs.csdn.net/upload/201<em>6</em>10/15/147<em>6</em>5101<em>6</em>7_902549.png][/img]rn该怎么解决,顺便求各位大神推荐学习qt的书、、万分感谢!!
java war包运行出现错误
我最近在做微信支付,功能已经开发完全。eclipse里<em>tomcat</em>运气就很正常。导出war包在<em>tomcat</em>里跑起来就有问题了。例如:在扫描支付时,会返回有"签名失败"这样的<em>错误</em>。 但是没有打包成war包前,功能全部都测试成功了![img=https://forum.csdn.net/PointForum/ui/scripts/csdn/Plugin/003/onion/1.gif][/img]
crontab定时运行出现错误
10 0 * * * /bin/sh /cron/a.shrnvi a.shrntar zcvf a.tar.gz /date/webrnrn当我定时<em>运行</em>时tar备份的a.tar.gz文件大小不对,只备份了一点就不备份了!rn然而当我手动 #sh /cron/a.sh 这时候文件中对的rnrn我修改了crontab定时内容如下rn10 0 * * * /bin/sh /cron/a.sh >log 2>&1rn这时候定时<em>运行</em>的a.tar.gz这个文件又对了,当我去掉">log 2&1"时又出错了!rnrn哪一个高手能帮我解读一下是为什么?
opencv运行出现错误ffmpeg
调试opencv程序,<em>运行</em>时<em>出现</em>: Error opening file  /build/opencv/modules/videoio/src/cap_ffmpeg_impl.hpp:578 网络查询,原因: 程序中 VideoCapture cap("video.avi"); 视频文件没有在程序文件夹下,导致文件找不到。 备注: 在调试opencv程序时,经常会<em>出现</em>一
运行jsp时出现错误
在<em>运行</em>时<em>出现</em>了一个这样的<em>错误</em>,希望大家帮帮忙,先谢谢大家了。rnHTTP Status 500 - rnrn--------------------------------------------------------------------------------rnrntype Exception reportrnrnmessage rnrndescription The server encountered an internal error () that prevented it from fulfilling this request.rnrnexception rnrnorg.apache.jasper.JasperExceptionrn org.apache.jasper.servlet.JspServletWrapper.service(JspServletWrapper.java:372)rn org.apache.jasper.servlet.JspServlet.serviceJspFile(JspServlet.java:292)rn org.apache.jasper.servlet.JspServlet.service(JspServlet.java:23<em>6</em>)rn javax.servlet.http.HttpServlet.service(HttpServlet.java:802)rn org.apache.jasper.runtime.JspRuntimeLibrary.include(JspRuntimeLibrary.java:9<em>6</em><em>6</em>)rn org.apache.jsp.index_jsp._jspService(index_jsp.java:91)rn org.apache.jasper.runtime.HttpJspBase.service(HttpJspBase.java:94)rn javax.servlet.http.HttpServlet.service(HttpServlet.java:802)rn org.apache.jasper.servlet.JspServletWrapper.service(JspServletWrapper.java:324)rn org.apache.jasper.servlet.JspServlet.serviceJspFile(JspServlet.java:292)rn org.apache.jasper.servlet.JspServlet.service(JspServlet.java:23<em>6</em>)rn javax.servlet.http.HttpServlet.service(HttpServlet.java:802)rnrnrnroot cause rnrnjava.lang.NullPointerExceptionrn org.apache.jsp.left_jsp._jspService(left_jsp.java:182)rn org.apache.jasper.runtime.HttpJspBase.service(HttpJspBase.java:94)rn javax.servlet.http.HttpServlet.service(HttpServlet.java:802)rn org.apache.jasper.servlet.JspServletWrapper.service(JspServletWrapper.java:324)rn org.apache.jasper.servlet.JspServlet.serviceJspFile(JspServlet.java:292)rn org.apache.jasper.servlet.JspServlet.service(JspServlet.java:23<em>6</em>)rn javax.servlet.http.HttpServlet.service(HttpServlet.java:802)rn org.apache.jasper.runtime.JspRuntimeLibrary.include(JspRuntimeLibrary.java:9<em>6</em><em>6</em>)rn org.apache.jsp.index_jsp._jspService(index_jsp.java:91)rn org.apache.jasper.runtime.HttpJspBase.service(HttpJspBase.java:94)rn javax.servlet.http.HttpServlet.service(HttpServlet.java:802)rn org.apache.jasper.servlet.JspServletWrapper.service(JspServletWrapper.java:324)rn org.apache.jasper.servlet.JspServlet.serviceJspFile(JspServlet.java:292)rn org.apache.jasper.servlet.JspServlet.service(JspServlet.java:23<em>6</em>)rn javax.servlet.http.HttpServlet.service(HttpServlet.java:802)rnrnrnnote The full stack trace of the root cause is available in the Apache Tomcat/5.0.28 logs.rnrnrn--------------------------------------------------------------------------------rnrnApache Tomcat/5.0.28
tomcat6.0 与myeclipse6.0运行出现错误!!!!
在myeclipse启动TOMCAT时不能启动<em>出现</em>:Source not found for ClassLoader.findBootstrapClass(String) line: not available [native method]问题!!!但是单独启动TOMCAT时可以<em>运行</em>!!!!!!到网去找了下。。按其气节说没解决!!!!!
2000下游戏运行出现错误!
出错提示为:"0x004d5af<em>6</em>"指令引用的"0x00000001"内存.该内存不能为"read".rnrn如何解决???rn请指教!!!
bash脚本运行出现未知错误
-bash: ./test.sh: /bin/bash^M: bad interpreter: No such file or directory vim file 查看文件格式 set ff? 如果是dos set ff=unix 搞定
运行jetty-maven-plugin时,出现错误
[ERROR] Failed to <em>exe</em>cute goal org.eclipse.jetty:jetty-maven-plugin:9.4.0.v201<em>6</em>1208:run (default-cli) on project kind-perm-web: Execution default-cli of goal org.eclipse.jetty:jetty-maven-plugin:9.4.0
运行struts时出现错误
type Status reportrnmessage /TestStrutsHelloWorld.dorndescription The requested resource (/TestStrutsHelloWorld.do) is not available.rnrn先谢谢了。
运行default.aspx时出现错误
“/”应用程序中的服务器<em>错误</em>。rn--------------------------------------------------------------------------------rnrn由于目标计算机积极拒绝,无法连接。 rn说明: 执行当前 Web 请求期间,<em>出现</em>未处理的异常。请检查堆栈跟踪信息,以了解有关该<em>错误</em>以及代码中导致<em>错误</em>的出处的详细信息。 rnrn异常详细信息: System.Net.Sockets.SocketException: 由于目标计算机积极拒绝,无法连接。rnrn源<em>错误</em>: rnrnrn行 59: [System.Web.Services.Protocols.SoapDocumentMethodAttribute("http://tempuri.org/addition", RequestNamespace="http://tempuri.org/", ResponseNamespace="http://tempuri.org/", Use=System.Web.Services.Description.SoapBindingUse.Literal, ParameterStyle=System.Web.Services.Protocols.SoapParameterStyle.Wrapped)]rn行 <em>6</em>0: public double addition(double i, double j) rn行 <em>6</em>1: object[] results = this.Invoke("addition", new object[] rn行 <em>6</em>2: i,rn行 <em>6</em>3: j);rn rnrn源文件: e:\Windows\Microsoft.NET\Framework\v2.0.50727\Temporary ASP.NET Files\root\<em>6</em>ac4<em>6</em>272\83444449\App_WebReferences.llqb1_l4.0.cs 行: <em>6</em>1 rnrn堆栈跟踪: rnrnrn[SocketException (0x274d): 由于目标计算机积极拒绝,无法连接。]rn System.Net.Sockets.Socket.DoConnect(EndPoint endPointSnapshot, SocketAddress socketAddress) +1029090rn System.Net.Sockets.Socket.InternalConnect(EndPoint remoteEP) +33rn System.Net.ServicePoint.ConnectSocketInternal(Boolean connectFailure, Socket s4, Socket s<em>6</em>, Socket& socket, IPAddress& address, ConnectSocketState state, IAsyncResult asyncResult, Int32 timeout, Exception& exception) +431rnrn[WebException: 无法连接到远程服务器]rn System.Net.HttpWebRequest.GetRequestStream() +1530701rn System.Web.Services.Protocols.SoapHttpClientProtocol.Invoke(String methodName, Object[] parameters) +103rn localhost.Service.addition(Double i, Double j) in e:\Windows\Microsoft.NET\Framework\v2.0.50727\Temporary ASP.NET Files\root\<em>6</em>ac4<em>6</em>272\83444449\App_WebReferences.llqb1_l4.0.cs:<em>6</em>1rn _Default.btn_Click(Object sender, EventArgs e) in d:\http\Default.aspx.cs:35rn System.Web.UI.WebControls.Button.OnClick(EventArgs e) +105rn System.Web.UI.WebControls.Button.RaisePostBackEvent(String eventArgument) +107rn System.Web.UI.WebControls.Button.System.Web.UI.IPostBackEventHandler.RaisePostBackEvent(String eventArgument) +7rn System.Web.UI.Page.RaisePostBackEvent(IPostBackEventHandler sourceControl, String eventArgument) +11rn System.Web.UI.Page.RaisePostBackEvent(NameValueCollection postData) +33rn System.Web.UI.Page.ProcessRequestMain(Boolean includeStagesBeforeAsyncPoint, Boolean includeStagesAfterAsyncPoint) +5102rnrn rn
运行java程序时出现错误!!
Exception in thread "main" java.lang.NoClassDefFoundError: Hello/classrnCaused by: java.lang.ClassNotFoundException: Hello.classrn at java.net.URLClassLoader$1.run(URLClassLoader.java:221)rn at java.security.AccessController.doPrivileged(Native Method)rn at java.net.URLClassLoader.findClass(URLClassLoader.java:209)rn at java.lang.ClassLoader.loadClass(ClassLoader.java:324)rn at sun.misc.Launcher$AppClassLoader.loadClass(Launcher.java:294)rn at java.lang.ClassLoader.loadClass(ClassLoader.java:2<em>6</em>9)rn at java.lang.ClassLoader.loadClassInternal(ClassLoader.java:337)rnError: Could not find the main class.rnError: A JNI error has occurred, please check your installation and try againrnpath和classpath都设置正确!!可是就是不能<em>运行</em>!!希望高手指点啊!!(path和classpath绝对没错!我都检查和重新设置了五遍了)
sqlplus 运行sql文件,出现错误
一、test.sql内容如下:rnCREATE OR REPLACE PROCEDURE ADDNEWMODELINFOrn ASrnBEGINrn INSERT INTO JDUSER.MODEL_INFO(MODEL_ID, MODEL_NAME) VALUES(<em>6</em>,'AAAAAAA');rnEND ADDNEWMODELINFO;rnrnrn二、<em>运行</em>sql文件,rnSQL> @ c:\test.sql;rn <em>6</em> rn 7 rn 8 rnrn很奇怪,执行了很多边都是这样。过程没有问题的。
运行JAVA命令出现错误
Exception in thread "main" java.lang.UnsupportedClassVersionError: smp11 (Unsupprnorted major.minor version 50.0)rn请问这个是什么<em>错误</em>啊?
运行.jad文件出现错误
程序<em>运行</em>很正常,混淆打包后用WTK带的run Midlet Application打开.jad文件<em>出现</em><em>错误</em>:rnOTA ...rnHTTPS ...rnError: Reason=22 rn还有就是打包后,有jad和jar文件,是双击那个<em>运行</em>?rn
timer长时间运行出现错误
我在一个页面中使用了两个timer同时<em>运行</em>,还定义了一个静态变量,但每次<em>运行</em>了一几个小时之后就会<em>出现</em><em>错误</em>。如下图所示:rn[img=http://img.my.csdn.net/uploads/201211/12/1352<em>6</em>87424_5135.jpg][/img]rnrn这是为什么?
运行eclipse的时候出现错误?
出错信息如下,如何解决? rnrn!SESSION ----------------------------------------------------------------------rn!ENTRY org.eclipse.core.launcher 4 0 九月 1<em>6</em>, 2004 10:2<em>6</em>:11.734rn!MESSAGE Exception launching the Eclipse Platform:rn!STACKrnjava.lang.ExceptionInInitializerErrorrn at org.eclipse.core.internal.plugins.RegistryLoader.processManifestFile(RegistryLoader.java:89)rn at org.eclipse.core.internal.plugins.RegistryLoader.processPluginPathFile(RegistryLoader.java:13<em>6</em>)rn at org.eclipse.core.internal.plugins.RegistryLoader.processPluginPathEntry(RegistryLoader.java:127)rn at org.eclipse.core.internal.plugins.RegistryLoader.processManifestFiles(RegistryLoader.java:104)rn at org.eclipse.core.internal.plugins.RegistryLoader.parseRegistry(RegistryLoader.java:<em>6</em>3)rn at org.eclipse.core.internal.plugins.RegistryLoader.parseRegistry(RegistryLoader.java:71)rn at org.eclipse.core.internal.runtime.InternalPlatform.parsePlugins(InternalPlatform.java:890)rn at org.eclipse.core.internal.runtime.InternalPlatform.loadRegistry(InternalPlatform.java:834)rn at org.eclipse.core.internal.runtime.InternalPlatform.loaderStartup(InternalPlatform.java:<em>6</em>84)rn at sun.reflect.NativeMethodAccessorImpl.invoke0(Native Method)rn at sun.reflect.NativeMethodAccessorImpl.invoke(NativeMethodAccessorImpl.java:39)rn at sun.reflect.DelegatingMethodAccessorImpl.invoke(DelegatingMethodAccessorImpl.java:25)rn at java.lang.reflect.Method.invoke(Method.java:324)rn at org.eclipse.core.internal.boot.InternalBootLoader.startup(InternalBootLoader.java:1040)rn at org.eclipse.core.internal.boot.InternalBootLoader.run(InternalBootLoader.java:838)rn at org.eclipse.core.boot.BootLoader.run(BootLoader.java:4<em>6</em>1)rn at sun.reflect.NativeMethodAccessorImpl.invoke0(Native Method)rn at sun.reflect.NativeMethodAccessorImpl.invoke(NativeMethodAccessorImpl.java:39)rn at sun.reflect.DelegatingMethodAccessorImpl.invoke(DelegatingMethodAccessorImpl.java:25)rn at java.lang.reflect.Method.invoke(Method.java:324)rn at org.eclipse.core.launcher.Main.basicRun(Main.java:291)rn at org.eclipse.core.launcher.Main.run(Main.java:747)rn at org.eclipse.core.launcher.Main.main(Main.java:583)rnCaused by: java.lang.ClassCastExceptionrn at org.apache.xerces.parsers.SAXParser.(SAXParser.java:95)rn at org.eclipse.core.internal.plugins.PluginParser.initializeParser(PluginParser.java:80)rn at org.eclipse.core.internal.plugins.PluginParser.(PluginParser.java:44)rn ... 23 morernrn
初学GWTEXT 运行出现错误
rnom.google.gwt.core.client.JavaScriptException: JavaScript TypeError exception: Object expectedrn at com.google.gwt.dev.shell.ModuleSpace.invokeNative(ModuleSpace.java:481)rn at com.google.gwt.dev.shell.ModuleSpace.invokeNativeVoid(ModuleSpace.java:270)rn at com.google.gwt.dev.shell.JavaScriptHost.invokeNativeVoid(JavaScriptHost.java:137)rn at com.gwtext.client.widgets.Component.init(Component.java:133)rn at com.gwtext.client.widgets.Component.(Component.java:113)rn at com.hd123.client.GwtExt.onModuleLoad(GwtExt.java:10)rn at com.google.gwt.dev.shell.ModuleSpace.onLoad(ModuleSpace.java:342)rn at com.google.gwt.dev.shell.BrowserWidget.attachModuleSpace(BrowserWidget.java:32<em>6</em>)rn at com.google.gwt.dev.shell.ie.BrowserWidgetIE<em>6</em>.access$200(BrowserWidgetIE<em>6</em>.java:3<em>6</em>)rn at com.google.gwt.dev.shell.ie.BrowserWidgetIE<em>6</em>$External.gwtOnLoad(BrowserWidgetIE<em>6</em>.java:70)
java 运行出现错误,请教。
rnjava hellornException in thread "main" java.lang.NoClassDefFoundError: hellornrnrn//hello.java rnimport java.lang.*;rnimport java.io.*;rnclass Hellornrn public static void main(String args[])rn rn System.out.println("hello!");rn rn rn
运行word时出现错误
<em>错误</em>标题:Microsoft Visual C++ Runtime LibraryrnrnRuntime Error!rnrnProgram: C:\Program files\Microsof Office\Office10\WINWORD.EXErnrnThis application has requested the Runtime to terminate it in an unusual way.rnPlease contact the application`s support team for more information.rnrnrn请问这是怎么回事?rn如何解决?
运行net use出现错误。。。
建立ipc连接,执行net use \\192.1<em>6</em>8.1.1\ipc$ "" /user:"", 总是<em>出现</em>:系统发生1231<em>错误</em>。不能访问网络位置。rn两台主机在同一子网内,并且192.1<em>6</em>8.1.1开发了IPC$。请问是什么原因?rn
spark运行出现错误案例
1.<em>错误</em>描述: org.apache.spark.SparkException: Only one SparkContext may be running in this JVM (see SPARK-2243). To ignore this error, set spark.driver.allowMultipleContexts = true. The currently running ...
第一次运行hibernate 出现错误
首先 我已经把hibernate所需的包导入到了<em>tomcat</em> 的lib 下面rnrnorg.apache.jasper.JasperException: An exception occurred processing JSP page /login.jsp at line 10rnrn7: rn8: rn9: rn10: rn11: rn12: rn13: rnrnrnStacktrace:rn org.apache.jasper.servlet.JspServletWrapper.handleJspException(JspServletWrapper.java:505)rn org.apache.jasper.servlet.JspServletWrapper.service(JspServletWrapper.java:398)rn org.apache.jasper.servlet.JspServlet.serviceJspFile(JspServlet.java:337)rn org.apache.jasper.servlet.JspServlet.service(JspServlet.java:2<em>6</em><em>6</em>)rn javax.servlet.http.HttpServlet.service(HttpServlet.java:803)rn com.mldn.struts.note.filter.EncodingFilter.doFilter(EncodingFilter.java:22)rnrnrnroot cause rnrnjavax.servlet.ServletException: java.lang.NoClassDefFoundErrorrn org.apache.jasper.runtime.PageContextImpl.doHandlePageException(PageContextImpl.java:850)rn org.apache.jasper.runtime.PageContextImpl.handlePageException(PageContextImpl.java:779)rn org.apache.jsp.login_jsp._jspService(login_jsp.java:93)rn org.apache.jasper.runtime.HttpJspBase.service(HttpJspBase.java:70)rn javax.servlet.http.HttpServlet.service(HttpServlet.java:803)rn org.apache.jasper.servlet.JspServletWrapper.service(JspServletWrapper.java:374)rn org.apache.jasper.servlet.JspServlet.serviceJspFile(JspServlet.java:337)rn org.apache.jasper.servlet.JspServlet.service(JspServlet.java:2<em>6</em><em>6</em>)rn javax.servlet.http.HttpServlet.service(HttpServlet.java:803)rn com.mldn.struts.note.filter.EncodingFilter.doFilter(EncodingFilter.java:22)rnrnrnroot cause rnrnjava.lang.NoClassDefFoundErrorrn sun.reflect.GeneratedConstructorAccessor8.newInstance(Unknown Source)rn sun.reflect.DelegatingConstructorAccessorImpl.newInstance(Unknown Source)rn java.lang.reflect.Constructor.newInstance(Unknown Source)rn java.lang.Class.newInstance0(Unknown Source)rn java.lang.Class.newInstance(Unknown Source)rn org.apache.jasper.runtime.TagHandlerPool.get(TagHandlerPool.java:12<em>6</em>)rn org.apache.jsp.login_jsp._jspx_meth_html_005fhtml_005f0(login_jsp.java:105)rn org.apache.jsp.login_jsp._jspService(login_jsp.java:84)rn org.apache.jasper.runtime.HttpJspBase.service(HttpJspBase.java:70)rn javax.servlet.http.HttpServlet.service(HttpServlet.java:803)rn org.apache.jasper.servlet.JspServletWrapper.service(JspServletWrapper.java:374)rn org.apache.jasper.servlet.JspServlet.serviceJspFile(JspServlet.java:337)rn org.apache.jasper.servlet.JspServlet.service(JspServlet.java:2<em>6</em><em>6</em>)rn javax.servlet.http.HttpServlet.service(HttpServlet.java:803)rn com.mldn.struts.note.filter.EncodingFilter.doFilter(EncodingFilter.java:22)rnrn
tomcat6.exe出问题,startup.bat却正常
<em>运行</em><em>tomcat</em><em>6</em>.<em>exe</em><em>出现</em>如下问题:rnrnD:\<em>tomcat</em>\bin><em>tomcat</em><em>6</em>.<em>exe</em>rn[2011-04-2<em>6</em> 19:5<em>6</em>:58] [warn] The system cannot find the Registry key for servicrne '<em>tomcat</em><em>6</em>'rn[2011-04-2<em>6</em> 19:5<em>6</em>:58] [error] Load configuration failedrn[2011-04-2<em>6</em> 19:5<em>6</em>:58] [error] 系统找不到指定的文件。rn[2011-04-2<em>6</em> 19:5<em>6</em>:58] [error] Commons Daemon procrun failed with exit value: 2 (rnFailed to load configuration)rn[2011-04-2<em>6</em> 19:5<em>6</em>:58] [error] 系统找不到指定的文件。rnrn但<em>运行</em>startup却一切正常,此情况是什么问题???
软件打包后运行出现的问题
我用setup factory<em>6</em> 打包软件后,<em>运行</em>程序<em>出现</em>这样的<em>错误</em>rn然后程序就启动不了:rnrun-time error '-2147417848(80010108)':rnautomation errorrnthe object invoked has disconnected from its clients.rn不知道是什么原因? 急问大家,谢谢!
运行后会有玫瑰出现。。。。。。
<em>运行</em>后会有玫瑰<em>出现</em>,满屏的玫瑰花。。。。。。。。。。。。。。。。。。。
php运行出现乱码
rnrnrnrnalert('操作成功!');window.location.href='../member_manager.php'";rn rn elsern rn echo " ";rn rn rn else rn rn echo " ";rn rn?>rnrnrn这是部分代码
装weblogic后出现错误
我装weblogic <em>6</em>后,启动weblogic服务rn<em>出现</em><em>错误</em>:rn (NTSocketMuxer.java:173)rn at java.lang.Class.newInstance0(Native Method)rn at java.lang.Class.newInstance(Class.java:237)rn at weblogic.socket.SocketMuxer.makeTheMuxer(SocketMuxer.java:12<em>6</em>)rn at weblogic.socket.SocketMuxer.getMuxer(SocketMuxer.java:83)rn at weblogic.t3.srvr.ListenThread.run(ListenThread.java:232)rn>rn不知道事什么原因?谢谢大家给详细解释!
更改target后 。出现错误
更改target=android-10后,<em>出现</em>rnerror: Error retrieving parent for item: No resource found that matches the given name rn 'android:Theme.Holo.Light.DarkActionBar'.rn求大神指导。
编译内核后出现如下错误
在grub.conf文件中是这样写的:rntitle=new linuxrnroot (hd0,0)rnkernel /vmlinuz root=/dev/hda1rn启动时<em>出现</em>如下<em>错误</em>rnkernel panic:VFS: Unable to mount root fs on 03:01rn我用的是第一块硬盘的第一个分区rn请问如何解决?rnrn
升级xcode10后出现错误
xcode升级到10后,<em>运行</em>报下面<em>错误</em>,大概意思就是,你的某个sdk/项目里面有多余的info.plist文件 :-1: Multiple commands produce '/Users/zhangxiangdong/Library/Developer/Xcode/DerivedData/XCLSDKDemo-dwzoiktyggcxpifyjnpgrdoafkgl/Build/Product...
编译内核后重启出现错误
编译内核后重启,最后四行为:rnmount:error 19 mount ext3rnpivotrooot:pivot_root(/sysroot,/sysroot/initrd)failed:2rnumount:initrd/proc failed:2rnkernel panic -not syncing : noinit found. Try passing init=option to kernel.rn然后停止启动,按键无反应。rn我该怎么办?rn
IIS发布网站后出现错误
IIS发布网站后<em>出现</em>下面<em>错误</em>:rnrn[img=https://img-bbs.csdn.net/upload/201511/1<em>6</em>/1447<em>6</em>55742_518<em>6</em>51.png][/img]rnrn网上查了下,好多人都建议将IIS7 下网站托管管道由继承模式修改为经典模式,这其实是治标不治本. 求更好的解决方案rnrnWindows 7, asp.net 4.0
新建maven项目后,出现错误
新建maven项目后,<em>出现</em><em>错误</em>
打包后安装出现错误
rnACTION: DllSelfRegister: "C:\WINNT\System32\etCell.ocx"rnrnACTION: DllSelfRegister: "C:\WINNT\System32\RICHTX32.OCX"rnrnACTION: DllSelfRegister: "C:\WINNT\System32\TABCTL32.OCX"rnrn*** <em>错误</em>: 由于未找到文件 'C:\DOCUME~1\ADMINI~1.000\LOCALS~1\Temp\msftqws.pdw\$(DLLSelfRegisterEx)',它不能被注册。rn*** <em>错误</em>: (用户响应 '确定')rnrn*** <em>错误</em>: 工程1 安装不成功。rn*** <em>错误</em>: (用户响应 '确定')rnrn当我打包完安装的时候就在<em>错误</em>文档中<em>出现</em>下面的<em>错误</em>提示,不知道是什么原因啊???rnrn我还想问一下,当我在程序中的数据库放在局域网中,而且在程序中的路径也是指向该数据库的,这对我打包和安装应该没有影响吧???
Exadmin启动后出现错误
系统日志提示:rn该服务器因为<em>错误</em> 系统找不到指定的路径。 而无法为目录 '\\.\BackOfficeStorage' 添加虚拟根目录 '/Exadmin'。此数据为<em>错误</em>码。rnrnExchange 和 public虚拟目录也提示找不到,但这两个目录手动设置路径后没有问题,可Exadmin却能,因为我不知道\\.\BackOfficeStorage' 表示什么意思,浏览目录不知道位置在哪?\\.\BackOfficeStorage说是ExOLEDB供应者,请问如何解决这个问题,我重新安装后没有问题,可一重新启动就<em>出现</em>rn rn
C++程序运行出现错误
[img=C:\Documents and Settings\Administrator\My Documents\My Pictures\1.png][/img]
#include 后总出现错误!
D:\Program Files\Microsoft Visual Studio\VC98\INCLUDE\winsock2.h(99) : error C2011: 'fd_set' : 'struct' type redefinitionrn
网站上传后出现错误
我做好的网站在本地是好好的,上传后就有上面的错rn是什么原因啊, 是PHP版本问题?rnrnWarning: Cannot send session cookie - headers already sent by (output started at /usr/vhome/i/n/t/interpc.cn/www/index.php:11) in /usr/vhome/i/n/t/interpc.cn/www/index.php on line 125rnrn请看:www.interpc.cnrn
打包后出现错误,急!!!!!
在自己机器上<em>运行</em>正常,在别的机器上安装完后<em>出现</em>这个<em>错误</em>rnrn<em>运行</em>时<em>错误</em>‘91’:rn未设置对象或with block变量rnrn请问怎么解决rnrn程序是在win2k操作系统上做的rn测试机器也是win2krn
phpcms 安装后出现错误
[b]<em>出现</em>下列提示[/b]rnrnrn另一个程序正在使用此文件,进程无法访问。rn[Wed Apr 28 18:58:53 2010] [error] apache2: Service is already installed.rnThe service already exists!rnThe current server installed: D:\PC_webserver\mysql\bin\mysqld-nt.<em>exe</em> --defaultsrn-file=D:\PC_webserver\mysql\my.ini mysqlrnapache2 服务正在启动 .rnapache2 服务无法启动。rnrn发生服务特定<em>错误</em>: 1.rnrn请键入 NET HELPMSG 3547 以获得更多的帮助。rnrnrnmysql 服务已经启动成功。rnrn安装完成rn请按任意键继续. . .rnrnrn网上我也找了的,他说要修改ISS端口,但是我的电脑里找不到相应的位置来修改。有其他方法吗?rn
重装jdk后,出现错误
debug时,提示————————rn——————rnrnrnException occurred <em>exe</em>cuting command line.rnCreateProcess: E:\cen\SonyEricsson\JavaME_SDK_CLDC\PC_Emulation\WTK2\bin\emulator.<em>exe</em> -Xdebug -Xrunjdwp:transport=dt_socket,suspend=y,server=y,address=38<em>6</em>3 -classpath E:\cen\workspace\00\verified\classes -Xdevice:SonyEricsson_W950_Emu -Xjam:transient=http://localhost:2008/ota/00/00.jad error=3rn
使用线程后的出现错误
我在程序中使用了多线程来处理数据,处理时一点问题都没有,但当我关闭系统时提示出错,出错提示为:Syetem Error :1400 .相互身分验证失败。该服务器在域控制器的密码过期。rnrn应该是主线程没有释放,但具体要怎么释放法,在何处释放就不知道了。rn请大家帮忙解决!rnrn
Window_Mobile_RDA数据库操作解决方案研究.rar下载
Window_Mobile_RDA数据库操作解决方案研究.rar Window_Mobile_RDA数据库操作解决方案研究.rar 相关下载链接:[url=//download.csdn.net/download/ykanykan/3271825?utm_source=bbsseo]//download.csdn.net/download/ykanykan/3271825?utm_source=bbsseo[/url]
C++全方位学习下载
C++全方位学习,c++初学资料文档 非常适合初学者学习 相关下载链接:[url=//download.csdn.net/download/rbllbr123/4376031?utm_source=bbsseo]//download.csdn.net/download/rbllbr123/4376031?utm_source=bbsseo[/url]
Arc Hydro Tools 1.1 - Tutorial.pdf下载
一本讲述ArcGIS水文分析的专业英文讲义 相关下载链接:[url=//download.csdn.net/download/w1085550637/7777841?utm_source=bbsseo]//download.csdn.net/download/w1085550637/7777841?utm_source=bbsseo[/url]
相关热词 c#检测非法字符 c#双屏截图 c#中怎么关闭线程 c# 显示服务器上的图片 api嵌入窗口 c# c# 控制网页 c# encrypt c#微信网页版登录 c# login 居中 c# 考试软件
我们是很有底线的