keil报错:stm32f10x_type.h(23):error:#256:invalid invalid redeclaration of type [问题点数:30分,结帖人iceiilin]

Bbs1
本版专家分:62
结帖率 100%
Bbs5
本版专家分:2525
Bbs8
本版专家分:37608
版主
Blank
红花 2013年6月 硬件/嵌入开发大版内专家分月排行榜第一
2007年10月 硬件/嵌入开发大版内专家分月排行榜第一
2007年6月 硬件/嵌入开发大版内专家分月排行榜第一
2007年5月 硬件/嵌入开发大版内专家分月排行榜第一
2007年4月 硬件/嵌入开发大版内专家分月排行榜第一
2007年3月 硬件/嵌入开发大版内专家分月排行榜第一
Blank
黄花 2013年4月 硬件/嵌入开发大版内专家分月排行榜第二
2007年9月 硬件/嵌入开发大版内专家分月排行榜第二
Blank
蓝花 2013年5月 硬件/嵌入开发大版内专家分月排行榜第三
2012年9月 硬件/嵌入开发大版内专家分月排行榜第三
2007年11月 硬件/嵌入开发大版内专家分月排行榜第三
Bbs1
本版专家分:62
Bbs1
本版专家分:0
Bbs1
本版专家分:0
Bbs1
本版专家分:62
Bbs1
本版专家分:0
Bbs1
本版专家分:0
Bbs1
本版专家分:0
oracle error invalid rowid
oracle <em>error</em> <em>invalid</em> rowid
升级Xcode9.3之后HandyJson崩溃
修改第26行这个方法即可
mybatis报错合集!!!!
1.Error querying database.  Cause: java.lang.IllegalArgumentException: Mapped Statements collection does not contain value for com.mtsbw.ma.wms.newErp.dao.productWeight.IAddProdWeightDaogetIdByNum解决方法...
deploy遇到问题,查了google也没解决
代码如下:nnpragma solidity ^0.4.18;ncontract Voting {n    //xiaop  14n    //lih   10n    //luoh   13n    //wangjq  15n    //wangy    17n    //[&quot;xiaop&quot;,&quot;lih&quot;,&quot;luoh&quot;,&quot;wangjq&quot;,&quot;wangy&quot;]n    bytes32[] candidat...
ES 日期
https://www.elastic.co/guide/en/elasticsearch/reference/current/mapping-date-format.html njoda http://www.joda.org/joda-time/apidocs/org/joda/time/format/DateTimeFormat.html nDate data<em>type</em> https://www
解决蓝桥杯嵌入式竞赛板在MDK5上使用CooCox下载出现unknown device的问题。同时也是蓝桥杯嵌入式下载程序的详细教程。
首先看看问题现象,点击下载后出现图1的错误,如果是pack问题确认后会出现图2错误。nn nn ...
QTimer头文件包含问题
使用定时器的时候,添加代码QTimer*SendTimer=newQTimer(parent);<em>报错</em>:E:\QtProject\SocketProj\Best\tcp demo\tcpdemo\client\mainwindow.cpp:17: <em>error</em>: <em>invalid</em> use of incomplete <em>type</em> 'classQTimer'   QTimer *SendTimer = new...
keil下载程序提示“Invalid ROM Table”的解决办法
问题:项目需要将STM32F407的程序移植到STM32F427IIT上,其外接晶振由原来的25M换成8M,其对应时钟频率也跟随调整,但实测频率一直上不去,为验证硬件通路,在STM32F427IIT上贴25M晶振,下载程序出现下图1提示: n n图 1分析STM32F427IIT硬件电路的晶振为25M,软件工程设置的晶振为8M,晶振频率修改错误导致程序超频锁死。解决办法n调整软件工程晶振频率;nBO
运行增强学习框架Ray报错:关于Redis的一些东西,redis.exceptions...
(不断更新...)nn nnRay Version:0.5.3n Python Version:3.5.6n导入ray,并初始化执行环境nnnimport raynray.init(use_raylet=True)nn得到如下错误1:nnredis.exceptions.DataError:类型的输入无效:'NoneType'。首先转换为字节,字符串或数字。nnnProcess STDOUT an...
学习 iOS Application Security 需要注意的一些点
http://highaltitudehacks.com/nn0. 基础环境 iPhone 5s 64bit iOS 8.1 已越狱nn1. mobileTerminal 使用 源 http://cydia.angelxwind.net 的版本;vim 版本7.1-3p,不要升级到7.3-1;nn2. dyld: Library not loaded: /usr/lib/libpcre.0.dyl...
开博引言 暨 第一篇《iOS中 类与JSON、字典等的转换》
楼主iOS开发小白,接触了没多长时间。由于公司项目比较紧急,所以直接上手开发。在这记录一下项目开发过程中的一些重要点,shun b
POI导出excel到jar包冲突查错
在使用POI导出到excel的时候遇到过一个这个问题: njava.lang.IllegalArgumentException: Invalid column index (<em>256</em>). Allowable column range for BIFF8 is (0..255) or (‘A’..’IV’) 百度过后才知道原来excel03的是只能支持到最大<em>256</em>列的导出。而我们在导出的时候没有考虑到对
proxool jar包
配置proxool后,启动服务时<em>报错</em>的解决方法。 Invalid property 'houseKeepingSleepTime' of bean class [org.logicalcobwebs.proxool.ProxoolDataSource]: Bean property 'houseKeepingSleepTime' is not writable or has an <em>invalid</em> setter method. Does the parameter <em>type</em> of the setter match the return <em>type</em> of the getter?
startup_stm32f429_439xx
startup_stm32f429_439xx.s
qml常见问题及其解决
\main.cpp:<em>23</em>: <em>error</em>: <em>invalid</em> use of incomplete <em>type</em> 'class QDeclarativeEngine'n     QDeclarativeContext *context=engine->rootContext();nnn.........................................................
timespec编程报错
timespec time_start;rn       timespec time_end;rn       //clock_gettime(CLOCK_REALTIME, &time);  //获取相对于1970到现在的秒数;rnrnrn      clock_gettime(CLOCK_REALTIME, &time_start);rn      sleep(2);rn      clock
oracle建表关联外键时报invalid datatype错误
创建两张表班级表、学生表。 n在关联外键关系时,执行语句<em>报错</em><em>invalid</em> data<em>type</em>。 n其中的意思是数据类型无效,然而我看了很多遍建表语句,并没有发现有类型写错的地方。 n反复观察,外键对应的数据类型并没有出错,只是在管理外键关系时没有指定别名名称。在mysql中可以匿名,看来在oracle中需要指定名称。 n所以,补上别名名称后语句就执行成功了。
javamail使用教程,正确代码,各种错误及解决方案
在实现javamail之前,你需要将程序用到的两个jar包导进来。activation.jar和mail.jarrn按照流程,我走了好多遍,终于把它给走通。下面我总结了可能出现的各种原因rnrnrn错误一:535 5.7.8 authentication failed   身份认证失败   原因:(1)可能是用户名密码错误(2)主机名错误rn错误二:com.sun.mail.smtp.SMTPSe
使用xshell测试elasticsearch的ik分词报错问题
我的xshell是默认安装的,今天把ik分词安装好了,然后按照安装官方给的进行测试,rn第一步rnrnrn1.create a indexrnrncurl -XPUT http://localhost:9200/indexrnrn没问题rnrnrn第二步rnrnrn2.create a mappingrnrncurl -XPOST http://localhost:9200/index/fullt
解决redis报错
最近想学学redis, 于是在虚拟机搭了一个环境 ,安装好了redis, 3.0.0版本。正常启动,本地连接测试,竟然报了一个错误RedisException: protocol <em>error</em>, got 'n' as reply <em>type</em> byte, 查了一下,原来是 启动 redis-server的时候  没有加上配置文件,于是把redis.conf 复制到/etc/下一份,在配置文件里redis...
Python 写文件报错TypeError的解决办法
处理上传的文件:        f1 = request.FILES['pic']        fname = '%s/%s' % (settings.MEDIA_ROOT, f1.name)        with open(fname, 'w') as pic:            for c in f1.chunks():                pic.write(c)测试<em>报错</em>:...
ElasticSearch学习笔记之十三 索引API
ElasticSearch学习笔记之十三 索引API建立索引删除索引索引设置索引映射索引的打开与关闭n建立索引n我们知道,我们在想索引插入数据的时候,索引可以自动创建并创建映射,如果我们需要,我们可以对索引的建立过程做更多的控制:nn设置索引的分片和复制信息。n配置映射信息。nn我们可以手动创建索引,在请求体里面传入设置或类型映射。nPUT my_indexn{n &amp;quot;settings&amp;quot;: {n ...
React Native 学习笔记(二)
坑一,环境好了,但是因为项目需求经常要安装一些三方库,xcode-select: <em>error</em>: tool ‘xcodebuild’ requires Xcode, but active developer directory ‘/Library/Developer/CommandLineTools’ is a command line tools instance 遇到这个错误:参考以下文章: nh
git 添加 ssh keys 出现如下错误
git 添加 ssh keys 出现如下错误:rnrnKey is <em>invalid</em>. It must begin with 'ssh-ed25519', 'ssh-rsa', 'ssh-dss', 'ecdsa-sha2-nistp<em>256</em>', 'endsrnrnrn在终端输入如下命令rnrn$ ssh-keygen -t rsa -b 4096 -C "809753922@qq.com"rnrn最
在对数据库进行操作时,控制台报错:java.sql.SQLException: Invalid value for getInt() - '电子书';
Caused by: java.sql.SQLException: Invalid value for getInt() - '电子书' at com.mysql.jdbc.SQLError.createSQLException(SQLError.java:1094) at com.mysql.jdbc.SQLError.createSQLException(SQLError.java:997) ...
dubbo-admin在jdk1.8下报错问题(已解决)
在虚拟机上部署dubbo-admin的时候<em>报错</em>:nERROR context.ContextLoader - Context initialization failednorg.springframework.beans.factory.BeanCreationException: Error creating bean with name 'uriBrokerService': Cannot
关于SAMSUNG S3C2440A在MDK软件keil5下编程(汇编语言)所遇到的各种问题合集
n n n 版权说明:未经许可,不得转载n著作权归博主所有n本博客一切解释权归博主所有​nn<em>报错</em>代码1:n​.\Objects\demo003.axf: Error: L6<em>23</em>8E:nlab3.o(LAB3) contains <em>invalid</em> call from '~PRES8 (The user did notnrequire code to preserve ...
SPRING接收前台传入List时,超过256报IndexOutOfBoundsException异常
首先看看异常norg.springframework.beans.InvalidPropertyException: Invalid property 'detail[<em>256</em>]' of bean class [com.suning.asvp.mer.entity.InviteCooperationInfo]: Index of out of bounds in property path 'de
Hive配置hive-site.xml后启动出错
错误信息:rnrn[hadoop@hadoop1 conf]$ hivennLogging initialized using configuration in jar:file:/home/hadoop/happ/apache-hive-0.14.0-bin/lib/hive-common-0.14.0.jar!/hive-log4j.propertiesnSLF4J: Class path c
Multisim 安装报错:encountered an improper argument 解决方案(部分仪器实用)
在进行Multisim 12.0 安装时,将下载好的安装包解压以后没有弹出下一步安装步骤,这个时候到解压完以后的安装路径下面去,看到了autorun.exe ,点击autorun.exe文件系统没反应或者出现“encountered an improper argument”的错误提示信息。nn之后我又在虚拟机里面安装了一遍,发现之前解压以后的文件中缺少一些文件,从虚拟机中解压好的文件夹中复制缺少...
VMware新建虚拟机报错 Invalid path
最后发现原因是 没有创建文件夹的权限所以新建的虚拟机不成功打开vmware的时候,用 sudo vmware
一些关于Redis的坑
#1nDataError at /api/alleventlist/nInvalid input of <em>type</em>: 'CacheKey'. Convert to a byte, string or number first.nnn解决nredis版本的问题,把redis版本改成2.0即可npip3 install redis==2.10.6nnn...
Xcode自定义静态库需要注意点 Invalid bitcode signature
当自己辛辛苦苦编写完一个静态库,添加到工程后在debug的环境下编译正常使用,但是切到release环境下的时候编译,又会出现以下错误:rn<em>error</em>: Invalid bitcode signaturernclang: <em>error</em>: linker command failed with exit code 1 (use -v to see invocation)rn这时候有可能出现的原因是你的静
Error[Pe256]: invalid redeclaration of type name "uio" (declared at line
[code=c]#include"stm32f4xx.h"rnrnrnfloat get_p(float <em>error</em>);rnfloat get_i(float <em>error</em>, float dt);rnfloat get_d(float input, float dt);rnvoid reset_I();rnrnrnclass khoihoiioh rnpublic:rn float _integrator; ///< integrator valuern float _last_input; ///< last input for derivativern float _last_derivative; ///< last derivative for low-pass filterrn float _d_lpf_alpha; ///< alpha used in D-term LPFrn;rnrnrnrn[/code]rnrn在pid.h中 就是这个不管怎么改名字都是一样的错误,本来没错的,后来zuo把class想换成结构体,结果就坏了[img=https://forum.csdn.net/PointForum/ui/scripts/csdn/Plugin/003/onion/33.gif][/img]rnrn
虚拟机 Invalid system disk 错误解决方法
先关闭客户机在“虚拟机”-“电源”中选择“打开电源时进入固件(F)”之后重启客户机,会自动进入BIOS界面在Boot中将CD-ROM Drive调整为第一启动(一般是按“+”和“-”调整) n按F10保存并退出BIOS这时就可以正常对给虚拟机分配的磁盘分区或安装操作系统了。
TOAD连接Oracle数据库失败:OCI_INVALID_HANDLE解决
1. toad 连接Oracle数据库连接失败如图:nnnn2. 导致这个情况的前因:toad运行情况下,突然断电。nnn3. 解决:toad 只是把默认的登陆连接数据丢失了,只用重新填写相关信息再次登陆就行了。n我的情况是:Connect Using 没有选择对,改为可用的正确选项就行了。n如下图修改框中位置为可用项就是了。
Hive SQL语法报错 及相应解决方法
Hive SQL语法与经常用的mysql语法具有一定差异性,按照写mysql的习惯写出的sql经常<em>报错</em>,且<em>报错</em>很难看出问题原因,因此在此记录出现问题的现象和解决方式nnError: Error while compiling statement: FAILED: ParseException line 3:2 cannot recognize input near '(' 'SELECT' 'a'...
华为短信开发包smproxy.jar,完美无bug版
好多版本是会<em>报错</em>的,[Fatal Error] :24:28: An <em>invalid</em> XML character (Unicode: 0xd863) was found in the element content of the document. org.xml.sax.SAXParseException: An <em>invalid</em> XML character (Unicode: 0xd863) was found in the element content of the documen.,这个版本是纠正过后重新打包做的
openssl命令的使用
查看openssl的安装包:
新浪微博请求授权显示错误页面的解决方法((error:invalid_request) )
新浪微博请求授权显示错误页面的解决方法((<em>error</em>:<em>invalid</em>_request) )
org.springframework.web.servlet-3.0.1.RELEASE-A.jar
Error creating bean with name 'org.springframework.web.servlet.handler.SimpleUrlHandlerMapping#0' defined in ServletContext resource [/WEB-INF/springMVC-servlet.xml]: Initialization of bean failed; nested exception is org.springframework.beans.factory.BeanCreationException: Error creating bean with name 'userController' defined in ServletContext resource [/WEB-INF/springMVC-servlet.xml]: Error setting property values; nested exception is org.springframework.beans.NotWritablePropertyException: Invalid property '<em>error</em>_view' of bean class [com.demo.controller.action.AuthorAction]: Bean property '<em>error</em>_view' is not writable or has an <em>invalid</em> setter method. Does the parameter <em>type</em> of the setter match the return <em>type</em> of the getter?
python3 pip安装模块过程中提示error: invalid command 'bdist_wheel'错误的解决办法
有时候使用系统自带(比如ubuntu apt-get安装的python3-pip)的pip来安装第三方模块时,会提示类似这样的错误:n n <em>error</em>: <em>invalid</em> command 'bdist_wheel'n n ----------------------------------------n Failed building wheel for autopep8nnn有可能是因为...
编译报错记录
问题:用java -jar apktool.jar b 回编apk时<em>报错</em> Error for input ‘.parameter’: Invalid directive![在这里插入图片描述]n原因:反编译工具版本不一致的问题,低版本的baksmali.jar反编译的smali文件有.parameter,新版本的没有这个。n解决方法:下载新版的baksmali.jarnn...
Caffe 体验和学习
Deep Learning断断续续看了有一段时间DL了。最近因为准备找工作开始加码GPUn n cat /proc/driver/nvidia/gpus/0/informationn nCaffe总的来说很顺利。目前就是安装软件而已。按照官网说明做了,用native Make方式安装。只碰到一个问题: nmake runtest <em>报错</em>:n .build_release/tools/caffe
kafka connect 一言不合就死进程
错误栈是这样的,打底的意思呢,是我的connector有个配置错了 n我知道错了,可尼玛connect进程喂猫挂了啊 n知道从这个状态恢复有多难么,不删除connectors,起来就挂啊, nconnect挂了,我得删topic才能删掉配置啊。 nkafka connect各种挂,各种难恢复,各种自我感觉良好。 n如果能够重选,还选kafka connect,劳资特么改姓卡啊。
关于R语言报错invalid argument to unary operator(一元运算符的无效参数)---ggplot2画图问题--解决Monte Carlo模拟输出
目录nn背景nn我的操作(错误nn解决问题过程:nn1)查找 nn2)尝试将画图等过程从函数中移出来nn3)尝试将+geom_line(aes(y=h_mean-sqrt(h_var))移入到前面的一行中去nn结果nn总结nn背景nn根据Monte Carlo模拟输出:nn给定函数 用估计积分值, 其中样本服从[0,1]上的一致分布。n做下面工作: (1) 画出上述估计值随
aspx部署加载失败的解决办法
aspx部署加载失败的解决办法问题在编写Asp.net网页(aspx)时,调试运行时没有问题,部署之后打开则出现以下错误: n<em>error</em> on line 1 at column 2: StartTag: <em>invalid</em> element name
openssl生成证书
一.openssl命令nn     nn nnNAMEnn       openssl - OpenSSL command line toolnn nnSYNOPSISnn       openssl command [ command_opts ] [ command_args ]nn[a4729821@JYstd openssl]$ openssl --helpnnopenssl:Error:...
安装Maven,运行mvn -v后出现 Error: JAVA_HOME is set to an invalid directory.(图片可能太大,无法显示,有时间再上传)
问题:nnn1.看到这个有点懵逼,刚开始以为是JDK是不是出问题了。所以:nnn恩,没问题。继续想,既然<em>报错</em>了就去找这个maven的bin目录下都有啥,cmd打开的,自然看这个:nnn既然是JAVA_HOME<em>报错</em>,就搜索JAVA_HOME,然后一个个的看,恩,到这里,我再打开环境变量进行对比一下。nnnnn这一对比就发现问题了。JAVA_HOME里面已经存在bin目录了
nginx在reload时候报错invalid PID number的解决方法
今天发现网站访问不了,觉得可能是nginx的问题,检查了一下果然nnnn-t 没问题,reload就<em>报错</em>了。搜了一下解决办法。nn因为是加载配置文件报的错,所以用-c 选项指定配置文件 ,如此指明后问题解决nnnn再访问网站,正常...
Linux环境下mosquitto的安装及部分问题解决方法
本文主要记录了在Linux环境下安装mosquitto时遇到的一些问题及解决方法。
nginx 服务重启报错
nginx 服务重启<em>报错</em>:1、nginx: [emerg] open() &quot;/usr/local/etc/nginx/nginx.conf&quot; failed (2: No such file or directory)2、nginx: [<em>error</em>] <em>invalid</em> PID number &quot;&quot; in &quot;/usr/local/nginx/run/nginx.pid&quot;解决:[root@localhost...
Gradle安装遇到的坑
话说:nn各位读者盆友,晚上好!寡人小美哈。这里分享下今天遇到的一个小坑,也是花了点时间才想到解决方案。nn目录nnnn一、问题背景 n二、解决方案 n三、总结nnnn环境:Mac Book Airnn难度系数:★☆☆ ☆☆ n建议用时:30minnn一、问题背景nnMac下面安装Gradle,还不简单得跟玩似的?是的,确实很简单。下载个gradle.3.5的包,配置.bash_profile的...
关于自定义控件在布局文件中使用时提示error: Error parsing XML: not well-formed (invalid token)错误的问题
今天在尝试自定义一个控件后,在布局文件中使用的时候<em>报错</em>rnrn    xmlns:tools="http://schemas.android.com/tools"rn    xmlns:carrey="http://schemas.android.com/apk/res/com.example.customview"rn    android:layout_width="match_parent"
Rreact Native 常见错误总结
Rreact Native 常见错误总结
protel.99 format '%x' invalid or incompatible with argument打软体报错补丁.rar
protel.99 format '%x' <em>invalid</em> or incompatible with argument打软体<em>报错</em>补丁
Node n命令更新错误
系统版本mac os x 10.11.6使用n version命令更新版本后,无论是npm还是node命令都报如下错误:dyld: Symbol not found: n Referenced from: /usr/local/bin/noden Expected in: /System/Library/Frameworks/CoreFoundation.framework/Versions/A
Mac OS安装brew出现错误的解决办法
Mac OS默认已安装好了ruby,所以可直接运行一下命令:/usr/bin/ruby -e "$(curl -fsSL https://raw.githubusercontent.com/Homebrew/install/master/install)"但是在安装过程中,会提示如下错误:xcode-select: <em>error</em>: <em>invalid</em> developer directoryn'/Libra
Invalid ROM Table原因及解决办法
在将Discovery的工程移植到Mini-STM32F4x9BI开发板时,使用ULINK2下载程序可能会出现如下图所示的“Invalid ROM Table”这个错误。nnnnn可能原因是使用Mini-STM32F4x9BI开发板时(STM32F429BITx)外部晶振为25M,而使用Discovery的工程(STM32F429ZITx),其外部晶振为8M,晶振频率修改错误导致程序超频
python redis set list报错及redis 获取list字符串,解析为list
n1. Python redis set list<em>报错</em>nredis set list<em>报错</em>Invalid input of <em>type</em>: 'list'. Convert to a byte, string or number first. n加上str解决,怀疑版本问题nn2. Python中redis 获取list字符串,解析为listnquery_list = redis_conn.get(key...
获取素材列表返回40004 invalid media type !(大坑)解决办法
问题一:nn刚开始根据他需要的参数nn调用nhttps://api.weixin.qq.com/cgi-bin/material/batchget_material?access_token=ACCESS_TOKENn后,我用的是url传参,无论<em>type</em>值是voice, image还是news, 总是给我返回n{&quot;errcode&quot;:40004,&quot;errmsg&quot;:&quot;<em>invalid</em> media typ...
Vue项目错误汇总
1. [Vue warn]: Error in beforeCreate hook: “Error: 堆栈溢出”nnexport default new Router({n routes: [n {n path: '/',n redirect:'/'//原因:重定向不能与原路径相同n },n {n path: '/login',n name...
JavaScript学习随记——错误类型
错误类型: 执行代码期间可能会发生的错误有多种类型。每种错误都有对应的错误类型,而当错误发生时,就会抛出相应类型的错误对象。rnECMA-262定义的7种错误类型rnrnrnError: 是错误的基类型,其他错误类型都继承该类型。Error 类型的错误很少见,如果有也是浏览器抛出的。EvalError: 使用eval() 函数而发生异常时被抛出。RangeError:在数值超过相应范围是就会被抛出
Mysql32位libmysql.lib和libmysql.dll文件
32位的libmysql.lib和libmysql.dll文件,解决vc <em>invalid</em> machine <em>type</em>错误。
react使用小记1
浏览器显示的问题描述!nWarning: Failed prop <em>type</em>: Invalid prop `children` of <em>type</em> `string` supplied to `MuiThemeProvider`, expected a single ReactElement.nin MuiThemeProvider (created by Root)nin Root (create
以form表单上传文件,接口不响应,后台显示"file" does not contain '/'
//在生成form表单rnrnpublic func appendBodyPart(data data:rnNSData, name: String, mimeType:rnString)rnrn//可能是拼接的问题,用下面方法拼接rnrnrnrnpublic func appendBodyPart(data data:rnNSData, name: String, fileName:rnStri
真机运行没问题,Archive是报invalid bitcode signature错误
n n n 这个问题真是莫名其妙,之前也出现过,但当时就是Clean项目然后重启电脑解决,无奈幸运之神不再眷顾,之后搜了N多的办法才解决,特此记录一下!首先搜索<em>invalid</em> bitcode signature关键字n1.Clean重启电脑n没什么好说的,xcode有时会报些错误都可以通过此方法解决,问原理...呵呵n2.修改Bitcode检测nnnnnnn22262...
出现找不到第三方库文件问题, invalid bitcode signature 不妨试试下面的方法
关于 <em>invalid</em> bitcode signature<em>invalid</em> bitcode signature解决方案1.错误原因:解决办法:将YES与NO换一下位置2.Clean重启首先要做的就是网管的终极套路,关机重启,所以我们遇到问题当然就是Clean Project and Build,不行就Restart Xcode,其实很多莫名奇怪的问题都可以通过这样的方案搞定,毕竟Xcode确实bug不...
构建Potatso问题集锦及解决方案
转载请注明文章出处:https://tlanyan.me/build-pota...nn前言n半年前写过一篇构建自用Shadowsocks客户端Potatso的教程“构建自己的iOS网络代理客户端”。当时除libYAML依赖下载不正常外,编译测试使用全过程都很顺利。文章投递到几个平台被数万网友围观,不少网友根据教程在构建时遇到各种问题。最...
微信卡券开发错误自排查参考文档
微信卡券开发错误自排查参考文档rn rn rn rn目录rn微信卡券开发者错误排查文档...rn1rnPart.1常见错误...rn3rn1.1接入指引...rn3rn1.2卡券创建...rn4rn1.3卡券投放...rn5rn1.4卡券核销...rn8rnPart.2常见疑问...rn9rnPart.3错误返回码释义...rn11rn rn rn rn rn rn rn rn rn rn rn 
关于微信分享wx.config配置时遇到invalid signature错误的解决办法
关于微信分享wx.config配置时遇到<em>invalid</em> signature错误的解决办法n上个礼拜要开发一个包含微信分享、获取用户openid以及获取用户是否关注公众号的功能,因为是第一次开发,遇到了很多问题。其中一个就是<em>invalid</em> signature错误。然而我万万没想到,原因竟然是没有配JSSDK的接口安全域名!!!(顺便提醒一句,要使用wx.config需在页面引用jweixin-1.4...
学习unity shader问题记录
 <em>invalid</em> output semantic 'SV_POSITION': Legal indices are in [0,0] at line 25 (on d3d11)《unity shader 入门精要》中,有一段实例代码// Upgrade NOTE: replaced 'mul(UNITY_MATRIX_MVP,*)' with 'UnityObjectToClipPos(*)'nn...
编译没问题,但是运行时出现错误如下:Debug error!Invalid allocation size:4294967295 bytes.
贴一下代码:void CMFCApplication13Dlg::OnBnClickedButton1(){ CString cstr; GetDlgItem(IDC_ADDRESSEDIT)-&amp;gt;GetWindowText(cstr); cstr.Replace(L&quot;\\&quot;,L&quot;\\\\&quot;); char* charFile1 = (char*)cstr.GetBuffer(cstr.GetL...
VMware共享文件夹编译出现“Value too large for defined data type”错误的解决办法
主机Win7, 虚拟机Ubuntu15.04.   在Ubuntu 下编译共享目录中的C代码出现 “Value too large for defined data <em>type</em>”。rn结合一些资料,找到了解决办法(mount的时候加上“nounix,noserverino”参数):rn具体操作为,编辑文件 “/etc/init.d/vmware-tools”, 查找字符串 “vmhgfs_mnt”r
Android Studio生成Jar包遇到的InvalidPackage错误解决方法
前段时间想打包一个关于OkHttp的Module,于是参考了这篇文章n在Module的gradle里加入ndef makeJar(String target, String classDir) {n exec {n executable "jar" //调用jarn args "cvf", targetn args "-C", classDi
微信扫描二维码接口报“config:invalid url domain”错误!
通过使用微信JS-SDK,开发扫一扫功能时,使用微信测试号没问题,当部署到生产环境时报“config:<em>invalid</em> url domain”错误!无效的url域名,当前页面所在域名与使用的appid没有绑定,请确认正确填写绑定的域名,如果使用了端口号,则配置的绑定域名也要加上端口号,一个appid可以绑定三个有效域名,配置步骤如下:微信公众平台后台→设置→公众号设置→功能设置→JS接口安全域名输入...
初学spark碰到的一些问题
在使用spark完成工程问题中遇到的一些实际的问题。
Tooltip页面白板问题
render: (text,record)=&amp;gt;{n return &amp;lt;Tooltip title={text} placement=&quot;bottom&quot;&amp;gt;n &amp;lt;div&amp;gt;{text.createDate}&amp;lt;/div&amp;gt;n &amp;lt;/Tooltip&amp;gt;n}nn大家能看出上面这段代码有什么问题么? n我当时...
nginx重新加载启动报错解决!
[root@localhost sbin]# ./nginx -s reloadnnnginx: [<em>error</em>] <em>invalid</em> PID number "" in "/var/run/nginx/nginx.pid"n或者我们重新修改了nginx.conf配置文件,然后重新启动./nginx -s reload 有可能报nnginx: [<em>error</em>] open() "/var/run/ng
react3阶段学习笔记
------------------------------------------rnrn当我们需要获取某个节点,并改变其属性值或者其他针对性的操作时rn现在节点中定义id属性,然后定以ref属性,两者值相同,rn如:rn然后在针对这个节点的操作函数中,rnthis.refs.su.style.color = "red",就可以在点击提交后,rn改变其颜色了。rn如:change(age) {r
Bitcode导致的编译报错
在xcode7.1进行Archive时,会报这样的错误nnnnnld: object contains <em>invalid</em> bitcode: /Users/XXX/UMSocial_Sdk_Extra_Frameworks/Wechat/libWeChatSDK.a(WechatAuthSDK.o) for architecture arm64nnclang: <em>error</em>: linker
打包成jar文件后运行出现Invalid or corrupt jarfile 解决
打包成jar文件后运行出现Invalid or corrupt jarfile 解决
let's encrypt 生成证书时,404 not found的错误
今天在服务器上为另一个域名添加ssl,结果出现了http://xxx/.well-known/… 404 not found的错误[root@fungli myxhs]# sudo certbot certonly --webroot -w /webser/www/myxhs -d xxx.xxx.cn -m xxxx@outlook.com --agree-tosnSaving debug lo
C++报错集锦
rn (一)<em>invalid</em> initialization of non-const reference of <em>type</em> ‘float&amp;amp;’ from a temporary of <em>type</em> ‘float’ 代码如下: #include &amp;lt;iostream&amp;gt;rnusing namespace std;rnrnvoid update(float&amp;amp; i) {rn co...
Redis 密码 设置错误 出现的 报错处理
异常出现原因分析:主因redis的启动方式不同导致的n第一种:是使用服务端命令  n./redis-server 这种方式启动默认无密码,若是程序中连接池的设置是有密码的就会出现以下错误n第二种:是指定配置文件n执行命令./redis-server redis.config 这种方式需在redis.conf,中设置   requirepass = "你的密码"来启动,若是不设置密码就会出现
linux tar 解压报错解决方法
在解压tar.gz文件的时候<em>报错</em>rnrnrnrnrnrnrnrn1rnrn2rnrn3rnrn4rnrn5rnrnrnrnrn[Sun@localhostrn Downloads]$ tarrnrn-zxvf clion-141.351.4.tar.gzrnrn rnrngzip:rn stdin: not inrnrngzip rnformatrnrntar:rn Child returned
gatk报错整理
n n n gatk -V gvcf<em>报错</em>n<em>报错</em>内容nA USER ERROR has occurred: Failed to create reader from file:///...nnnnnnnimage.pngnn<em>报错</em>原因:gvcf同目录下缺少idx文件n解决方法:复制过来上步骤和gvcf一起生成时候的idx文件过来nngatk安装调用<em>报错</em>n直接装软件:con...
【LaTeX】WinEdt编辑UTF-8中文文档出现乱码或编译错误"Package CJK Error: Invalid character code"的解决方案
使用WinEdt来编辑UTF-8编码的带有中文的文档时,经常会遇到打开乱码的问题; 或者在编译文档时,抛出错误:“Package CJK Error: Invalid character code”。为此,本文介绍了相应的解决方案。
webpack 报错信息总结
配合react项目,从零领进webpack@3的大门,基础配置和打包项目地址:nnGitHub:https://github.com/susuGirl/testWebpacknnnwebpack 3.5.3 webpack-cli 3.1.0 webpack-dev-server 2.9.7nnn运行 npm run server <em>报错</em>(webpack-dev-server)nnevents.js...
MySQL JSON Path 键为数字的错误
小子在使用mysql的json时,键是数字,按常规方法访问:nSET @j = '{"0": {"a":1, "b":2}, "other": {"c": 3, "d": 4}}';nSELECT JSON_EXTRACT(@j, '$.0.a') AS '$.0.a'nn但是报了一个异常:nnInvalid JSON path expression. The <em>error</em> is around ch...
ext+struts1.2图书管理系统下载
ext+struts1.2图书管理系统让你了解ext框架以及与struts1.2的整合 相关下载链接:[url=//download.csdn.net/download/asartear/2126051?utm_source=bbsseo]//download.csdn.net/download/asartear/2126051?utm_source=bbsseo[/url]
iphone记忆游戏下载
一款记忆小游戏 完整源码 ABC123是一个iPhone,iPod的触摸和iPad有趣的游戏。 “的概念很简单。精辟上瘾。令人恼火的挑战。” - TheYoshi 记住字母或数字序列。 该序列将被覆盖着泡沫。 在弹出的序列击败级订单的气泡。 相关下载链接:[url=//download.csdn.net/download/ysb0234yang/3048238?utm_source=bbsseo]//download.csdn.net/download/ysb0234yang/3048238?utm_source=bbsseo[/url]
离散曲线去噪声的内在算法下载
一种离散曲线去噪声的内在算法,比较实用,比较先进。 相关下载链接:[url=//download.csdn.net/download/encozhong/3392593?utm_source=bbsseo]//download.csdn.net/download/encozhong/3392593?utm_source=bbsseo[/url]
文章热词 机器学习教程 Objective-C培训 交互设计视频教程 颜色模型 设计制作学习
相关热词 mysql关联查询两次本表 native底部 react extjs glyph 图标 怎么学习互联网大数据 村干部学习大数据心得
我们是很有底线的