make updata-api失败的原因 [问题点数:40分,结帖人movie0125]

Bbs1
本版专家分:20
结帖率 94.44%
Bbs1
本版专家分:20
Bbs1
本版专家分:62
Bbs1
本版专家分:20
Bbs1
本版专家分:20
Bbs1
本版专家分:20
Bbs9
本版专家分:58310
Blank
红花 2012年6月 移动平台大版内专家分月排行榜第一
2012年5月 移动平台大版内专家分月排行榜第一
2012年4月 移动平台大版内专家分月排行榜第一
2012年3月 移动平台大版内专家分月排行榜第一
2012年2月 移动平台大版内专家分月排行榜第一
2012年1月 移动平台大版内专家分月排行榜第一
2011年12月 移动平台大版内专家分月排行榜第一
2011年11月 移动平台大版内专家分月排行榜第一
2011年10月 移动平台大版内专家分月排行榜第一
2011年9月 移动平台大版内专家分月排行榜第一
2011年6月 移动平台大版内专家分月排行榜第一
2011年5月 移动平台大版内专家分月排行榜第一
2011年4月 移动平台大版内专家分月排行榜第一
Blank
黄花 2011年8月 移动平台大版内专家分月排行榜第二
2011年7月 移动平台大版内专家分月排行榜第二
2011年3月 移动平台大版内专家分月排行榜第二
Blank
蓝花 2012年8月 移动平台大版内专家分月排行榜第三
2012年7月 移动平台大版内专家分月排行榜第三
Bbs4
本版专家分:1809
网站运营失败的七大原因
网站运营<em>失败</em>的七大<em>原因</em>
在Qsys上运行程序时出现make elf文件失败原因
编译c语言程序时如果出现<em>make</em> elf 文件<em>失败</em>,主要是memeory的空间太小要对代码进行reduce设置有一下, 对你的BSP工程进行设置选中enable_reduced_device_drivers项,该错误提示就会消失。
linux下Make编译出错,输入/输出错误原因及解决办法
输入/输出错误 collect2: error: ld returned 1 exit status <em>原因</em>:           编译时工程放在 /mnt/hgfs 共享目录下了 解决办法:          把工程放在本地的其他目录下,即可编译成功
23G重选导致没有接通
23G切换的<em>失败</em>的详细<em>原因</em>分析,<em>原因</em>比较完整.
安装redis中执行make时出错及解决方案
执行 <em>make</em> 时若报这个错 出现如下错误 :  cd src &amp;amp;&amp;amp; <em>make</em> all <em>make</em>[1]: Entering directory '/xx/xx/redis-x.x.x/src'          CC adlist.o /bin/sh: cc: command not found <em>make</em>[1]:  *** [adlist.o] Error 127 ...
执行make menuconfig出错问题
daron@daron-virtual-machine:~/linux/tiny6410/linux-2.6.38$ <em>make</em> menuconfig  HOSTCC  scripts/basic/fixdep  HOSTCC  scripts/basic/docproc  HOSTCC  scripts/kconfig/conf.o  HOSTCC  scripts/kconfig/kxgette...
oracle 重装 分析失败原因
oracle 重装 分析<em>失败</em><em>原因</em> 绝对有用
getsubmenu.txt
getsubmenu 出现断言<em>失败</em><em>原因</em>,以及解决方法
编写Linux驱动常见错误
转自http://neilengineer.cublog.cn/ 工作中遇到的编写Linux驱动的常见错误和注意事项整理。  1、init函数返回值问题,exit函数不需要返回值  2、头文件不存在的问题  3、缺少某些符号如 “}” “;”  4、模块调用内核中函数时的编译  5、No such device or address     问题1、驱动的init函数声明错误
asp.net错误分析
用户sa登陆<em>失败</em>,<em>原因</em>“未与信任的SQL server连接相用户sa登陆<em>失败</em>,<em>原因</em>“未与信任的SQL server连接相用户sa登陆<em>失败</em>,<em>原因</em>“未与信任的SQL server连接相
strace 解决程序启动失败
[oracle@june2 ~]$ ps -ef | grep oracle | grep dcopserver oracle 4773 4656 0 16:44 pts/1 00:00:00 grep dcopserver 启动 KDE 时出现问题 [oracle@june2 ~]$ dcopserver SocketCreateListener: failed to bin
include问题及错误解决
http://blog.csdn.net/pipisorry/article/details/38512433 sudo <em>make</em>时#include "hdfs.h"出现include错误 fatal error: hdfs.h: No such file or directory  #include "hdfs.h" 也就是hdfs.h文件inclucd不进来 <em>原因</em>: 文件读
make otapackage 过程中 / 分区过小导致的失败
做差分包生成时候,源码默认会占用 / 分区,因此如果 / 分区太小,因为当素材包很大的时候,可能会占用20G的空间。解决:改变 / 分区的目录,选择足够分区大小的目录diff --git a/tools/releasetools/common.py b/tools/releasetools/common.pyindex 26b0007..be2b6c9 100755--- a/tools/rele...
RK3288-OTA编译失败解决办法
环境:RK3288 Android版本:LL 问题描述:编译OTA<em>失败</em>,错误信息就是网上那堆东西。 网上资料现状:一大抄,一堆转载 主要包括:java环境配置不对,common.py的什么缩进不对等等。。。 结果:无法解决的问题。。。。 解决方案:build/tools/releasetools/common.py修改一下。 贴上patch。。。若有一样的代码
mac redis执行sudo make 失败的问题
1,mac安装redis的文章很多,写的也很详细,不再重复了,就想说一下执行sudo <em>make</em>时的报错问题。 2,在终端执行sudo <em>make</em>,报错信息: 3,执行xcode-select --install 即可,弹出页面中,点击“安装” 4,有些博文中介绍说执行git init时也遇到了这个错误,解决方法一样。 5,可能是之前卸载xcode造成的。...
基站系统呼叫失败原因和掉话解释
本手册描述了ZXC10 BSS系统EVDO业务中的呼叫<em>失败</em>、切换<em>失败</em>、释放<em>失败</em>及掉话<em>原因</em>。 第1章BSSAP部分本章介绍了与BSSAP相关的呼叫<em>失败</em><em>原因</em>及其处理措施 第2章PBSSAP部分本章介绍了与PBSSAP相关的呼叫<em>失败</em><em>原因</em>及其处理措施 第3章PDC部分本章介绍了与PDC相关的呼叫<em>失败</em><em>原因</em>及其处理措施 第4章DSPM部分本章介绍了与DSPM相关的呼叫<em>失败</em><em>原因</em>及其处理措施 第5章RCM部分本章介绍了与RCM相关的呼叫<em>失败</em><em>原因</em>及其处理措施 第6章SDM部分本章介绍了与SDM相关的呼叫<em>失败</em><em>原因</em>及其处理措施 第7章DBS部分本章介绍了与DBS相关的呼叫<em>失败</em><em>原因</em>及其处理措施 第8章CES部分本章介绍了与CES相关的呼叫<em>失败</em><em>原因</em>及其处理措施
vc6.0win7下兼容问题
只是包含了 解决打开会崩溃的问题 以及filetool调用<em>失败</em> 和注册filetool<em>失败</em>的<em>原因</em>
php上传图片封装类
php上传图片封装类,实现上传图片的功能,上传<em>失败</em>会返回各种<em>失败</em><em>原因</em>
centos6.8下安装redis,make test失败,解决方法
错误信息 解决办法,安装tcl: sudo wget http://downloads.sourceforge.net/tcl/tcl8.6.1-src.tar.gz  sudo tar -zxvf -C /usr/local cd /usr/local/tcl8.6.1/unix sudo ./configure sudo <em>make</em> sudo <em>make</em> install 安装完...
linux下redis安装遇到的问题及解决办法
linux下安装redis: $ wget http://download.redis.io/releases/redis-3.2.0.tar.gz $ tar xzf redis-3.2.0.tar.gz $ cd redis-3.2.0 $ <em>make</em> 1. 如果输入<em>make</em>提示 : <em>make</em>: cc:命令未找到 <em>原因</em>:未安装gcc解决方法:安装gcc[ckl@localhos
彻底解决Ubuntu 执行make xconfig出错
我想大多数人都遇到过编译内核时执行<em>make</em> xconfig会报如下类似错误 CHECK qt * Unable to find the QT4 tool q<em>make</em>. Trying to use QT3 * * Unable to find any QT installation. Please <em>make</em> sure that * the QT4 or QT3 development pa...
Ubuntu 16.04编译Android,make 版本过高导致编译失败的问题
如题,近期在Ubuntu 16.04上编译Android 6.0源码的时候出现报错,记录如下:我的开发环境: Ubuntu 16.04 <em>make</em> 4.0 Android M 源码 大致报错如下:/home/fei/dev/android/source/prada/kernel/drivers/input/touchscreen/focaltech/Makefile:9: *** missing seperator。
make modules失败
重新编译red hat 9.0的内核时,在<em>make</em> modules这一步的时候<em>失败</em>了。错误信息有很长,第一个是提示是在socket.h的249行。rn我完全不改kernel的代码,就用原来的代码编译也出错。是不是我在<em>make</em> menuconfig这一步的时候就不对阿?rn第一次编译内核,请指教。
redis安装make失败
解压后 执行<em>make</em>后报错: cd src && <em>make</em> all <em>make</em>[1]: Entering directory `/home/liuchaofan/redis-3.0.7/src'     CC adlist.o /bin/sh: cc: command not found <em>make</em>[1]: *** [adlist.o] Error 127 <em>make</em>[1]: Leav
linux下 make check 失败
按照http://blog.csdn.net/ucipher/archive/2007/05/19/1615818.aspx这个方法在redhat 上安装伯克利数据库,rn其中<em>make</em> check 这一步出错。rn提示:rncreating temporary installation rnpg_regress: installation failedrnExamine ./log/install.log for the reason.rnrn<em>make</em>[2]: [check] Error 2rn<em>make</em>[1]: [check] Error 2rn<em>make</em>: [check] Error 2rn我搜了一下 国外论坛说是路径中不能有空格(spaces)但是我路径中没有这个啊,源文件存放地址是/mnt/hgfs/Untitled-1/postgresql-8.2.4rn大侠们帮帮忙吧,菜鸟一个这个问题已经饶了一天了。rn
vsftp make失败
[code=C/C++]rngcc -c main.c -O2 -Wall -W -Wshadow -idirafter dummyincrngcc -c utility.c -O2 -Wall -W -Wshadow -idirafter dummyincrngcc -c prelogin.c -O2 -Wall -W -Wshadow -idirafter dummyincrngcc -c ftpcmdio.c -O2 -Wall -W -Wshadow -idirafter dummyincrngcc -c postlogin.c -O2 -Wall -W -Wshadow -idirafter dummyincrnpostlogin.c: In function ‘process_post_login’:rnpostlogin.c:459: warning: passing argument 3 of ‘vsf_cmdio_write’ from incompatible pointer typernpostlogin.c: In function ‘load_forward_info’:rnpostlogin.c:1036: warning: comparison between signed and unsignedrnpostlogin.c:1049: warning: declaration of ‘index’ shadows a global declarationrn/usr/include/string.h:304: warning: shadowed declaration is herernpostlogin.c:1055: warning: comparison between signed and unsignedrnpostlogin.c: In function ‘ftp’:rnpostlogin.c:1177: warning: comparison between signed and unsignedrnpostlogin.c:1243: warning: pointer targets in passing argument 3 of ‘getsockname’ differ in signednessrnpostlogin.c:1250: warning: pointer targets in passing argument 3 of ‘getsockname’ differ in signednessrnpostlogin.c:1260: warning: pointer targets in passing argument 3 of ‘accept’ differ in signednessrngcc -c privsock.c -O2 -Wall -W -Wshadow -idirafter dummyincrngcc -c tunables.c -O2 -Wall -W -Wshadow -idirafter dummyincrngcc -c ftpdataio.c -O2 -Wall -W -Wshadow -idirafter dummyincrngcc -c secbuf.c -O2 -Wall -W -Wshadow -idirafter dummyincrngcc -c ls.c -O2 -Wall -W -Wshadow -idirafter dummyincrngcc -c postprivparent.c -O2 -Wall -W -Wshadow -idirafter dummyincrngcc -c logging.c -O2 -Wall -W -Wshadow -idirafter dummyincrngcc -c str.c -O2 -Wall -W -Wshadow -idirafter dummyincrngcc -c netstr.c -O2 -Wall -W -Wshadow -idirafter dummyincrngcc -c sysstr.c -O2 -Wall -W -Wshadow -idirafter dummyincrngcc -c strlist.c -O2 -Wall -W -Wshadow -idirafter dummyincrngcc -c banner.c -O2 -Wall -W -Wshadow -idirafter dummyincrngcc -c filestr.c -O2 -Wall -W -Wshadow -idirafter dummyincrngcc -c parseconf.c -O2 -Wall -W -Wshadow -idirafter dummyincrngcc -c secutil.c -O2 -Wall -W -Wshadow -idirafter dummyincrngcc -c ascii.c -O2 -Wall -W -Wshadow -idirafter dummyincrngcc -c oneprocess.c -O2 -Wall -W -Wshadow -idirafter dummyincrngcc -c twoprocess.c -O2 -Wall -W -Wshadow -idirafter dummyincrngcc -c privops.c -O2 -Wall -W -Wshadow -idirafter dummyincrngcc -c standalone.c -O2 -Wall -W -Wshadow -idirafter dummyincrngcc -c hash.c -O2 -Wall -W -Wshadow -idirafter dummyincrngcc -c tcpwrap.c -O2 -Wall -W -Wshadow -idirafter dummyincrngcc -c ipaddrparse.c -O2 -Wall -W -Wshadow -idirafter dummyincrngcc -c access.c -O2 -Wall -W -Wshadow -idirafter dummyincrngcc -c features.c -O2 -Wall -W -Wshadow -idirafter dummyincrngcc -c readwrite.c -O2 -Wall -W -Wshadow -idirafter dummyincrngcc -c opts.c -O2 -Wall -W -Wshadow -idirafter dummyincrngcc -c ssl.c -O2 -Wall -W -Wshadow -idirafter dummyincrngcc -c sslslave.c -O2 -Wall -W -Wshadow -idirafter dummyincrngcc -c ptracesandbox.c -O2 -Wall -W -Wshadow -idirafter dummyincrngcc -c ftppolicy.c -O2 -Wall -W -Wshadow -idirafter dummyincrngcc -c sysutil.c -O2 -Wall -W -Wshadow -idirafter dummyincrngcc -c sysdeputil.c -O2 -Wall -W -Wshadow -idirafter dummyincrngcc -o cwftpd main.o utility.o prelogin.o ftpcmdio.o postlogin.o privsock.o tunables.o ftpdataio.o secbuf.o ls.o postprivparent.o logging.o str.o netstr.o sysstr.o strlist.o banner.o filestr.o parseconf.o secutil.o ascii.o oneprocess.o twoprocess.o privops.o standalone.o hash.o tcpwrap.o ipaddrparse.o access.o features.o readwrite.o opts.o ssl.o sslslave.o ptracesandbox.o ftppolicy.o sysutil.o sysdeputil.o -Wl,-s `./cwf_findlibs.sh` rn/bin/sh: ./cwf_findlibs.sh: Permission deniedrnsysdeputil.o: In function `vsf_sysdep_adopt_capabilities':rnsysdeputil.c:(.text+0xa83): undefined reference to `cap_init'rnsysdeputil.c:(.text+0xa9e): undefined reference to `cap_set_proc'rnsysdeputil.c:(.text+0xab6): undefined reference to `cap_free'rnsysdeputil.c:(.text+0xaf1): undefined reference to `cap_set_flag'rnsysdeputil.c:(.text+0xb15): undefined reference to `cap_set_flag'rnsysdeputil.c:(.text+0xb4a): undefined reference to `cap_set_flag'rnsysdeputil.c:(.text+0xb6e): undefined reference to `cap_set_flag'rnsysdeputil.o: In function `vsf_sysdep_has_capabilities':rnsysdeputil.c:(.text+0xb91): undefined reference to `cap_get_proc'rnsysdeputil.c:(.text+0xb9b): undefined reference to `cap_free'rnsysdeputil.o: In function `vsf_sysdep_check_auth':rnsysdeputil.c:(.text+0xc28): undefined reference to `pam_start'rnsysdeputil.c:(.text+0xc60): undefined reference to `pam_set_item'rnsysdeputil.c:(.text+0xc81): undefined reference to `pam_set_item'rnsysdeputil.c:(.text+0xc96): undefined reference to `pam_end'rnsysdeputil.c:(.text+0xcad): undefined reference to `pam_end'rnsysdeputil.c:(.text+0xcd3): undefined reference to `pam_set_item'rnsysdeputil.c:(.text+0xcec): undefined reference to `pam_authenticate'rnsysdeputil.c:(.text+0xd05): undefined reference to `pam_acct_mgmt'rnsysdeputil.c:(.text+0xd1e): undefined reference to `pam_setcred'rnsysdeputil.c:(.text+0xd40): undefined reference to `pam_end'rnsysdeputil.c:(.text+0xd65): undefined reference to `pam_end'rnsysdeputil.c:(.text+0xd97): undefined reference to `pam_open_session'rnsysdeputil.c:(.text+0xdb7): undefined reference to `pam_setcred'rnsysdeputil.o: In function `vsf_auth_shutdown':rnsysdeputil.c:(.text+0xe00): undefined reference to `pam_close_session'rnsysdeputil.c:(.text+0xe15): undefined reference to `pam_setcred'rnsysdeputil.c:(.text+0xe2a): undefined reference to `pam_end'rncollect2: ld returned 1 exit statusrn<em>make</em>: *** [cwftpd] Error 1rn[/code]rnrnvsf_findlib.sh 是这样的:rn[code=C/C++]rnrn#!/bin/shrn# Cheesy hacky location of additional link libraries.rnrnlocate_library() [ ! "$1*" = "`echo $1*`" ]; rnfind_func() egrep $1 $2 >/dev/null; rnrnif find_func hosts_access tcpwrap.o; thenrn echo "-lwrap";rn locate_library /lib/libnsl.so && echo "-lnsl";rnfirnrn# Look for PAM (done weirdly due to distribution bugs (e.g. Debian) or thern# crypt library.rnif find_func pam_start sysdeputil.o; thenrn locate_library /lib/libpam.so.0 && echo "/lib/libpam.so.0";rn locate_library /usr/lib/libpam.so && echo "-lpam";rn # HP-UX ends shared libraries with .slrn locate_library /usr/lib/libpam.sl && echo "-lpam";rn # AIX ends shared libraries with .arn locate_library /usr/lib/libpam.a && echo "-lpam";rnelsern locate_library /lib/libcrypt.so && echo "-lcrypt";rn locate_library /usr/lib/libcrypt.so && echo "-lcrypt";rnfirnrn# Look for the dynamic linker library. Needed by older RedHat whenrn# you link in PAMrnlocate_library /lib/libdl.so && echo "-ldl";rnrn# Look for libsocket. Solaris needs this.rnlocate_library /lib/libsocket.so && echo "-lsocket";rnrn# Look for libnsl. Solaris needs this.rnlocate_library /lib/libnsl.so && echo "-lnsl";rnrn# Look for libresolv. Solaris needs this.rnlocate_library /lib/libresolv.so && echo "-lresolv";rnrn# Look for libutil. Older FreeBSD need this for setproctitle().rnlocate_library /usr/lib/libutil.so && echo "-lutil";rnrn# For older HP-UX...rnlocate_library /usr/lib/libsec.sl && echo "-lsec";rnrn# Look for libcap (capabilities)rnif locate_library /lib/libcap.so.1; thenrn echo "/lib/libcap.so.1";rnelsern locate_library /usr/lib/libcap.so && echo "-lcap";rn locate_library /lib/libcap.so && echo "-lcap";rnfirnrn# Solaris needs this for nanosleep()..rnlocate_library /lib/libposix4.so && echo "-lposix4";rnlocate_library /usr/lib/libposix4.so && echo "-lposix4";rnrn# Tru64 (nanosleep)rnlocate_library /usr/shlib/librt.so && echo "-lrt";rnrn# Solaris sendfilernlocate_library /usr/lib/libsendfile.so && echo "-lsendfile";rnrn# OpenSSLrnif find_func SSL_library_init ssl.o; thenrn echo "-lssl -lcrypto";rnfirnrnexit 0;rnrnrn[/code]rn请问大家是怎么回事?
CDMA网络中接入失败原因分析.
CDMA网络中接入<em>失败</em><em>原因</em>分析,详细探讨了CDMA网络的优化步骤、接入过程、导致接入<em>失败</em>的<em>原因</em>及解决方法
make 编译出问题时解决方案
<em>make</em>: Warning: File `Makefile’ has modification time 1.8e+06 s in the future通过这个错误提示信息我们可以知道,Makefile的修改时间点是Linux当前的一个未来时间点。可以通过修改Linux的当前时间来解决这个问题:$sudo date -s ‘hh:mm:ss yyyy-mm-dd’ 比如我想讲我的Linux系统的时间
当linux报 “-bash: fork: 无法分配内存”
今天早上有台测试机,当我ps查看的时候发现不能执行命令并返回“-bash: fork: 无法分配内存”,特么非要哥重起服务器吗,忽然发现我连了好多终端,然后断开了一个终端,然后这边终端可以敲命令了 [root@172.16.31.105 /home/www/test]# free -m              total       used       free     shared  
make -k(keep going)命令会在发现错误时继续执行(用于一次发现所有错误)
我们在执行<em>make</em>file进行编译的时, 会经常遇到错误, 然后解决, 然后又<em>make</em>,  然后又发现错误, 然后又解决, 烦人, 能不能一次发现所有错误呢?          能的!         main.cpp很简单, 我们只看<em>make</em>file(故意写成错误的g+++): main: main.o g+++ -o main main.o main.o: main.cpp
Linux---net-snmp安装遇到的错误
 Can't locate ExtUtils/MakeMaker.pm in @INC 错误解决 今天安装net-snmp时发错如题错误 Can't locate ExtUtils/MakeMaker.pm in @INC (@INC contains: /usr/local/lib/perl5 /usr/local/share/perl5 /usr/lib/perl5/ve
make编译错误
如果zhi'xin<em>make</em>出现: <em>make</em>: *** No rule to <em>make</em> target ` ‘, needed by xxx. Stop. 的错误,那么基本上都是属于找不到所依赖的文件所导致的,所以应该去: 检测确保,所依赖的文件,是否真实存在。 很可能,很常见的一个现象就是,此处的,误写了多余的空格,导致被视为依赖文件,导致找不到,导致报此错误。 解决办
make && make install 这是什么意思啊
用&&连接的两条命令,只有当第一条命令(在你这里是<em>make</em>)的退出状态为0(即无错误)时,才会继续执行&&后面的命令。
奇怪!make可以,make install 失败
我用ubuntu12.04安装ACE,基本都按照官方的安装进行,<em>make</em>都完全没问题,<em>make</em> install报错:rn[color=#FF0000]GNU<em>make</em>file:21: /include/<em>make</em>include/macros.GNU: 没有那个文件或目录rn<em>make</em>: *** 没有规则可以创建目标“/include/<em>make</em>include/macros.GNU”。 停止。[/color]rn我打开GNU<em>make</em>file,看了21行,是这样的:rn[code=c]include $(ACE_ROOT)/include/<em>make</em>include/macros.GNU[/code]rn看样子好像是环境变量$(ACE_ROOT)没有设对,可是我在etc/profile中设置了环境变量啊,已经重启过,并且通过echo $ACE_ROOT能够看得到路径,我在命令行输入rncat $ACE_ROOT/include/<em>make</em>include/macros.GNUrn也能看到内容,咋GNU<em>make</em>file就不认识呢?rn只有一个地方不一样,就是环境变量我用$ACE_ROOT[没加括号]而不是$(ACE_ROOT),难道环境变量还有这说发吗,我记得以前安装都是正常的呀,rn用echo $ACE_ROOT能看到,echo $(ACE_ROOT)就看不到,求解!rn那为啥<em>make</em>可以,而<em>make</em> install 就不行了呢,不就是多一个复制操作吗,并且我的目录都把权限开到最高了!rn
Ubuntu中内核源码编译参考文件说明make pdfdocs出错的解决方法
在Linux内核的readme文件中,有这么一段话,我想看文档的pdf版 In order to build the documentation, use ``<em>make</em> htmldocs`` or ``<em>make</em> pdfdocs``. 然后<em>make</em> pdfdocs后出现各种错误,源于没有安装python的sphinx包: sudo apt-get install python-sphinx ...
linux-3.5内核编译失败的问题
linux-3.5内核编译<em>失败</em>的问题
推土机:汇集modules时,使用make_install时出现错误
问题描述:按照http://dev.t-firefly.com/thread-10907-1-1.html编译代码时,到最后一步集合modules时,使用 报错,如图所示: 问题解决: 要先使用<em>make</em> modules编译模块才能汇集它们。如图所示: 之后再使用<em>make</em> INSTALL...命令便可以成功了。 问题分析:在错误信息中,我们可以看到,无法获取.../
make无法执行——源码编译、安装
在进行软件源码编译、安装时 ,出现<em>make</em>无法执行的情况下,是缺少基础开发包 执行命令即可:        apt-get  install    build-essential
uboot编译学习----直接打完整个补丁后执行make,提示编译失败
参考博客:http://www.cnblogs.com/heaad/archive/2010/07/17/1779806.html‘  若没有执行过“<em>make</em> _config”命令就直接执行“<em>make</em> all”命令则会出现如下的才错误信息,然后停止编译: [cpp] view plaincopy System not configured - see RE
make redis出现错误可能原因
<em>make</em>: * No rule to <em>make</em> target 错误<em>原因</em>、分析和解决办法 上面博客其中红字部分: 最后发现,上述问题的产生的根本<em>原因</em>是工程更改路径或者更改了其中的文件夹名称之后,之前生成的.o.d文件在再次编译时并不会重新编译,因而导致该问题。根源解决办法是 删除编译后生成的obj文件夹。然后重新编译就行了。 所谓的删除obj文件夹只需要用<em>make</em> clean清理一
项目管理4大失败原因
在软件项目管理中,总结出的项目管理4大<em>失败</em><em>原因</em>
Git-2.17.1.2 32位和64位合集
由于众所周知的<em>原因</em>,总是容易下载<em>失败</em>。保存一份备用。
win7旗舰版系统360浏览器安装扩展插件失败原因和三种解决方法
win7旗舰版系统360浏览器安装扩展插件<em>失败</em><em>原因</em>和三种解决方法
公司门户网站访问失败原因
CSNA网络分析专家案例分析报告,门户网站访问<em>失败</em><em>原因</em>
解决u880刷机失败
很多人刷机<em>失败</em>,总是找不到<em>原因</em>。这里有你想要的
深入剖析“铱星计划”的失败案例
这是用专业眼观,剖析“铱星计划”的<em>失败</em><em>原因</em>
dev_log_for test
测试数据 查看设备中log为何打开设备信息<em>失败</em>的<em>原因</em>
3188固件失败原因
3188固件<em>失败</em>的<em>原因</em>,维修技巧有助于调试、开发。
中间层创建事务失败解决
中间层创建事务<em>失败</em>解决,<em>原因</em>:MSDTC服务不能启动
nginx源代码安装make报错
今天在安装nginx时出现如下错误: [root@node1 nginx-0.8.55]# ./configure \  >  --prefix=/usr \  >  --sbin-path=/usr/sbin/nginx \  >  --conf-path=/etc/nginx/nginx.conf \  >  --error-log-path=/var/log/nginx/err
linux编译内核make menuconfig报错解决办法
linux编译内核时 输入<em>make</em> menuconfig命令 *** Unable to find the ncurses libraries or the *** required header files. *** '<em>make</em> menuconfig' requires the ncurses libraries. *** *** Install ncurse
制作ota升级包出错
制作ota包时,执行命令<em>make</em> otapackage或者<em>make</em> dist出现如下错误信息 Creating filesystem with parameters:     Size: 805306368     Block size: 4096     Blocks per group: 32768     Inodes per group: 8192     Inode size
make编译项目的时候出错,跳过错误的办法!
在编译项目的时候遇到这个问题:/bin/sh: ./flex: cannot execute binary file 使用file命令查看这个文件: flex/flex: ELF 32-bit LSB executable, ARM, version 1 (SYSV), dynamically linked (uses shared libs), not stripped 发现之所以执行不了是因为...
Ubuntu16.04安装redis,make test失败解决方法
解压 redis.tar之后,进入redis目录下 <em>make</em> 然后进行<em>make</em> test,提示如下: 安装 tcl,sudo apt-get install tcl -y 接下来<em>make</em> test,提示如下: 经过稍微的等待,测试过程中又出现error:*** [err]: Memory efficiency with values in range 16384 in tests/u...
LoadLibrary失败原因
今天使用LoadLibrary时,<em>失败</em>,于是翻了一下MSDN: LoadLibrary The LoadLibrary function maps the specified executable module into the address space of the calling process.  For additional load options, use the Lo
内核编译make menuconfig出错
<em>make</em> menuconfig 出错的解决  2007-12-06 09:52:50 系统ubuntu7.04 gcc 4.1.2,安装后交叉编译linux2.6.18内核运行<em>make</em> menuconfig 时出错如下: /******************   error ***********************/  root@lwx-desktop:~/linux_arm/
编译qt源代码报错原因以及解决方法
编译qt源代码报错<em>原因</em>: 1.源代码路径含有中文字体 2.编译时,源代码找不到路径(No such file or directory) 解决方法: 1.改为英文路径 2.编译源代码时,在项目文件.pro底部加上QT += widgets即可。 百度解答问题2: 在pro里 写 qt+=widgets 表示引入 QtWidget这个module,q<em>make</em>会在帮你生成<em>make</em>
kaldi安装错误最终版
相信关注我博客的人知道,之前我已经把kaldi出现的错误写了博文。这次主要因为我之前的电脑内存不够,换了个稍微大点的内存,在这里提醒下学习kaldi的各位朋友,注意kaldi所需要的电脑配置,以下是我的一些看法:         1.自己的电脑系统最好是64位,包括win7和unbuntu都是64位,只有这样,你的内存才能合理利用,不会出现蹦的情况;          2.最后有GPU,最好还
Nginx安装make命令时一点小问题
[root@xx nginx-1.8.0]# <em>make</em> <em>make</em>: *** No rule to <em>make</em> target build', needed bydefault’. Stop. [root@xx nginx-1.8.0]# 解决办法是需要安装openssl以及ncurses组件 yum install -y openssl* yum -y install ncurses-devel 之...
树莓派安装cmake失败问题
当运行树莓派安装使用sudo apt-get install c<em>make</em>命令时出现一下报错Package c<em>make</em> is not available, but is referred to by another package.This may mean that the package is missing, has been obsoleted, oris only available fr...
ffmpeg 编译常见错误
转自 http://blog.chinaunix.net/uid-26000296-id-4217121.html 一、FFmpeg源代码下载与编译 # wget http://www.ffmpeg.org/releases/ffmpeg-0.5.13.tar.bz2 # tar -jxvf ffmpeg-0.5.13.tar.bz2 # vim ffmpeg_
失败原因
1) 没有明确的生活目标。没有奋斗的中心目标或明确的努力主向,就没有成功的希望。2) 没有非同寻常的雄心抱负。如果对凡事漠不关心,不想在人生中求发展,不愿付出代价,那么这样的人也将成功无望。 3) 缺乏自律。纪律来自自我控制,这意味着人必须控制所有的消极思想,只能先控制自己,才能控制环境。自制是人类面对的最艰巨任务,如果无法战胜自我,就会被自我征服。4) 拖拉。这是<em>失败</em>最普遍的<em>原因</em>之一,拖拉“老人
uboot编译学习----直接执行make all,提示编译失败
参考博客:http://www.cnblogs.com/heaad/archive/2010/07/17/1779806.html‘  若没有执行过“<em>make</em> _config”命令就直接执行“<em>make</em> all”命令则会出现如下的才错误信息,然后停止编译: [cpp] view plaincopyprint? System not configured 
ubuntu不能正常使用make menuconfig的解决方案
新安装的ubuntu 出现不能使用<em>make</em> menuconfig时 1、sudo apt-get update 更新软件2、安装下面的软件 sudo apt-get install build-essential sudo apt-get install libncurses5 sudo apt-get install libncurses5-dev happy
redis编译报致命错误:jemalloc/jemalloc.h
redis编译报致命错误:jemalloc/jemalloc.h:没有那个文件或目录分配器allocator,如果有MALLOC  这个 环境变量, 会有用这个环境变量的 去建立Redis。而且libc 并不是默认的分配器, 默认的是 jemalloc, 因为 jemalloc 被证明 有更少的 fragmentation problems 比libc。但是如果你又没有jemalloc而只有 li...
Linux make 保存错误日志
如何获得Linux下<em>make</em>的log? 如何保存控制台对话? 如何将编译过程的信息保存成日志? 编译的过程可能会出错,导致编译过程无法继续进行。详细分析出错信息,有助于解决源码中的语法错误。 那么如何保存配置编译过程的信息?这些信息量很大,都可能超出Shell向上翻滚查看的范围。最好是把编译过程的信息保存成日志文件,方便后面的分析。 举例说明保存编译信息的行命令,它把<em>make</em>过程打印
Golang中make与new的区别
golang 中有两个内存分配机制 :new和<em>make</em>,二者有明显区别.new:new(T)分配了零值填充的T类型的内存空间,并且返回其地址,即一个*T类型的值。其自身是一个指针.可用于初始化任何类型。<em>make</em>: 返回一个有初始值(非零)的T类型,而不是*T,其只能用来初始化:slice,map和channel三种类型。package main import ( "fmt" )
【linux】linux 报错:安装 nginx 时,make 报错解决方法
目录 一、报错情况 二、解决方法 三、openssl旧版本下载和安装 一、报错情况 (1)输入命令,报错: <em>make</em> (2)具体报错: <em>make</em>[1]: *** [objs/src/event/ngx_event_openssl.o] 错误 1 <em>make</em>[1]: 离开目录“/usr/local/nginx-1.1.10” <em>make</em>: *** [build] 错误 2 ...
Android系统编译常见问题
<em>make</em>: * [out/host/linux-x86/obj/EXECUTABLES/aidl_intermediates/aidl_language_y.cpp] Error 127解决: sudo apt-get install bison <em>make</em>: * [out/host/linux-x86/obj/EXECUTABLES/aidl_intermediates/aidl_language_
make uImage不能生成uImage解决方法
ubuntu13.10下编译S3C2440内核2.6.22.6用<em>make</em> uImage直接生成uImage,但是总提示缺少mkimage,生成里zImage并不能生成uImage. 解决方法:把u-boot/tools/mkimage拷到/usr/bin/后重新编译内核即可。
make menuconfig出错的解决方案
ubuntu16.04 64位编译配置内核时,执行命令:<em>make</em> menuconfig出现如下错误: <em>make</em>[1]: *** [scripts/kconfig/lxdialog/checklist.o] Error 1 Makefile:417: recipe for target 'menuconfig' failed <em>make</em>: *** [menuconfig] Error 2 解决方...
make时候错误提示
1、<em>make</em>时候的问题 *** No rule to <em>make</em> target ‘/mnt/hgfs/winshare/s5pv210/project/testproject/include/fb.h’, needed by ‘fb.o’. Stop. 出现上述编译<em>失败</em>的<em>原因</em>: 1、Makefile文件有问题 2、Makefile文件中有未知的字符 3、在源代码中有原来未被删除的.d、.o文件等。...
ruby安装编译错误
ruby安装过程<em>make</em>出现错误: compiling vm.c vm.c: In function ‘rb_vm_bh_to_procval’: vm_insnhelper.c:360: warning: control reaches end of non-void function vm_exec.c: In function ‘vm_exec_core’:vm_exec.c:123: er...
Linux下安装memcached遇到的一系列问题
root@VM_24_101_centos libevent-2.1.8-stable]# <em>make</em>    GEN      test/rpcgen-attempted which: no python2 in (/usr/local/sbin:/usr/local/bin:/sbin:/bin:/usr/sbin:/usr/bin:/root/bin:/root/bin)   File "
ubuntu下make无法安装的问题
ubuntu下<em>make</em>无法安装的问题   在帮同学服务器安装环境过程中,发现,<em>make</em> 命令不能使用,提示:   命令行代码   The program '<em>make</em>' is currently not installed.  You can install it by typing:   apt-get install <em>make</em>    www.2cto.com
Perl用CPAN安装模块时错误
提示不是root权限: 需要执行:o conf <em>make</em>_install_<em>make</em>_command 'sudo <em>make</em>' 来自动切换到root,但是还是会需要输入密码!!! 输出部分信息如下: <em>make</em>: *** [pure_site_install] Error 13   TIMB/DBI-1.634.tar.gz   /usr/bin/<em>make</em> install  -- NOT O
【编译错误解决方案】提示:“make mrproper”
【编译错误提示】当你不小心在kernel目录运行<em>make</em>编译命令,会出现一个棘手的问题:【解决思路过程】按提示先运行命令“<em>make</em> mrproper”,或者删除out目录,再编译,这也是无济于事的。 我们可以根据错误的输出在当前目录(.)递归(-r)搜索文本“<em>make</em> mrproper”,并显示行号(-n)。在./Makefile文件有一句和错误输出信息一致。 命令:grep –rn “<em>make</em>
keepalived源码安装与常见报错
首先安装依赖包yum install gcc openssl-devel libnl3-devel net-snmp-devel libnfnetlink-devel -y下载keepalived软件wget http://www.keepalived.org/software/keepalived-2.0.5.tar.gz解压缩tar zxvf keepalived-2.0.5.tar.gz -...
linux下redis安装遇到的问题记录
1.redis在<em>make</em>时报错 下载解压redis-3.0.2后,执行<em>make</em>进行编译,结果出现下面的错误: <em>make</em>: cc: Command not found <em>make</em>: *** [adlist.o] Error 127 2. 这是由于新安装的Linux系统没有安装gcc环境,需要安装gcc,为了方便,这里我选择用yum进行安装。 # yum 
mac下make不能用的问题
mac下<em>make</em>不能用的问题,<em>make</em>会提示 在终端中修改你的CommandLine Tools的位置 sudo xcode-select -switch /Applications/Xcode.app/Contents/Developer
cmake错误后的处理办法
如果c<em>make</em>错误后,应该将build文件(里面有生成的<em>make</em>file文件,和可执行文件)中的所有内容删除, 修改CMakelist.txt后,再进行c<em>make</em>
caffe---make发生的错误和解决办法2
错误1: 执行命令:for req in $(cat requirements.txt); do pip install $req; done 错误2: <em>make</em> runtest
Buildroot编译错误解决方法
编译buildroot时,使用<em>make</em> menuconfig出现以下错误:HOSTCC scripts/kconfig/lxdialog/checklist.oIn file included from scripts/kconfig/lxdialog/checklist.c:24:scripts/kconfig/lxdialog/dialog.h:32:20: error: c
Make命令出错原因归纳
1.今天我碰到一个<em>make</em>命令出错,命令行显示:<em>make</em>: *** [main] 错误 2最后发现是头文件找不到。不清楚为何出错信息如此简单。 2.常见的<em>原因</em>,遗漏分隔符:就是Makefile中,一行起始有空格,应该用TAB字符。 3.文件以0D0A结尾,造成使用宏定义的时候,编译出错#define PRINT(a,b) /{ /       printf(
su 和 sudo 的区别,并导致install出错
原文网址:http://blog.chinaunix.net/u1/46715/showart_1663653.htmlAuthor: wmmwang(unc,王敏敏)Environment:fedora8            arm-linux-gcc 3.4.1Minigui: 1.3.3Date:2008-11-24    按照以前经验,把要改的地方改好。接着<em>make</em>,没的问题。    然...
CMake 编译 TrinityCore时报错请大神帮忙解决一下~
想自己搭建一个WOW私服下载的是 VS2015 下载完源码后 编译出现这个错误~在网上找了很多都解决不了希望哪位大神帮忙解决一下~谢谢好人一生平安~!
vim 写入错误,转换失败 (请将 'fenc' 置空以强制执行)
转载:http://forum.ubuntu.org.cn/viewtopic.php?p=2498184 代码: set fenc= 就好了. 参考: 引用: vim里面的编码主要跟三个参数有关:enc(encoding), fenc(fileencoding)和fencs(fileencodings) 其中fenc是当前文件的编码,也就是说,一个在
makefile忽略错误继续编译
https://blog.csdn.net/lgibsion/article/details/70854565
linux下Matcaffe调用及库链接问题的解决(mattest不通过)
编译<em>make</em> matcaffe后,执行<em>make</em> mattest后,往往出现“Invalid MEX-file"问题,其<em>原因</em>是MATLAB和linux的库冲突,解决的方法是用linux的库(在编译caffe之前大家的opencv等库肯定也早已装好了) 大部分的解决方法是通过export LD_LIBRARY_PATH和 LD_PRELOAD来链接,但是效果不好。最后发现,只有直接去MATLAB下面
wcf服务引用失败
wcf服务引用<em>失败</em>的<em>原因</em>多种多样,此例吃力的<em>原因</em>是因为粗心大意,很难发现的错误引起的,提供给同仁,引以为戒。
kaldi重新编译报错
这个其实只是记录一下,之前用过,忘了,刚才郁闷了半个小时如果我们想修改部分源码,只需要编译改的那部分就好了,比如编译gmmbin下的某个文件,不过这时候改完需要三个步骤,报错主要是忘了depend.error:gmm-init-mono.o: In function `kaldi::ReadSharedPhonesList(std::__cxx11::basic_string<char, std::
关于SpringBoot bean无法注入的问题(与文件包位置有关)
问题场景描述整个项目通过Maven构建,大致结构如下: 核心Spring框架一个module spring-boot-base service和dao一个module server-core 提供系统后台数据管理一个module server-platform-app 给移动端提供rest数据接口一个module server-mobile-api 其中server-platform-app 与
Chameleon--RC5-变色龙引导 for mac下载
Chameleon--RC5,mac下使用的变色龙引导软件 相关下载链接:[url=//download.csdn.net/download/sunnydew/3209770?utm_source=bbsseo]//download.csdn.net/download/sunnydew/3209770?utm_source=bbsseo[/url]
学生选课系统课程设计报告下载
完整的学生选课系统 用PowerBuilder 和sql语言实现的 相关下载链接:[url=//download.csdn.net/download/yuanjiang11/1961456?utm_source=bbsseo]//download.csdn.net/download/yuanjiang11/1961456?utm_source=bbsseo[/url]
如何创建一个linux最小系统下载
非常的教程,教你如何创建一个小的linux系统~~ 相关下载链接:[url=//download.csdn.net/download/rangercyh/2037583?utm_source=bbsseo]//download.csdn.net/download/rangercyh/2037583?utm_source=bbsseo[/url]
文章热词 设计制作学习 机器学习教程 Objective-C培训 交互设计视频教程 颜色模型
相关热词 mysql关联查询两次本表 native底部 react extjs glyph 图标 大数据学习原因 学习人工智能的原因
我们是很有底线的