问题:error: ‘pthread_t’ does not name a type [问题点数:40分,结帖人blueboy82006]

Bbs1
本版专家分:74
结帖率 98%
Bbs5
本版专家分:2977
Bbs1
本版专家分:74
Bbs2
本版专家分:357
Bbs1
本版专家分:74
Bbs1
本版专家分:0
前置声明与C++头文件互相包含导致的error: 'xxx' does not name a type问题
在一个源文件中,要声明或定义一个类的指针时,必须在使用前声明或定义该类,因此下面的代码会报错:class An{npublic:n B *b;n};class Bn{npublic:n A *a;n};int main()n{n return 0;n}报错为“<em>error</em>: ‘B’ <em>does</em> not <em>name</em> a <em>type</em>”,就是因为在A类中使用B *b之前没有声明或定义B类,如果在
Qt 头文件互相包含会报错'' does not name a type
记录遇到的<em>问题</em>rnrnrn报错内容为'' <em>does</em> not <em>name</em> a <em>type</em>rnrnrn解决方法:改为不互相包含即可
编译错误导致浪费10多分钟, 编译错误的提示:xxx does not name a type xxx
最近, 我在google protobuf 协议文件xxx.pb增加了结构体(类)请求字段, 生成xxx.h和xxx.cpp文件, 然后放到对应目录进行编译, 奇葩的是, 编译出错, 提示:... <em>does</em> not <em>name</em> a <em>type</em> ..., 实际就是在名空间中没有找到类。查了至少10多分钟才找到原因。
caffe_ssd 偶遇编译bug描述及解决记录
weiliu大神的ssd框架是很好用的,但在服务器重装之后,ssd编译却出现了奇怪的bug:nnn nCXX src/caffe/data_transformer.cppnIn file included from src/caffe/data_transformer.cpp:8:0:n./include/caffe/data_transformer.hpp:69:24: <em>error</em>: ‘An...
导入wingdi.h头文件,显示'UINT' does not name a type等50余处错误的解决办法
在引入wingdi.h头文件时即使不写任何额外代码仍会报错:nwingdi.h头文件是windows平台所特有的,这里所报错数据类型定义在纯正C\C++语法中不存在,故识别不了而报错。
【转】pthread_mutex_t 和 pthread_cond_t 配合使用的简要分析
1.原理假设有两个线程同时访问一个全局变量 n,这个全局变量的初始值等于0。Int  n = 0 ;         消费者线程 A 进入临界区,访问 n,A 必须等到 n 大于 0 才能接着往下执行,如果 n== 0,那么 A 将一直等待。         还有一个生产者线程 B,B 进入临界区,修改 n 的值,使得 n &amp;gt;0,当 n &amp;gt; 0 时,B 通知等待 n &amp;gt; 0 的消...
读写锁pthread_rwlock_t
#include &amp;lt;iostream&amp;gt; #include &amp;lt;pthread.h&amp;gt; #include &amp;lt;unistd.h&amp;gt; int Money = 0; pthread_rwlock_t rwlock = PTHREAD_RWLOCK_INITIALIZER; void* readThread(void* argv) { pthread_rwlock...
pthread_t
类型定义:   <em>type</em>def unsigned long int <em>pthread_t</em>;   //come from /usr/include/bits/pthread.h   用途:<em>pthread_t</em>用于声明线程ID。   sizeof (<em>pthread_t</em>) =4;
pthread_mutex_t与pthread_cond_t
这两个都是在中定义的结构,pthread_mutex_t是互斥锁,pthread_cond_t是条件变量,主要用于PV操作。 pthread_mutex_t: 1. pthread_mutex_t的初始化:初始化可以用int pthread_mutex_init(pthread_mutex_t *mutex, const pthread_mutexattr_t * attr),这是动态创建方法
C++互斥量pthread_mutex_t简述
转自:http://blog.csdn.net/zmxiangde_88/article/details/7998458 在线程实际运行过程中,我们经常需要多个线程保持同步。这时可以用互斥锁来完成任务;互斥锁的使用过程中,主要有pthread_mutex_init,pthread_mutex_destory,pthread_mutex_lock,pthread_mutex_unlock这几个
搭建protobuf-c编译环境中遇到的问题
=============================================================================nnn <em>error</em>: C++ preprocessor &quot;/lib/cpp&quot; fails sanity check <em>问题</em>的解决n nUbuntu系统中,运行命令:nnn# apt-get install build-essentialnn# ap...
variable uint32_t not a type name ----一次崩溃的历程,所幸找到了问题所在
背景:将新接手的程序按照自己习惯处理一番,出现如下bug,查<em>问题</em>好久,问好多人,终于找到<em>问题</em>所在,分享给大家。nnnn提示<em>error</em>:#20:identifier “_STATIC_INLINE” is undefined n提示<em>error</em>:#101:”uint32_t”has already been declared in the current scopen提示<em>error</em>:#65:expec...
【Unity】UI在namespace"UnityEngine"不存在解决办法以及思路
Assets/I2/Localization/Scripts/Targets/LocalizeUGUI.cs(10,15): <em>error</em> CS0234: The <em>type</em> or <em>name</em>space <em>name</em> `UI' <em>does</em> not exist in the <em>name</em>space `UnityEngine'. Are you missing an assembly reference?
kettle笔记
1、There was a data <em>type</em> <em>error</em>: the data <em>type</em> of java.lang.String object [1 SU251] <em>does</em> not correspond to value meta [String(15)&amp;lt;binary-string&amp;gt;]nn使用csv输入+java脚本时可能发生以上错误,改为excel输入即可nn2、使用java脚本增加...
Xlua 热更遇到的问题
<em>问题</em>1,编译打包时遇到nnnAssets/XLua/Gen/UnityEngineLightWrap.cs(723,60): <em>error</em> CS1061: Type `UnityEngine.Light' <em>does</em> not contain a definition for `shadowRadius' and no extension method `shadowRadius' of <em>type</em> `U...
Unity 部分错误信息提示
1.平台编译错误或库引用缺失nn错误提示:<em>error</em> CS1061: Type `System.IO.FileInfo' <em>does</em> not contain a definition for `Delete' and no extension method `Delete' of <em>type</em> `System.IO.FileInfo' could be found (are you missing
高博14讲:第七讲中g20报错
高博14讲:第七讲中g20 3d3d 3d2d 报错的改动nn原因:g2o版本更新引起的错误修改nn3d3d报错:nnn/home/yk/桌面/slambook-master/ch7/pose_estimation_3d3d.cpp: In function ‘void bundleAdjustment(const std::vector&lt;cv::Point3_&lt;float&gt; &...
g++ gcc 在windows 10,64位环境下编译jni程序运行报错或者无法编译的解决方案
我的操作系统是windows10,安装的是 cygwin 64位,需要实现的功能很简单,java函数中调用jni函数打印 hello jniHelloJni.javapublic class HelloJni {n n native void hello();n n static {n System.loadLibrary(&quot;HelloJni&quot;);n }n n public static voi...
高博14讲:第七讲中g20 3d3d 3d2d 报错的改动
原因:g2o版本更新引起的错误修改n3d3d报错:n/home/yk/桌面/slambook-master/ch7/pose_estimation_3d3d.cpp: In function ‘void bundleAdjustment(const std::vector&lt;cv::Point3_&lt;float&gt; &gt;&amp;, const std::vector&lt;cv:...
caffe框架和theano框架的所需cudnn的版本冲突问题
在成功安装完成caffe和theano后(此时使用的cudnn的版本是v3),后跑了个caffe的minist数据集的实验可以成功实现,接着用Python跑theano的实验,提示nvcc 找不到GPU,,应将gpu(cuda)路径添加到环境变量中,但是添加完环境变量还是不行,提示cuDNN版本太低,应更新到V5。n经过搜集资料才知道,caffe官方版本对cudnn只支持到V4版本,不支持V5,
does not name a type?
//以下为类Arn#includern<em>type</em>def enumrn int a;rn int b;rndef_t;rnclass Arnrn;rn//以下为类Brn#includernclass A;rnclass Brn def_t def;rn;rnrn为什么报def_t未定义啊?rn
C++程序编译的时候报错prototype for '类名::函数名'does not match any in class'类名'解决经验。
从离开学校已经好久不写C++代码,今天需要写一个xml文件的读写模块,打算使用libxml2这个库来完成一些工作,网上也有一些类似的代码,打算弄点代码修改修改使用。n结果编译的时候遇见了这个<em>问题</em>。下面是我的lei源码:
ERROR:shared_ptr does not name a type
![代码如图:第27行报错图片说明](https://img-ask.csdn.net/upload/201507/02/1435840317_328997.png)nnn![报错如图图片说明](https://img-ask.csdn.net/upload/201507/02/1435840376_730277.png)nn求大神解答
remove_if的使用
Removes all elements satisfying specific criteria from the range [first, last) and returns a past-the-end iterator for the new end of the range.nn1) Removes all elements that are equal tonvalue.n3
运行caffe代码 SegNet
一、下载SegNet代码nn1、segnet代码的github地址:https://github.com/alexgkendall/SegNet-Tutorial(不包括caffe代码)nnnn2、在caffe-segnet的文件夹中,放置 下载到的caffe代码https://github.com/alexgkendall/caffe-segnetnn二、编译caffe代码nn1、因为cuda...
gotocelldialog
C++_GUI_Qt4_编程中gotocelldialog示例的代码,可正常运行
C++中错误总结
C++中错误总结1. "<em>error</em>: xxx in <em>name</em>space 'std' <em>does</em> not <em>name</em> a template <em>type</em>"1.1 错误原因:未导入相应的头文件1.2 解决方法:添加对应的头文件2. Error opening 'libxxx.so': libxxx.so: cannot open shared object file: No such file or dire...
Qt编程相关Bug(记录)
环境:nnQt5.10.1;Qt quick程序;qml与C++交互nn<em>问题</em>:nn1.<em>error</em>: ‘QMutex’ <em>does</em> not <em>name</em> a <em>type</em>:QMutex mutex;nn原因:没有包含相应的类nn解决方案:添加:#include &amp;lt;QMutex&amp;gt;nn2.TypeError: Property 'setMutex' of object xxxProcessor(0x1...
caffe编译问题
1.nnn.build_release/lib/libcaffe.so: undefined reference to `boost::re_detail::cpp_regex_traits_implementation&amp;lt;char&amp;gt;::transform_primary(char const*, char const*) const'n.build_release/lib/libcaf...
初学spark碰到的一些问题
在使用spark完成工程<em>问题</em>中遇到的一些实际的<em>问题</em>。
muduo库阅读(38)——Net部分:TCP连接TcpConnection
TCP客户端与TCP服务器之间的一个连接用TcpConnection表示。rn对于服务器来说,每当一个客户到来的时候就建立一个TcpConnection对象rn对于客户端来说,一个TcpConnection对象就表示客户端与服务器的一个连接rn用户不应该直接使用这个类.rnrnTcpConnection、事件处理器(Channel)、客户套接字是一一对应的。rn服务器接受一个链接然后创建这个套接字
pthread_rwlock_t 未定义的问题
rn最近在linux上次编译时出现pthread_rwlock_t没有定义的现象.但是已经include了pthread.h,网上查了一些资料后发现,原因竟然是因为显示使用了-std=c99参数导致.rn rn在c99没有完全实现时,如果不显示指定-std, 则gcc默认使用gnu89(或gnu90)标准.rn一般而言,rn               gnuXX标准 = cXX标准 + GNU ...
将mdk工程转为cmake工程探索(二)
将mdk工程转为cmake工程探索(二)n上篇回顾 n前篇文章进行到make阶段出现的3号错误如下: ntmp/ccZtObe3.s: Assembler messages: n/tmp/ccZtObe3.s:25: Error: selected processor <em>does</em> not supportwfi’ in ARM mode n/tmp/ccZtObe3.s:43: Error: sele
C++中unordered_map出现的若干问题详解(找不到库,找不到unorded_map,编译问题)
首先看一个例子:rn#include#includen#includennusing <em>name</em>space std;nint main(void) {n unordered_map > test;n return 1;n}rn如果采用g++进行编译的话,会出现不识别unordered_map的情况rn输入g++ test1.cc -o test1进行编译rn结果如下所示rntest1.cc:8:
Arduino之DS1307模块的使用记录
先把代码贴上:n#include &lt;Wire.h&gt;n#include &lt;RTClib.h&gt;nvoid printDateTime(DateTime dateTime); //声明一个函数nnDS1307 RTC; //这里像是一个python的类一样,是创建一个类的实例,很像是pythonnn//*********************<em>error</em>************...
[Unity&]缺少引用空间CrossPlatformInput的解决办法
PowerUp particles粒子系统rnrnrnrnrnrnrn<em>error</em> CS0234: The <em>type</em> or <em>name</em>space <em>name</em> `CrossPlatformInput' <em>does</em> not exist in the <em>name</em>space `UnityStandardAssets'. Are you missing an assembly reference?rnrn<em>error</em>
Caffe实战系列:如何将CRFAsRNN移植到caffe-windows上去
(1)移植辅助的文件nn将include/caffe/util/下的coords.hpp和modified_permutohedral.hpp复制到caffe-windows对应的目录nn将src/caffe/util/modified_permutohedral.cpp复制到对应的目录中去nnnnn(2)移植Layer中的特性nn在include/caffe/layer.h
SpringBoot使用过程中遇到的一些问题
异常一:org.springframework.context.ApplicationContextException: Unable to start embedded container; nested exception is org.springframework.beans.factory.BeanCreationException: Error creating bean with n...
libxl跨平台库 操作xlsx文件
下载库路径:http://www.libxl.com/download.html
cocos2d-x 3.0版本,eclipse编译时,识别不了std::thread
n在mac环境下,使用create-multi-platform-projects.py创建项目;按照README.md配置好android环境,编译时,CCTextureCache.h里面的std::thread,std::mutex等识别不了,其他string能识别呀。报:Multiple markers at this line- 'thread' in <em>name</em>space 'std' do...
string does not name a type
[code=C/C++]rn//extern_CPP.hrn#ifndef EXTERN_CPP_Hrn#define EXTERN_CPP_Hrn#include rnclass FileSystemrnrn string file<em>name</em>;//错误提示:string <em>does</em> not <em>name</em> a <em>type</em>rnpublic:rn FileSystem(string _file<em>name</em>);//错误提示:expected ')' before "_file<em>name</em>"rn void printFileName();rn;rn#endif // EXTERN_CPP_Hrnrn//extern_CPP.cpprn#include "extern_CPP.h"rn#include rn#include rn#include rnusing <em>name</em>space std;rnrnFileSystem::FileSystem(string _file<em>name</em>):file<em>name</em>(_file<em>name</em>)rnrnvoid FileSystem::printFileName()rnrn cout<
报错:does not name a type
代码中两个类要交叉引用:rn[code=c]rn#ifndef ITEMSET_Hrn#define ITEMSET_Hrnrn#include rn#include rn#include "ItemSorter.h"rnrnusing <em>name</em>space std;rnrn<em>name</em>space Arnrn <em>name</em>space Brn rn class ItemSetrn rn public:rn <em>type</em>def vector::size_<em>type</em> size_<em>type</em>;rn <em>type</em>def vector::iterator iterator;rnrn rn private:rn vector items;rn ItemSorter sorter;rn ;rn rnrnrn#endifrn[/code]rnrn[code=c]rn#ifndef ITEMSORTER_Hrn#define ITEMSORTER_Hrnrn#include "ItemSet.h"rnrn<em>name</em>space Arnrn <em>name</em>space Brn rn templatern class ItemSorterrn rn public:rn <em>type</em>def <em>type</em><em>name</em> T::iterator targetIter;rn public:rn ItemSorter();rn public:rn void sort(targetIter begin, targetIter end)rn rn rn rn ;rn rnrnrn#endifrn[/code]rnrn编译时,报错:rn[code=text]rnIn file included from ItemSorter.h:4:0:rnItemSet.h:23:4: <em>error</em>: ‘ItemSorter’ <em>does</em> not <em>name</em> a <em>type</em>rn ItemSorter sorter;rn[/code]rnrn我是想采用模板的方式进行交叉引用。
浅谈 TypeScript 特性
来自一位 TypeScript 开发者的 感性分析。
Unity报错总结
Unity报错总结nn报错记录nn记录平时遇到的各种报错<em>问题</em>,以及解决的办法,不定期更新nn1.高版本5.5打开低版本5.0以下项目报错 nUnityEditor.EditorUtility' <em>does</em> not contain a definition forGetMiniThumbnail’ n<em>error</em> CS0117: UnityEditor.EditorUtility' <em>does</em> not c...
枚举 enum
java的enum其实是一个类。编译器根据你enum的定义会为你生成一个 java.lang.Enum的子类。java.lang.Enum是一个抽象类,定义了很多final方法,也就是说你定义的enum类里不能覆盖它们,你唯一能覆盖的是Object.toString类。同时你定义的enum类是不能被继承的。rnrn先来看看java.lang.Enum类的代码rnrn注意,更具编码规范,枚举值应该全...
ROS-Kinect 自带opencv与自定义的opencv版本兼容问题
最近在ros上建立opencv工程,总有些包不能如愿加入,编译失败,在windows下用的GpuMat在ros下也不能通过:rn最开始报错:rn报错:[ 14%] Built target segnet_librn[ 21%] Building CXX object pa_stitching/CMakeFiles/pa_stitching_node.dir/src/main.cpp.orn[ 78
QT 之 编译错误总结(1)
1.'Thread' <em>does</em> not <em>name</em> a <em>type</em>n错误在于:头文件互相包含
记一次neo4j项目打包出现的问题
Caused by: java.lang.IllegalArgumentException: An SPI class of <em>type</em> org.apache.lucene.codecs.PostingsFormat with <em>name</em> 'Lucene50' <em>does</em> not exist. You need to add the corresponding JAR file supporting this SPI t
用实例程序再聊makefile指定头文件和库出错的那点破事
在文章http://blog.csdn.net/stpeace/article/details/50985578中, 我说过makefile指定头文件和库文件出错的那点破事, 今天破事重提, 用实际例子来聊一下.rntaoge@localhost Desktop> cat basic_add.cnint basic_add(int x, int y)n{n return x + y;n}ta
iOS 循环引入头文件出现“Unknown type of name
n n n &amp;lt;h1&amp;gt;<em>问题</em>:&amp;lt;/h1&amp;gt;n在A.h中#import了B.h文件,同时作为成员变量声明的时候n&amp;lt;pre&amp;gt;n@property(nonatomic, strong) B*b;n&amp;lt;/pre&amp;gt;n出现Unknown <em>type</em> of <em>name</em>“B”的错误n&amp;lt;h1&amp;gt;解决方法:&amp;lt;/h1&amp;gt;n发现在B.h...
ubuntu16.04使用gpu.hpp使用问题
<em>问题</em>:ros工程中添加头文件 #include"opencv2/gpu/gpu.hpp"  ,catkin_make失败:rn报错:[ 14%] Built target segnet_librn[ 21%] Building CXX object pa_stitching/CMakeFiles/pa_stitching_node.dir/src/main.cpp.orn[ 78%] Built
OpenCV 人脸识别使用 cvLoad()加载分类器报错的解决方法
nn报错情况:OpenCV Error: Unspecified <em>error</em> (The node <em>does</em> not represent a user object (unknown <em>type</em>?)) in cvRead。nn我发现 “\opencv\sources\data”有两个文件夹 “haarcascades_GPU”和 “haarcascades”,我们都默认用“haarcascades”下...
Java编译时出现Selection does not contain a main type错误的快速解决方法
rn 【错误描述】当前选择额运行的不是主类型,没有main()方法,运行失败。rn rnrn那么<em>问题</em>来了,明明前天,昨天,上一次,还能好好的运行着呀,为什么呢?rn rn虽然解决<em>问题</em>的原理不清楚,可解决<em>问题</em>的快捷方法如下:rn rnCtrl+A 全选中当前代码;Ctrl+X 剪切;Ctrl+S 没有错!保存当前文件;Ctrl+V 重新粘贴,保存。rn rn虽然道理我不懂,可是这样操作之后就能好好运...
Opent错误总结
将之前写的1024包交换的例程,从回收站拿回来报错检查后发现,是包不知道为什么消失了。将包重新定以后,可以解决这个<em>问题</em>。具体报错如下。rn>>可恢复错误rnPacket (0) is of a <em>type</em> that <em>does</em> notcontain formatted fields.rnT (10), EV (25), MOD(top.pksw1.node_0.proc), KP (op_pk_nfd
Arcgis 错误提示
错误代码n 错误描述n 错误名称n HRESULT:0x80040201n “Failed to load a resource (string, icon, bitmap, etc).”n LOADING_RESOURCEn HRESULT:0x80040202n The index passed was not within the valid range.n IN...
二叉树的递归遍历与非递归遍历(C++)
二叉树的一种定义:nnn//二叉链表示法 二叉树n<em>type</em>def struct BiTNoden{n int data;n struct BiTNode *lchild, *rchild; //左右孩子指针n}BiTNode, *BiTree;nn二叉树的遍历规则:广度优先遍历/深度优先遍历nn先序遍历:根左右nn中序遍历:左根右nn后序遍历:左右根nnn// 二叉树的先序递归遍历nvoid p...
Keil编程环境下的错误
每次在Keil编程环境中遇见各种各样的<em>error</em>和warning,这里就积累一点我所遇见的<em>问题</em>。nQ1:*** WARNING L2: REFERENCE MADE TO UNRESOLVED EXTERNALnQ2:*** WARNING L16: UNCALLED SEGMENT, IGNORED FOR OVERLAY PROCESSn没有调用到定义过的函数,变量什么的,看看具体的警告
C++中auto关键字的使用及编译错误解决
nauto可以自动帮我们推断变量的类型n比如在定义一些难以确定的变量类型时n 35     func_log(__func__, &quot;&quot;);n 36     // vector&amp;lt;Student&amp;gt;::iterator it = Students.begin();n 37     for (auto it = Students.begin(); it != Students.end(); i...
hive权限管理
环境:nHDP2.4 ,hive-1.2.0, ambari统一管理n目前hive支持简单的权限管理,默认情况下是不开启,这样所有的用户都具有相同的权限,同时也是超级管理员,也就对hive中的所有表都有查看和改动的权利,这样是不符合一般数据仓库的安全原则的。下面来介绍HIVE的权限管理。nnHive用户nn1. Hive作为表存储层。n    使用对象:Hive's HCatalog
我遇到的各种问题
此贴总结各种错误。总结的多了之后会加以分类。nnn1、解决Maven项目pom.xml文件报xxx\target\classes\META-INF\MANIFEST.MF (系统找不到指定的路径)<em>问题</em>:(只需简单地clean all projects)nhttp://www.cnblogs.com/zhfei/p/5286827.htmlnnn(一直更新)
[记录]hololens导出时报错 缺少命名空间“Windows.Devices.Haptics”
我在用Unity2017.2.1 配合holotoolkit2017.2.1时(也就是说版本是匹配的。<em>问题</em>没有出现在这里),出现三个报错:nnThe <em>type</em> or <em>name</em>space <em>name</em> 'Haptics' <em>does</em> not exist in the <em>name</em>space 'Windows.Devices' (are you missing an assembly reference?)nn...
solr安装过程中遇到的问题和解决方案
前言n<em>问题</em>及解决方案n前言n 环境:win7-64位,jdk8,solr-5.4.0n n 最新版的solr(5.4.0)不支持jdk1.7,大约是solr发展太快,而jdk更新太慢的缘故吧,如果你想用jdk7来支持solr5.4.0,那么你会遇到这个错误。 n n 在安装配置solr的过程中遇到了很多<em>问题</em>,然后自己一一解决,在这里记录一下,方便以后查看n<em>问题</em>及解决方案org.apach
golang interface实现中遇到的问题
package mainnnimport (n "fmt"n)nn<em>type</em> Human struct {n <em>name</em> stringn age intn phone stringn}nn<em>type</em> Student struct {n Humann school stringn loan float32n}nn<em>type</em>
Eureka Server 加上安全认证之后,服务无法注册
n2019-01-01 02:56:06.665 WARN 19992 --- [tbeatExecutor-0] c.n.d.s.t.d.RetryableEurekaHttpClient : Request execution failed with message: com.fasterxml.jackson.databind.exc.MismatchedInputException...
VS2008常见问题解决方案
fatal <em>error</em> CVT1100nn>CVTRES : fatal <em>error</em> CVT1100: duplicateresource.  <em>type</em>:DIALOG, <em>name</em>:510,language:0x0804n这句话的意思是资源ID为510的DIALOG重复定义了,在resource.h中查找资源ID为510的资源标识IDD_AXESDLG,全工程搜索该资源标识IDD_AXESDL
大数据学习-scala(1)
跟随王老师学习第一个课总结,scala基础知识:变量定义、if else、while、for、数组、map、函数定义
QT5.11.2新手遇到问题does not name a type
[img=https://img-bbs.csdn.net/upload/201811/26/1543222240_550291.png][/img][img=https://img-bbs.csdn.net/upload/201811/26/1543222240_963967.png][/img]rnrn请教一个这样的<em>问题</em>
g++ 4.8 auto does not name a type
[img=https://img-bbs.csdn.net/upload/201310/31/1383210249_412628.png][/img]rn为什么auto关键字报这个错误呢rn[code=c]#include "test.h"rn#include rnrnusing <em>name</em>space std;rnrnint main()rn double dval = 3.14;rn //double fval = 2.0;rn //double &dval2 = dval;rn //const double &dval3 = dval;rn //double const *dval4 = &dval;rn //int const i = 1;rn auto x = dval;rn[/code]
求助:'GLunit' does not name a type
开发环境dev c++ 4.9.9.2rnrnminGW编译器rnrn语言C++rnrn先上一段代码[code=C/C++]rn#include rn#include rn#include "mybutton.h"rn#include "BmpLoader.h"rnrnrnGLunit texnum;rn[/code]rnrnglut已经配置好了,之前也一直没有<em>问题</em>,为什么声明这个GLunit 类型的变量编译器就报错:rnrn'GLunit' <em>does</em> not <em>name</em> a <em>type</em>rnrn-----------------------------------------------------------------------rn或许这是个很简单的<em>问题</em>,rn我已经在网上找了许多资料看了,但是没有一个能解决这个<em>问题</em>的……rn迫于无奈在这里请教各位了!rnrnany suggestion would be appreciated!!rn
Scala学习笔记(2)
Scala基本语言特性相比Java``C++等语言,Scala融合了OOP``FP等编程范式,同时语法上更灵活。语法基础(概览)nScala语言中不强制要求分号,可以依行断句,只有一行带有多个语句时才要求分号隔开。n使用var``val定义变量``常量,类型可以由编译器推导,也可以显式指定。定义变量时甚至可以省略var``val关键字,无关键字时定义的变量默认即为val,在定义变量的同时就需要初始化
特殊的数据类型:socklen_t、uint32_t、pthread_t
在编程的时候,发现了一些不知道什么类型的数据类型,于是整理了一下。1.socklen_t是一种数据类型,它其实和int差不多,在32位机下,size_t和int的长度相同,都是32 bits,但在64位机下,size_t(32bits)和int(64 bits)的长度是不一样的,socket编程中的accept函数的第三个参数的长度必须和int的长度相同。于是便有了socklen_t类型。nint...
C和C++中*与&的用法
The use of * in Crnrn(a)   Multiplication乘法:   x = y*z;rnrnrn(b)    Multiply-assign:   x *= y;   Means the same as: x = x*y;rnrnrn(c)   Comments: 注释  /* your comment here */rnrnrn(d)   Pointer declara
编译错误stray ‘\343’ '\200' in program解决办法
<em>error</em>:nnexamples/cpp-capture.cpp:104:1: <em>error</em>: stray ‘\343’ in programn unsigned int* data = (unsigned int)dev.get_frame_data(rs::stream::depth);n ^nexamples/cpp-capture.cpp:104:1: <em>error</em>: stray ‘
C/C++常见错误汇总
n<em>error</em>: C++ requires a <em>type</em> specifier for all declarationsn原因:n解决方法:nnn
org.springframework.transaction-3.1.2.RELEASE.zip
org.springframework.beans.factory.BeanCreationException: Error creating bean with <em>name</em> 'org.springframework.transaction.interceptor.TransactionInterceptor#0': Error setting property values; nested exception is org.springframework.beans.NotWritablePropertyException: Invalid property 'transactionManagerBeanName' of bean class [org.springframework.transaction.interceptor.TransactionInterceptor]: Bean property 'transactionManagerBeanName' is not writable or has an invalid setter method. Does the parameter <em>type</em> of the setter match the return <em>type</em> of the getter?
初入机器人-1
初入机器人nnnn背景: n老师实验室接到了一个机器人公司的项目,到我们这边的任务就是设计出几款机器人,要求使用arduino开发,也就是使用328p作为主控。nnnn1 准备工作nn我从来没有做过机器人,要做出一个机器人,在硬件方面必不可少的有:主控、舵机或电机驱动和电源。软件方面就是使用arduino已经集成的库对各个模块编程,使用PID算法等优化机器人的动作。nnnn1 . 1 买东西nn前...
kubectl认证 授权 准入控制
nnkubernetes 认证及serviceaccount(服务账号)nnkubernetes中apiservice是唯一访问的入口nn认证-&amp;gt;授权-&amp;gt;准入控制n认证方式:ntokennsslnkubect和node都要双向认证nK8s1.6以上增加了RBAC认证,授权检查nkuberadm是强制使用了kuberadm的授权认证n这都是最高的权限进行管理n nn用户账号具有以下信息:...
quartz整合spring时遇到的错误
org.springframework.beans.factory.BeanCreationException: Error creating bean with <em>name</em> 'org.springframework.scheduling.quartz.SchedulerFactoryBean#0' defined in class path resource [applicationContext...
导入iTweenPath 插件报错CS0103:当前上下文中不存在“iTween”
最近在研究unity游戏,在研究到粒子的时候,为了让粒子能按照规定路线移动,所以网上下载了一个iTweenPath的插件,n(为了方便后面有人需要,放入链接:http://www.pixelplacement.com/site/2010/12/03/visual-editor-for-itween-motion-paths/)n后来导入到unity后发现iTweenPath.cs脚本报错:n(错误...
scala奇怪的bug
今天在用spark的graphx写程序的时候编译器报了一个奇怪的错nError:scalac: Error: object VolatileIntRef <em>does</em> not have a member createnscala.reflect.internal.FatalError: object VolatileIntRef <em>does</em> not have a member createnn at
# Tensorflow 代码调试过程出现问题及解决方法
Tensorflow 代码调试过程出现<em>问题</em>及解决方法nn@(monkey)nnnn一. 错误nn初学者很容易犯很多错误 n记录一下nnnn1.slice indices must be integers or None or have an index methodnnnn#定义这样图 nwith tf.<em>name</em>_scope(&quot;validation&quot;):n with tf.variable_...
qt4项目迁移到qt5,遇到的问题及解决办法
warning: TARGET is empty打开pro文件,你会发现:TARGET =,在后面加上你要生成的可执行程序名字即可。<em>error</em>: QWidget: No such file or directory #include < QWidget>在pro文件中添加:QT += core gui ngreaterThan(QT_MAJOR_VERSION,4): QT += widgets
提交第一个Flink流式作业
提交第一个Flink流式作业nn1. 使用如下mvn命令编译项目nnnyitian@flink:~/flink-idea/quickstart$ mvn clean packagen[INFO] Scanning for projects...n[INFO] ...
關於:Error 16:The type name 'CustomTextBox' does not exist in the type 'CustomControl.CustomControl'
我在命名空間:CustomControl中定義如下控件 public class CustomTextBox : TextBoxrn然後在aspx中調用CustomTextBox控件,如果不加入Text =此句則正常,一但加入則會報如題所示的錯誤,CustomTextBox只是在TextBox的基礎上擴展了幾個屬性!
SSL在tomcat上的配置,nginx上的简单配置。及其注意事项
本文偏重于证书申请、下载、tomcat中的配置。nginx配置为简化版,详细配置、高级定制配置见我另一篇博客。
mnist中遇到的问题
一、TypeError: object of <em>type</em> ‘zip’ has no len()TypeError: ‘zip’ object is not subscriptable解决办法:将:training_data = zip(training_inputs, training_results)                改为:training_data = list(zip(train...
在编写最简单的linux 内核驱动, 编译后出现的问题以及解决方法。
一、make 过后,出现的<em>问题</em>。rnmake -C /home/ubuntu/Downloads/linux-3.12.72 M=/home/ubuntu/Desktop/haoba/3th modulesrnmake[1]: Entering directory `/home/ubuntu/Downloads/linux-3.12.72'rn  CC [M]  /home/ubuntu/Desk
shiro配置报错问题
开始在配置shiro一直报错rn下面直接上代码,我开始的配置是这样的:rn n n n n n n n
Protobuf3编译纠错
最近在学习Google的Protobuf通讯协议,在编译一个例程的过程中出现了大量未定义引用。In file included from /usr/local/include/google/protobuf/stubs/common.h:52:0,n from test.pb.h:9,n from test.cpp:3:n/usr/l...
Android问题集锦之四十六:改包名后出现Error type 3
背景: n为了和使用Eclipse的同学并行工作了,我将原Eclipse的项目中加入build.gradle,内容如下:android {n compileSdkVersion 19n buildToolsVersion "19.1.0" sourceSets {n main {n manifest.srcFile 'AndroidManifes
关于Java访问PostgreSQL数据库遇到的问题处理(大小写问题和字段类型问题ERROR: operator does not exist: double precision = charact)
 nn()最近在写关于数据表转RESTful服务接口的相关功能,在关于PGSQL数据库的功能方面,遇到如下两个<em>问题</em>:nn1.Java中传入的SQL(其实在数据库内直接执行的SQL也一样),不管大写还是小写,最后执行时都会转为小写,这样当数据库内字段名为大写时,就会报 字段不存在的错误,究其原因:在于PostgreSQL对表名、字段名都是区分大小写的。但是PostgreSQL在SQL语句中对大小写是...
jenkins xcodebuild命令行打包iOS项目问题汇总
这几天折腾了jenkins对iOS项目的持续集成,碰到了很多<em>问题</em>,记录下吧nxcodebuild: <em>error</em>: The project <em>name</em>d “Foo” <em>does</em> not contain a scheme <em>name</em>d “Bar”. The “-list” option can be used to find the <em>name</em>s of the schemes in the project.n解
ArcEngine错误提示
错误代码n 错误名称n 错误描述 HRESULT:0x80040201n FDO_E_LOADING_RESOURCEn “Failed to load a resource (string, icon, bitmap, etc).”n HRESULT:0x80040202n FDO_E_INDEX_OUT_OF_RANGEn The index passed was not wit
一次ORA-39083,ORA-01917的问题解决过程
一次ORA-39083,ORA-01917的<em>问题</em>解决过程        rn        今天到导数据的时候遇到了一个<em>问题</em>,也不知道有没有其他小伙伴也遇到过。按照要求导出一个用户下指定表的部分数据,此时使用了expdp的tables参数指定要导出的表这里我导出的是BKG_MAINT用户下的RAIL_SIGHTING,导出命令如下:rnexpdp goldengate/goldengate DIR
101个linq小例子下载
适用于初学者,现在用Entity Framework的越来越多了,如果刚接触的话,先把linq学一下吧 相关下载链接:[url=//download.csdn.net/download/gnahz205/4874043?utm_source=bbsseo]//download.csdn.net/download/gnahz205/4874043?utm_source=bbsseo[/url]
中文简码输入法9.5特级版下载
中文汉字简码输入是按照现代国家标准笔顺打字,一般人 一看便会! 笔画仅分为横提1竖竖钩2撇3点捺4折5五类, 2笔1键打一二笔和三四笔和末两笔,平均出字仅1码多, 最多3码一般不用翻页或较少翻页,快于同类的打字形码! 软件按现代中国标准,用最标准的字形,最纯正的拼音,最 正确的笔画,最规范的笔顺设计代码;让软件无难点、无 重点、无注解、无例外,且极有规律;能让中国人即学即 用,也能让外国人群学群会.编码符合【规范、易学、通 用、高效】四项标准,打第一码后按- =翻页键可知道每 一字词编码!可以让人打字不愁,不会一筹莫展,没有打 不出,查不出和读不准的字,没有拆字的困惑,没有遗忘 烦恼。能让打字 相关下载链接:[url=//download.csdn.net/download/om111/2354146?utm_source=bbsseo]//download.csdn.net/download/om111/2354146?utm_source=bbsseo[/url]
微机原理与与接口技术习题集下载
适用各版本,我在网上找的,真的很有用。概括得很全面。 相关下载链接:[url=//download.csdn.net/download/yijun494610095/2733340?utm_source=bbsseo]//download.csdn.net/download/yijun494610095/2733340?utm_source=bbsseo[/url]
文章热词 机器学习教程 Objective-C培训 交互设计视频教程 颜色模型 设计制作学习
相关热词 mysql关联查询两次本表 native底部 react extjs glyph 图标 区块链问题 ios视频开发问题
我们是很有底线的