Unable to find messages file 'cscompui.dll' [问题点数:20分]

Bbs1
本版专家分:0
结帖率 0%
Bbs6
本版专家分:6504
Bbs11
本版专家分:233833
Blank
状元 2011年 总版技术专家分年内排行榜第一
Blank
金牌 2011年9月 总版技术专家分月排行榜第一
2011年8月 总版技术专家分月排行榜第一
2011年7月 总版技术专家分月排行榜第一
2011年6月 总版技术专家分月排行榜第一
2011年5月 总版技术专家分月排行榜第一
2011年4月 总版技术专家分月排行榜第一
Blank
银牌 2011年3月 总版技术专家分月排行榜第二
2011年2月 总版技术专家分月排行榜第二
Blank
微软MVP 2012年7月 荣获微软MVP称号
2011年7月 荣获微软MVP称号
Bbs1
本版专家分:0
Bbs1
本版专家分:0
Bbs1
本版专家分:0
Bbs1
本版专家分:0
Bbs2
本版专家分:105
spring3+struts2+JPA配置时出现 Unable to find file 警告,求解答。
2012-04-21 16:51:10,984 WARN org.hibernate.ejb.packaging.InputStreamZippedJarVisitor.doProcessElements:61 - Unable to <em>find</em> <em>file</em> (ignored): jndi:/localhost/yesplm2/rnjava.io.FileNotFoundException: jndi:/localhost/yesplm2/rn at org.apache.naming.resources.DirContextURLConnection.getInputStream(DirContextURLConnection.java:385)rn at java.net.URL.openStream(URL.java:1009)rn at org.hibernate.ejb.packaging.InputStreamZippedJarVisitor.doProcessElements(InputStreamZippedJarVisitor.java:57)rn at org.hibernate.ejb.packaging.AbstractJarVisitor.getMatchingEntries(AbstractJarVisitor.java:146)rn at org.hibernate.ejb.packaging.NativeScanner.getClassesInJar(NativeScanner.java:128)rn at org.hibernate.ejb.Ejb3Configuration.addScannedEntries(Ejb3Configuration.java:467)rn at org.hibernate.ejb.Ejb3Configuration.scanForClasses(Ejb3Configuration.java:828)rn at org.hibernate.ejb.Ejb3Configuration.configure(Ejb3Configuration.java:582)rn at org.hibernate.ejb.HibernatePersistence.createContainerEntityManagerFactory(HibernatePersistence.java:72)rn at org.springframework.orm.jpa.LocalContainerEntityManagerFactoryBean.createNativeEntityManagerFactory(LocalContainerEntityManagerFactoryBean.java:225)rn at org.springframework.orm.jpa.AbstractEntityManagerFactoryBean.afterPropertiesSet(AbstractEntityManagerFactoryBean.java:308)rn at org.springframework.beans.factory.support.AbstractAutowireCapableBeanFactory.invokeInitMethods(AbstractAutowireCapableBeanFactory.java:1477)rn at org.springframework.beans.factory.support.AbstractAutowireCapableBeanFactory.initializeBean(AbstractAutowireCapableBeanFactory.java:1417)rn at org.springframework.beans.factory.support.AbstractAutowireCapableBeanFactory.doCreateBean(AbstractAutowireCapableBeanFactory.java:519)rn at org.springframework.beans.factory.support.AbstractAutowireCapableBeanFactory.createBean(AbstractAutowireCapableBeanFactory.java:456)rn at org.springframework.beans.factory.support.AbstractBeanFactory$1.getObject(AbstractBeanFactory.java:291)rn at org.springframework.beans.factory.support.DefaultSingletonBeanRegistry.getSingleton(DefaultSingletonBeanRegistry.java:222)rn at org.springframework.beans.factory.support.AbstractBeanFactory.doGetBean(AbstractBeanFactory.java:288)rn at org.springframework.beans.factory.support.AbstractBeanFactory.getBean(AbstractBeanFactory.java:194)rn at org.springframework.beans.factory.support.DefaultListableBeanFactory.getBeansOfType(DefaultListableBeanFactory.java:398)rn at org.springframework.beans.factory.BeanFactoryUtils.beansOfTypeIncludingAncestors(BeanFactoryUtils.java:275)rn at org.springframework.dao.support.PersistenceExceptionTranslationInterceptor.detectPersistenceExceptionTranslators(PersistenceExceptionTranslationInterceptor.java:139)rn at org.springframework.dao.support.PersistenceExceptionTranslationInterceptor.(PersistenceExceptionTranslationInterceptor.java:79)rn at org.springframework.dao.annotation.PersistenceExceptionTranslationAdvisor.(PersistenceExceptionTranslationAdvisor.java:70)rn at org.springframework.dao.annotation.PersistenceExceptionTranslationPostProcessor.setBeanFactory(PersistenceExceptionTranslationPostProcessor.java:99)rn at org.springframework.beans.factory.support.AbstractAutowireCapableBeanFactory.invokeAwareMethods(AbstractAutowireCapableBeanFactory.java:1439)rn at org.springframework.beans.factory.support.AbstractAutowireCapableBeanFactory.initializeBean(AbstractAutowireCapableBeanFactory.java:1408)rn at org.springframework.beans.factory.support.AbstractAutowireCapableBeanFactory.doCreateBean(AbstractAutowireCapableBeanFactory.java:519)rn at org.springframework.beans.factory.support.AbstractAutowireCapableBeanFactory.createBean(AbstractAutowireCapableBeanFactory.java:456)rn at org.springframework.beans.factory.support.AbstractBeanFactory$1.getObject(AbstractBeanFactory.java:291)rn at org.springframework.beans.factory.support.DefaultSingletonBeanRegistry.getSingleton(DefaultSingletonBeanRegistry.java:222)rn at org.springframework.beans.factory.support.AbstractBeanFactory.doGetBean(AbstractBeanFactory.java:288)rn at org.springframework.beans.factory.support.AbstractBeanFactory.getBean(AbstractBeanFactory.java:194)rn at org.springframework.context.support.AbstractApplicationContext.registerBeanPostProcessors(AbstractApplicationContext.java:710)rn at org.springframework.context.support.AbstractApplicationContext.refresh(AbstractApplicationContext.java:410)rn at org.springframework.web.context.ContextLoader.createWebApplicationContext(ContextLoader.java:276)rn at org.springframework.web.context.ContextLoader.initWebApplicationContext(ContextLoader.java:197)rn at org.springframework.web.context.ContextLoaderListener.contextInitialized(ContextLoaderListener.java:47)rn at org.apache.catalina.core.StandardContext.listenerStart(StandardContext.java:4779)rn at org.apache.catalina.core.StandardContext.startInternal(StandardContext.java:5273)rn at org.apache.catalina.util.LifecycleBase.start(LifecycleBase.java:150)rn at org.apache.catalina.core.ContainerBase.addChildInternal(ContainerBase.java:895)rn at org.apache.catalina.core.ContainerBase.addChild(ContainerBase.java:871)rn at org.apache.catalina.core.StandardHost.addChild(StandardHost.java:615)rn at org.apache.catalina.startup.HostConfig.deployDirectory(HostConfig.java:1095)rn at org.apache.catalina.startup.HostConfig$DeployDirectory.run(HostConfig.java:1617)rn at java.util.concurrent.Executors$RunnableAdapter.call(Executors.java:441)rn at java.util.concurrent.FutureTask$Sync.innerRun(FutureTask.java:303)rn at java.util.concurrent.FutureTask.run(FutureTask.java:138)rn at java.util.concurrent.ThreadPoolExecutor$Worker.runTask(ThreadPoolExecutor.java:886)rn at java.util.concurrent.ThreadPoolExecutor$Worker.run(ThreadPoolExecutor.java:908)rn at java.lang.Thread.run(Thread.java:619)rn2012-04-21 16:51:12,921 INFO org.hibernate.tool.hbm2ddl.SchemaValidator.validate:121 - Running schema validatorrn2012-04-21 16:51:12,921 INFO org.hibernate.tool.hbm2ddl.SchemaValidator.validate:129 - fetching database metadatarn2012-04-21 16:51:12,968 INFO org.hibernate.tool.hbm2ddl.TableMetadata.:65 - table found: yespm.personrn2012-04-21 16:51:12,968 INFO org.hibernate.tool.hbm2ddl.TableMetadata.:66 - columns: [first_name, last_name, emplid]rn rnrn求解答。rnrn
Unable to open file "C0X32.OBJ"
我在使用 Borland C++5.0后安装了VC++6.0,rn之后在编译文件时出现提示rnUnable to open <em>file</em> "C0X32.obj"rn请教怎样解决?
Unable to open file "WINMM.OBJ"
VC下的CAudioCapture用WINAPI 写的 , 到BCB下结果 Unable to open <em>file</em> winmm.obj 什么原因?rn望bcb达人指导 o o..
unable to open database file
我的程序在运行时操作sqlite数据库出了一个问题。 执行一条简单的select count(*) from table的时候出了 <em>unable</em> to open database <em>file</em>的错误。数据库连接之前就已经建立好了,出错后没有重新连接,后续的操作语句执行正常。rnrn该问题以前从来没出现过,不知哪位大侠能够告知问题原因
Unable to open file 'XMLCOMPONENT.BPI'
CB5.0中,新建一个工程,哪怕什么都不加,运行都会出现:rn[Linker Fatal Error] Fatal: Unable to open <em>file</em> 'XMLCOMPONENT.BPI'
Unable to open file "User.Lib"
各位大虾,我只有这么多分了,希望大家帮助,我运行工程老是要报这个错!怎么解决呢?请指教!
Unable to open file 'FACEGROUP.LIB'
我在编译后出现[Linker Fatal Error] Fatal: Unable to open <em>file</em> 'FACEGROUP.LIB',怎么弄都搞不定,肯请大虾救命!
Unable to open the database file
/// rn /// 获取当前系统程序根目录的路径rn /// rn /// rn public static string GetRootPath()rn rn string DataPath = "";rn if (Environment.OSVersion.Platform.ToString() == "WinCE")rn rn DataPath = Path.GetDirectoryName(System.Reflection.Assembly.GetExecutingAssembly().GetName().CodeBase);rn rn else if (Environment.OSVersion.Platform.ToString() == "Win32NT")rn rn DataPath = Directory.GetCurrentDirectory();rn rn return DataPath;rn rn /// rn /// 连接字符串rn /// rn /// rn private SQLiteConnection GetConn()rn rn //string connString = "data source=" + Path.GetDirectoryName(Assembly.GetExecutingAssembly ().GetName().CodeBase) + @"\Data\StudentDB.xml";rn string connString = "data source=" + GetRootPath() + @"\Data\employeeinfo.xml";rn SQLiteConnection conn = new SQLiteConnection(connString);rn return conn;rn rnrn这是我的连接数据库代码rnrn下面的conn.Open();是报错的地方rn/// rn /// DataTable断开式读取rn /// rn /// 传sql语句rn /// 返回dataTable对象rn public DataTable ExecDataTable(string sql)rn rn SQLiteConnection conn = GetConn();rn if (conn.State == ConnectionState.Closed)rn rn conn.Open();rn rnrn SQLiteDataAdapter sda = new SQLiteDataAdapter(sql, conn);rn DataTable dt = new DataTable();rn sda.Fill(dt);rn if (conn.State == ConnectionState.Open)rn rn conn.Close();rn rn return dt;rn rnrnrn请各位大虾帮我看看问题出在哪里?
Unable to open file c.res
编译一工程出现。如题Unable to open <em>file</em> c.res的链接错误 ,如何解决?
ClassWizard unable to rename file
最近我的VC++6.0下添加成员函数或其他用ClassWizard添加东西总是提示rnClassWizard <em>unable</em> to rename <em>file</em> c:\Docume~1\xx\xx\TEMP\mfcxx.tmp ....E:\xx\xx\xx.cpp ...rn点确定后,提示:Error while updating <em>file</em>(s) xxxxx for class xx,并且自动删除了我的 xx.cpp 怎么解决?是什么问题阿?
sp2-0310:unable to open file
PB中run()调用bat文件后提示:sp2-0310:<em>unable</em> to open <em>file</em>“c:\a.sql”rn这是为什么啊
Unable to open trace file
08-30 11:40:49.274: ERROR/dalvikvm(280): Unable to open trace <em>file</em> '/sdcard/x.trace': Permission deniedrnrnrnrnrn rn[color=#FF0000] [/color] rn rn rn rn rn rn rnrn rnrnrn @Overridern public void onCreate(Bundle savedInstanceState) rn super.onCreate(savedInstanceState);rn setContentView(R.layout.main);rn rn[color=#FF0000] Debug.startMethodTracing("x"); [/color] rn rn rn @Overridern public void onDestroy() rn super.onDestroy();rn [color=#FF0000] Debug.stopMethodTracing();[/color] rnrnWindow → Preferences → Android → Launch 設置了sdcard文件。rnrn
unable to open file "xx.obj"
这个问题怎么处理?如果已知文件在C:\bcb\目录下
Unable to open file 'SYSINIT.OBJ'
怎么这种错也有?路径都是对的呀.
解决error: Unable to find vcvarsall.bat
解决 error: Unable to <em>find</em> vcvarsall.bat 配置文件。 安装vs后,根据vs版本修改VS90COMNTOOLS对应的数字(我安装的是vs2013),安装了vs2013,测试不同的机子上使用配置文件解决问题
unable to find full path for g++
小的想在ubentu虚拟机下装个eclipse来编c++,装了eclipse,然后我把cdt解压了,把plugin和features的文件夹内容也拷到eclipse下同名文件夹了。新建project就可以看到c++,但是建不了,报错<em>unable</em> to <em>find</em> full path for g++。各位大哥如何解决。有没有方法能够让我在linux下使用eclipse编c++。菜鸟,分不多。望各位大哥海涵!~
unable to find script library'/ajaxcallobject.js
<em>unable</em> to <em>find</em> script library'/ajaxcallobject.js'.Copy the <em>file</em> to the required location,or change the 'scriptPath' setting at magicAjax section of web.configrnrnrn跪求,网上找的怎么也都不行。。rnrnrn之前编译完放到服务器上面,不会跳出这个提示。现在怎么变成会了。郁闷!!!
Unable to find record.No key specified.
在delphi7+sql2000中,用TSimpleDataSet时,设置PacketRecord值为100,使用ApplyUpdates(0)这个语句更新数据库时,第一次更新总是出现Unable to <em>find</em> record.No key specified.但是第二次或以后的更新不会出现,而且数据成功更新回数据库。但把PacketRecord设为默认值也就是-1时,就不会出现上述问题,各位大哥大姐,帮帮忙!
Unable to find parent packages struts-dufaut
Unable to <em>find</em> parent packages struts-dufaut这个错误如何解决?新手 谢谢
Unable to find a javac compiler
我在用myeclipse webbrowser看http://localhost:8080/JavaWebTest/的时候,会出下面的提示rnHTTP Status 500 - rnrn--------------------------------------------------------------------------------rnrntype Exception reportrnrnmessage rnrndescription The server encountered an internal error () that prevented it from fulfilling this request.rnrnexception rnrnorg.apache.jasper.JasperException: Unable to compile class for JSPrn org.apache.jasper.compiler.DefaultErrorHandler.javacError(DefaultErrorHandler.java:97)rn org.apache.jasper.compiler.ErrorDispatcher.javacError(ErrorDispatcher.java:346)rn org.apache.jasper.compiler.Compiler.generateClass(Compiler.java:414)rn org.apache.jasper.compiler.Compiler.compile(Compiler.java:472)rn org.apache.jasper.compiler.Compiler.compile(Compiler.java:451)rn org.apache.jasper.compiler.Compiler.compile(Compiler.java:439)rn org.apache.jasper.JspCompilationContext.compile(JspCompilationContext.java:511)rn org.apache.jasper.servlet.JspServletWrapper.service(JspServletWrapper.java:295)rn org.apache.jasper.servlet.JspServlet.serviceJspFile(JspServlet.java:292)rn org.apache.jasper.servlet.JspServlet.service(JspServlet.java:236)rn javax.servlet.http.HttpServlet.service(HttpServlet.java:802)rnrnrnroot cause rnrnUnable to <em>find</em> a javac compiler;rncom.sun.tools.javac.Main is not on the classpath.rnPerhaps JAVA_HOME does not point to the JDKrn org.apache.tools.ant.taskdefs.compilers.CompilerAdapterFactory.getCompiler(CompilerAdapterFactory.java:106)rn org.apache.tools.ant.taskdefs.Javac.compile(Javac.java:935)rn org.apache.tools.ant.taskdefs.Javac.execute(Javac.java:764)rn org.apache.jasper.compiler.Compiler.generateClass(Compiler.java:382)rn org.apache.jasper.compiler.Compiler.compile(Compiler.java:472)rn org.apache.jasper.compiler.Compiler.compile(Compiler.java:451)rn org.apache.jasper.compiler.Compiler.compile(Compiler.java:439)rn org.apache.jasper.JspCompilationContext.compile(JspCompilationContext.java:511)rn org.apache.jasper.servlet.JspServletWrapper.service(JspServletWrapper.java:295)rn org.apache.jasper.servlet.JspServlet.serviceJspFile(JspServlet.java:292)rn org.apache.jasper.servlet.JspServlet.service(JspServlet.java:236)rn javax.servlet.http.HttpServlet.service(HttpServlet.java:802)rnrnrnnote The full stack trace of the root cause is available in the Apache Tomcat/5.0.28 logs.rnrn请问是什么问题?JAVA_HOME设成 D:\Program Files\Java\;D:\Program Files\Java\jdk1.5.0_09\对不对?
Unable to find a value 问题
情况如下:rnrn[code=HTML]rnrn rn rn rn rn rn rn rn rn rn rn rn rn rn rn rn[/code]rnrn添加进数据库时候,各个字段都允许为空,结果数据库里面是空的,但是取出来的时候。放到了List里面。现在就出错了。rnUnable to <em>find</em> a value for "CertorDegree" in object of class "vo.<em>file</em>.TFileTraining" using operator "[]"rnrn请问怎样处理这个……
Unable to find parent packages jfreechart-default
Tomcat,SSH项目(用的Struts2,Jfreechart)rn程序出现Unable to <em>find</em> parent packages jfreechart-default这个错误,怎么解决?
Unable to find 'struts.multipart.saveDir' property setting.
我明明加了这个文件,而且该文件内容如下:rnstruts.multipart.saveDir =/imgrn但还是老报上面的信息,到底是怎么回事,rn注:这是我用struts上传图片的出现的问题;
unable to find a version of runtime
.net2.0 windows2000 WinForm提示这样的错误。怎么办啊,
python find file and del
python <em>find</em> <em>file</em> and del
Could not find the file csq.h
我是菜鸟,最近新学驱动开发,我的开发环境是XP SP3 ,Windows DDK 2600 , DriverStudio3.2 编译器是VC6.0英文原版。编译VdwLibs.dsw全部通过,没有出现什么提示。我编译了HelloWdm.dsw :rn--------------------Configuration: HelloWdm - Win32 Checked--------------------rnC:\PROGRA~1\Compuware\DriverStudio\DriverWorks\Include\kcsq.h(35): Could not <em>find</em> the <em>file</em> csq.h.rnC:\PROGRA~1\Compuware\DriverStudio\DriverWorks\Include\kcsq.h(35): Could not <em>find</em> the <em>file</em> csq.h.rnrnHelloWdm.sys - 0 error(s), 0 warning(s)rn通过,生成HelloWdm.sys。但提示找不到Csq.hrnrnHelloApp也顺利通过。rn运行出错,错误代码:rn2010-05-10 10:50 110,592 HelloApp.exern2010-05-10 10:50 183,296 helloapp.idbrn2010-05-10 10:50 396,172 HelloApp.ilkrn2010-05-10 10:50 71,019 HelloApp.objrn2010-05-10 10:50 3,047,120 HelloApp.pchrn2010-05-10 10:50 872,448 helloapp.pdbrn2010-05-10 22:23 60,544 HelloWdm.sysrn2010-05-10 10:50 94,333 OpenByIntf.objrn 8 个文件 4,835,524 字节rn 2 个目录 5,202,845,696 可用字节rnrnC:\Program Files\Compuware\DriverStudio\DriverWorks\Examples\wdm\hellowdm\exe\obrnjchk\i386>helloapprnFailed to open device, code = 259rn望高手解答!rn
SP2-0310: unable to open file "comm_sess_users.sql"
好久没来问问题了rn 今天遇到个问题rnshutdown immediate 不掉rnalert下rnrnSHUTDOWN: Active processes prevent shutdown operationrn rn想查下sessionrnrnSQL> rn@comm_sess_users;rnSP2-0310: <em>unable</em> to open <em>file</em> "comm_sess_users.sql"rn rnrn结果 求comm_sess_user.sqlrnrn正常情况应该是这样的吧rnrnSQL> @comm_sess_users; --查看当前连接的session rnnstance SID Serial ID Status Oracle User O/S User O/S PID Session Program Terminal Machine rn--------- ------ --------- --------- -------------- ------------ --------------- -------------------------- ---------- ------------------- rnorcl 125 5 ACTIVE SYS oracle 4069 sqlplus@linux3.orasrv.com rn rn
为什么Unable to open file 'XPMENU22.LIB'
我找了个程序,里面用到了XPMENU22控件,在这之前我的bcb6安装过xp控件,现在编译这个程序总是报Unable to open <em>file</em> 'XPMENU22.LIB'错。我将程序中的xp控件删除,错误依然,请问这是怎么回事,怎么解决?
SP2-0310: unable to open file "spcreate.sql"
SQL> @spcreate rnSP2-0310: <em>unable</em> to open <em>file</em> "spcreate.sql"rnrnrn请教各位,这个是什么问题
unable to load file from(...web.xml....)
我把已经做好的一个工程,拷到另一台机器上,用JBuilder打开编译时就会提示:<em>unable</em> to load <em>file</em> from(...web.xml....)和java.sun.com 到底是什么原因啊?整了一天都没有找到原因
新手:Unable to open file 'PROJECT1.OBJ'
刚装了C++ Builder 6.0 中文版rnrn在D盘某个目录下新建一个工程,在生成或建立project1.exe时出现下面错误:rnrn[Linker Fatal Error] Fatal: Unable to open <em>file</em> 'PROJECT1.OBJ'rnrn然后我导出.MAK文件,在DOS下用"bcc32 -fproject1.mak"运行成功。再在IDE里rnrn生成也OK。rnrn接着再把已经生成的project1.obj删除,在IDE里生成时又是上面的错误。rnrn但是如果在C:\Program Files\Borland\CBuilder6\Projects下新建工程则一切正常。rnrnrn困绕多时,请高手指点。rn
SP2-0310: unable to open file "mount.sql"
start mount;rnSP2-0310: <em>unable</em> to open <em>file</em> "mount.sql"rn这个错误怎么解决啊谁帮帮忙
sqlite unable to open database file
从sqlite取数据的时候发现问题:rn sqlite3_step返回码不是"SQLITE_ROW", retcode=14, errmsg=<em>unable</em> to open database <em>file</em>“。rn 在sqlite代码中有 :#define SQLITE_CANTOPEN 14 /* Unable to open the database <em>file</em> */rn但是把SQL语句放到SQLiteSpy.exe中进行查询时就没有数据库打不开的问题,而且程序只跑一部分的时候是没有问题,只有跑完真个过程才有相同的错误出现,错误出现在相同的数据库里相同的表里,而且由于程序跑一次要12小时也没有本地调试的机会,问下大家怎么解决rn系诶写
Unable to open include file 'corba.h'
我在编译CORBA服务端程序时,遇到Unable to open include <em>file</em> 'corba.h',请大虾帮忙!谢谢
Fatal: Unable to open file 'TMSC6PERS.LIB'
重装BCB6后, 编译以前的工程,出现这个错误,我用ultraedit打开bpr文件,删除出错对应的.lib,rn再打开工程时提示project rule not found. 工程中没有用到第三方控件,请问如何解决?
Unable to open file "C0X32.obj"再次出现!~
我在使用 Borland C++5.0后安装了VC++6.0,rn安装VC6.0后Borland C++5.0rn编译文件时出现提示rnUnable to open <em>file</em> "C0X32.obj"rn曾经重装BC++后,错误消了。rn最近使用时又出现同样问题,rn可见我并未找到根本原因。rnrn开始出现这个问题是在给别人rn录入一个最初级的演示输出HELLO的程序中,rn之后再编译曾经编译成功的Borland C++例子时rn也出现相同错误!rn我想可能是编译器本身的问题...rn因为我并未include特殊文件!rn是否必须再次重装BC?
Android:Unable to open stack file
### 问题描述rn我的程序使用get方法用api获取数据。log输出都很正常,但在输出到TextView时报错。rn### 报错如下rn06-11 11:20:35.692: E/dalvikvm(253): Unable to open stack trace <em>file</em> '/data/anr/traces.txt': Permission deniedrnrn### 代码如下rnrn```rngeturl="http://v1.itooi.cn/netease/search?keyword="+name.getText()+"&type=song&pagesize=1";rn new Thread(new Runnable() rn public void run() rn try rn URL url = new URL(geturl);rn HttpURLConnection connection = (HttpURLConnection) url.openConnection();//开启连接rn connection.connect();//连接服务器rnrn if (connection.getResponseCode() == 200) rn //使用字符流形式进行回复rn InputStream is = connection.getInputStream();rn //读取信息BufferReaderrn BufferedReader reader = new BufferedReader(new InputStreamReader(is));rn StringBuffer buffer = new StringBuffer();rn String readLine = "";rn while ((readLine = reader.readLine()) != null) rn buffer.append(readLine);rn rn is.close();rn reader.close();rn connection.disconnect();rn res=buffer.toString();rn Log.d("Msg", res);rn rn rest.setText(res);rn rn catch (MalformedURLException e) rn e.printStackTrace();rn catch (IOException e) rn e.printStackTrace();rn rn rn```rn(请不要在意括号匹配,重点看“rest.setText(res);”,我注释掉这句就没错了,这句什么问题?)
wince 6.0 could not find file
rnmakeimg: run command: romimage D:\WINCE600\OSDesigns\mini8510\mini8510\RelDir\mini8510_ARMV4I_Release\ce.bibrnrnWindows CE ROM Image Builder v4.0.000 Copyright (c) Microsoft CorporationrnBuilt: Jul 25 2006 16:36:51rnrnQ flag encountered, adding module k.fatutil.dllrnQ flag encountered, adding module k.toolhelp.dllrnQ flag encountered, adding module k.prnport.dllrnQ flag encountered, adding module k.prnerr.dllrnQ flag encountered, adding module k.ws2.dllrnQ flag encountered, adding module k.wspm.dllrnQ flag encountered, adding module k.nspm.dllrnQ flag encountered, adding module k.ssllsp.dllrnQ flag encountered, adding module k.schannel.dllrnQ flag encountered, adding module k.dhcpsrv.dllrnQ flag encountered, adding module k.mmtimer.dllrnQ flag encountered, adding module k.secur32.dllrnQ flag encountered, adding module k.msasn1.dllrnQ flag encountered, adding module k.crypt32.dllrnQ flag encountered, adding module k.winsock.dllrnQ flag encountered, adding module k.spnego.dllrnQ flag encountered, adding module k.ceddk.dllrnError: Could not <em>find</em> <em>file</em> 'D:\WINCE600\OSDesigns\mini8510\mini8510\RelDir\mini8510_ARMV4I_Release\camera_digital.dll' on diskrncamera_digital.dll D:\WINCE600\OSDesigns\mini8510\mini8510\RelDir\mini8510_ARMV4I_Release\camera_digital.dll NK SHK rnrnError: failed setting linernmakeimg: FATAL ERROR: Command returned non-zero exit code 1 (dec).rnmakeimg: FATAL ERROR: Command returned non-zero exit code 1 (dec).rn请高手帮忙解决。本人菜鸟,拷来一个开发板自带的bsp来自己编译,结果出现以上问题,亟盼高手指点
Cannot find or open the PDB file?
Cannot <em>find</em> or open the PDB <em>file</em>?rn程序代码:rn#include rnrnLRESULT CALLBACK WndProc(HWND, UINT, WPARAM, LPARAM);rnrnint WINAPI WinMain(HINSTANCE hInstance, HINSTANCE hPrevInstance, PSTR iCmdLine, int iCmdShow)rnrn static TCHAR szAppName[] = TEXT("Draw a point!");rn HWND hwnd;rn MSG msg;rn WNDCLASS wndclass;rnrn wndclass.style = CS_HREDRAW | CS_VREDRAW;rn wndclass.lpfnWndProc = WndProc;rn wndclass.cbClsExtra = 0;rn wndclass.cbWndExtra = 0;rn wndclass.hbrBackground = (HBRUSH)GetStockObject(WHITE_BRUSH);rn wndclass.hInstance = hInstance;rn wndclass.hCursor = LoadCursor(NULL, IDC_ARROW);rn wndclass.hIcon = LoadIcon(NULL, IDI_APPLICATION);rn wndclass.lpszClassName = szAppName;rn wndclass.lpszMenuName = NULL;rnrn if (!RegisterClass(&wndclass))rn rn MessageBox(NULL, TEXT("This program requires windows NT!"), szAppName, MB_ICONERROR);rn return 0;rn rnrn hwnd = CreateWindow (szAppName, TEXT("One Point"), WS_OVERLAPPEDWINDOW, CW_USEDEFAULT,rn CW_USEDEFAULT, CW_USEDEFAULT, CW_USEDEFAULT, NULL, NULL, hInstance, NULL);rnrn if(hwnd == NULL)rn rn MessageBox(NULL, TEXT("No more memory for CreateWindow!"), szAppName, MB_ICONERROR);rn return 0;rn rnrn ShowWindow(hwnd, iCmdShow);rn UpdateWindow(hwnd);rnrn while (GetMessage(&msg, NULL, 0, 0))rn rn TranslateMessage(&msg);rn DispatchMessage(&msg);rn rnrn return msg.wParam;rnrnrnLRESULT CALLBACK WndProc(HWND hwnd, UINT message, WPARAM wParam, LPARAM lParam)rnrn static int cxClient, cyClient;rn HDC hdc;rn PAINTSTRUCT ps;rn int i;rnrn switch (message)rn rn case WM_CREATE:rn cxClient = LOWORD(lParam);rn cyClient = HIWORD(lParam);rn return 0;rn case WM_PAINT:rn hdc = BeginPaint(hwnd, &ps);rn MoveToEx(hdc, 0, cyClient/2, NULL);rn LineTo(hdc,cxClient, cyClient/2);rn MoveToEx(hdc, cxClient/2, 0, NULL);rn LineTo(hdc, cxClient/2, cyClient);rn EndPaint(hwnd,&ps);rn case WM_DESTROY:rn PostQuitMessage(0);rn return 0;rn rn return DefWindowProc(hwnd, message, wParam, lParam);rnrnrn这个是画个十字交叉的两条直线的程序,运行后屏幕一闪而过?rn“画点004.exe”: 已加载“D:\project\C++\画点004\Debug\画点004.exe”,已加载符号。rn“画点004.exe”: 已加载“C:\WINDOWS\system32\ntdll.dll”,Cannot <em>find</em> or open the PDB <em>file</em>rn“画点004.exe”: 已加载“C:\WINDOWS\system32\kernel32.dll”,Cannot <em>find</em> or open the PDB <em>file</em>rn“画点004.exe”: 已加载“C:\WINDOWS\system32\user32.dll”,Cannot <em>find</em> or open the PDB <em>file</em>rn“画点004.exe”: 已加载“C:\WINDOWS\system32\gdi32.dll”,Cannot <em>find</em> or open the PDB <em>file</em>rn“画点004.exe”: 已加载“C:\WINDOWS\system32\msvcr100d.dll”,已加载符号。rn“画点004.exe”: 已加载“C:\WINDOWS\system32\imm32.dll”,Cannot <em>find</em> or open the PDB <em>file</em>rn“画点004.exe”: 已加载“C:\WINDOWS\system32\advapi32.dll”,Cannot <em>find</em> or open the PDB <em>file</em>rn“画点004.exe”: 已加载“C:\WINDOWS\system32\rpcrt4.dll”,Cannot <em>find</em> or open the PDB <em>file</em>rn“画点004.exe”: 已加载“C:\WINDOWS\system32\secur32.dll”,Cannot <em>find</em> or open the PDB <em>file</em>rn“画点004.exe”: 已加载“C:\WINDOWS\system32\lpk.dll”,Cannot <em>find</em> or open the PDB <em>file</em>rn“画点004.exe”: 已加载“C:\WINDOWS\system32\usp10.dll”,Cannot <em>find</em> or open the PDB <em>file</em>rn“画点004.exe”: 已加载“C:\WINDOWS\system32\uxtheme.dll”,Cannot <em>find</em> or open the PDB <em>file</em>rn“画点004.exe”: 已加载“C:\WINDOWS\system32\msvcrt.dll”,Cannot <em>find</em> or open the PDB <em>file</em>rn“画点004.exe”: 已加载“C:\Program Files\360\360Safe\safemon\safemon.dll”,Cannot <em>find</em> or open the PDB <em>file</em>rn“画点004.exe”: 已加载“C:\WINDOWS\system32\shell32.dll”,Cannot <em>find</em> or open the PDB <em>file</em>rn“画点004.exe”: 已加载“C:\WINDOWS\system32\shlwapi.dll”,Cannot <em>find</em> or open the PDB <em>file</em>rn“画点004.exe”: 已加载“C:\WINDOWS\system32\ole32.dll”,Cannot <em>find</em> or open the PDB <em>file</em>rn“画点004.exe”: 已加载“C:\WINDOWS\system32\oleaut32.dll”,Cannot <em>find</em> or open the PDB <em>file</em>rn“画点004.exe”: 已加载“C:\WINDOWS\system32\msvcp60.dll”,Cannot <em>find</em> or open the PDB <em>file</em>rn“画点004.exe”: 已加载“C:\WINDOWS\system32\wininet.dll”,Cannot <em>find</em> or open the PDB <em>file</em>rn“画点004.exe”: 已加载“C:\WINDOWS\system32\crypt32.dll”,Cannot <em>find</em> or open the PDB <em>file</em>rn“画点004.exe”: 已加载“C:\WINDOWS\system32\msasn1.dll”,Cannot <em>find</em> or open the PDB <em>file</em>rn“画点004.exe”: 已加载“C:\WINDOWS\system32\psapi.dll”,Cannot <em>find</em> or open the PDB <em>file</em>rn“画点004.exe”: 已加载“C:\WINDOWS\system32\ws2_32.dll”,Cannot <em>find</em> or open the PDB <em>file</em>rn“画点004.exe”: 已加载“C:\WINDOWS\system32\ws2help.dll”,Cannot <em>find</em> or open the PDB <em>file</em>rn“画点004.exe”: 已加载“C:\WINDOWS\system32\version.dll”,Cannot <em>find</em> or open the PDB <em>file</em>rn“画点004.exe”: 已加载“C:\WINDOWS\WinSxS\x86_Microsoft.Windows.Common-Controls_6595b64144ccf1df_6.0.2600.6028_x-ww_61e65202\comctl32.dll”,Cannot <em>find</em> or open the PDB <em>file</em>rn“画点004.exe”: 已加载“C:\WINDOWS\system32\comctl32.dll”,Cannot <em>find</em> or open the PDB <em>file</em>rn“画点004.exe”: 已加载“C:\WINDOWS\system32\MSCTF.dll”,Cannot <em>find</em> or open the PDB <em>file</em>rn“画点004.exe”: 已加载“C:\WINDOWS\system32\msctfime.ime”,Cannot <em>find</em> or open the PDB <em>file</em>rn程序“[3320] 画点004.exe: 本机”已退出,返回值为 0 (0x0)。rn什么原因,怎么弄。
the system cannot find the file specified
文件上传到服务器,提示成功,但去删除的时候却提示:the system cannot <em>find</em> the <em>file</em> specified。rn我的ftp权限是最高权限。
selenium报错Unable to find element on closed window
selenium集成webdriver开发,提示错误:rnorg.openqa.selenium.NoSuchWindowException: Unable to <em>find</em> element on closed windowrn但是实际上我的浏览器并未关闭,所做的操作是更新了地址栏中的url地址,rnrn在网上搜索到有人说是IE11的问题,换做firefox可以修复问题,但问题是我必须用IE11,哪位大牛能帮忙解答下,不胜感激。rnrn代码如下:rnrnWebDriver driver = new InternetExplorerDriver(srvc);rn driver.navigate().to(Constraint.homepage);rn try rn Thread.sleep(3000);rn catch (InterruptedException e) rn e.printStackTrace(); rn rn driver.manage().timeouts().implicitlyWait(3000, TimeUnit.SECONDS);rn rn driver.navigate().to(Constraint.homepage_cn);rn try rn Thread.sleep(3000);rn catch (InterruptedException e) rn e.printStackTrace(); rn rn //driver.manage().window().maximize(); rn driver.manage().timeouts().implicitlyWait(3000, TimeUnit.SECONDS);rn WebElement txtbox = driver.<em>find</em>Element(By.xpath("/html/body/div/div[2]/a[2]"));rn txtbox.click();rn
关于unable to find setter method for attribute的问题
自定义tag,rn经常出现<em>unable</em> to <em>find</em> setter method for attribute:自定义属性名rn因为以前多刷新几遍就莫名其妙的好了,所以一直以为是缓存问题。rn但现在重启Tomcat, 重启MyEclipse,重启系统,清理缓存,清理临时文件,连注册表都清理,连TomCat能清理的都清理还是没用。rn最后无奈重新定义了几个,还是不能用,在准备放弃前意外的发现之前不能用的几个莫名其妙的正常了,不报错了。rn此问题出现过多次,要么是定义新属性,之前属性便正常了。要么重启Tomcat,就正常,总是现在发生过这种事情的,没有一个是修改过代码才能正常使用的。rnrn[color=#FF0000]求指教,此问题原因为何?[/color]rnrn不可能是重名,名称大小写,没有set方法什么的问题,百度、google只要有关的都看过,没一个能说出个所以然来,不然已正常使用的自定义属性名无法解释。就算是百度到,最后也说问题已解决,非楼上讨论,完了。居然完了!你倒是说说怎么解决的啊,神马原因引起的啊,我就是想知道为什么啊!rnrn[color=#FF0000]所以,求指导,此问题为何?[/color]
菜鸟一问:Unable to find package import?
小弟重装Win2000后装BCB6,可是在打开先前的一个项目,在保存时会弹出一个对话框,上面信息如下:rnrn  Unable to <em>find</em> package import: dclusr.bpirnrn  这行文字下是一个文本框,要求提供dclusr.bpi的路径,可是我找不到这个文件,为什么会这样?以前我在开发这个项目时曾经装过一个XPMenu控件(在工具栏上出现却用不了),会不会是这个问题?我装了BCB Update1。
j-tag连接时,显示unable to find target
提示的是:<em>unable</em> to <em>find</em> target. Please make sure that the hardware is properly connected and powered up. .....rnrn我的配置应该是正确的啊:rn TMS: Pin3 D1rn TCK: D0rn TD1: D6rn TD0: P13rn nTRST:D2rn nSRST:norn不知道是怎么回事儿,求人指点!!
编译时问题 unable to find package import dciindy60.bpi
C++builder6.0安装好后,测试环境,仅编译一个表单,提示 <em>unable</em> to <em>find</em> package import dciindy60.bpi,然后我点击取消又出现<em>unable</em> to <em>find</em> package import indy60.bpi,又点了取消。最后下边提示错误信息:[Linker Fatal Error] Fatal: Unable to open <em>file</em> 'DCLINDY60.BPI'。难道我的C++builder安装出问题了吗?多谢指点
unable to find package import : dclusr.bpi 求助
我把程序拷到另一台电脑运行编译就提示这个,让我去找这个包rn<em>unable</em> to <em>find</em> package import : dclusr.bpirn急求~~
unable to find a version of the runtime to run this application
做了一个C#窗体的程序,包含数据库连接的...现在生成了exe文件,把它放到其他电脑上运行,提示是先说要安装.net framework4.0rn,装了之后又提示标题这串话,请问要怎么解决呢....安了vs的电脑却是可以正常运行执行文件的...rnrn求高人指点啊
unable to find static libary:skinpackD2006.lib如何处理?
<em>unable</em> to <em>find</em> static libary:skinpackD2006.lib如何处理?rnrnrnrn运行项目时弹出一个窗口提示添加static libary,可是在安装目录下找不skinpackD2006.lib这个文件,单击取消按钮后,编译提示[C++ Error] hushizhan.cpp(137): E2451 Undefined symbol 'exception',错误码定位在(项目.cpp)中rnrncatch (Exception &exception)rn rn Application->ShowException(&exception);rn rnrn程序运行不了,请各位大虾们帮助解决一下;rn
tomcat报错Unable to find 'struts multipart saveDir解决
tomcat报错Unable to <em>find</em> 'struts multipart saveDir解决
Unable to find manifest signing certificate in the certificate store
Unable to <em>find</em> manifest signing certificate in the certificate store
求解!org.xml.sax.SAXException: unable to find FieldDescriptor for 'skinmodule-entr
[2010-05-14 10:56:14 ERROR] - RegistryService: Could not unmarshal: F:\workspace\.metadata\.plugins\org.eclipse.wst.server.core\tmp0\wtpwebapps\nsportal\WEB-INF\conf\skinmodules.xregrnorg.xml.sax.SAXException: <em>unable</em> to <em>find</em> FieldDescriptor for 'skinmodule-entry' in ClassDescriptor of registryrn at org.exolab.castor.xml.UnmarshalHandler.startElement(UnmarshalHandler.java:767)rn at org.exolab.castor.xml.util.DOMEventProducer.process(DOMEventProducer.java:245)rn at org.exolab.castor.xml.util.DOMEventProducer.process(DOMEventProducer.java:182)rn at org.exolab.castor.xml.util.DOMEventProducer.processChildren(DOMEventProducer.java:333)rn at org.exolab.castor.xml.util.DOMEventProducer.process(DOMEventProducer.java:247)rn at org.exolab.castor.xml.util.DOMEventProducer.process(DOMEventProducer.java:182)rn at org.exolab.castor.xml.util.DOMEventProducer.processChildren(DOMEventProducer.java:333)rn at org.exolab.castor.xml.util.DOMEventProducer.process(DOMEventProducer.java:134)rn at org.exolab.castor.xml.util.DOMEventProducer.process(DOMEventProducer.java:170)rn at org.exolab.castor.xml.util.DOMEventProducer.start(DOMEventProducer.java:110)rn at org.exolab.castor.xml.Unmarshaller.unmarshal(Unmarshaller.java:290)rn at org.exolab.castor.xml.Unmarshaller.unmarshal(Unmarshaller.java:374)rn at org.apache.jetspeed.services.registry.CastorRegistryService.loadFragment(CastorRegistryService.java:550)rn at org.apache.jetspeed.services.registry.RegistryWatcher.<em>find</em>Files(RegistryWatcher.java:249)rn at org.apache.jetspeed.services.registry.RegistryWatcher.changeBase(RegistryWatcher.java:214)rn at org.apache.jetspeed.services.registry.CastorRegistryService.init(CastorRegistryService.java:429)rn at org.apache.turbine.services.TurbineBaseService.init(TurbineBaseService.java:108)rn at org.apache.turbine.services.BaseInitableBroker.initClass(BaseInitableBroker.java:149)rn at org.apache.turbine.services.BaseServiceBroker.doInitService(BaseServiceBroker.java:224)rn at org.apache.turbine.services.BaseServiceBroker.initServices(BaseServiceBroker.java:193)rn at org.apache.turbine.Turbine.init(Turbine.java:259)rn at javax.servlet.GenericServlet.init(GenericServlet.java:212)rn at org.apache.catalina.core.StandardWrapper.loadServlet(StandardWrapper.java:1139)rn at org.apache.catalina.core.StandardWrapper.load(StandardWrapper.java:966)rn at org.apache.catalina.core.StandardContext.loadOnStartup(StandardContext.java:3996)rn at org.apache.catalina.core.StandardContext.start(StandardContext.java:4266)rn at org.apache.catalina.core.ContainerBase.start(ContainerBase.java:1014)rn at org.apache.catalina.core.StandardHost.start(StandardHost.java:736)rn at org.apache.catalina.core.ContainerBase.start(ContainerBase.java:1014)rn at org.apache.catalina.core.StandardEngine.start(StandardEngine.java:443)rn at org.apache.catalina.core.StandardService.start(StandardService.java:448)rn at org.apache.catalina.core.StandardServer.start(StandardServer.java:700)rn at org.apache.catalina.startup.Catalina.start(Catalina.java:552)rn at sun.reflect.NativeMethodAccessorImpl.invoke0(Native Method)rn at sun.reflect.NativeMethodAccessorImpl.invoke(Unknown Source)rn at sun.reflect.DelegatingMethodAccessorImpl.invoke(Unknown Source)rn at java.lang.reflect.Method.invoke(Unknown Source)rn at org.apache.catalina.startup.Bootstrap.start(Bootstrap.java:295)rn at org.apache.catalina.startup.Bootstrap.main(Bootstrap.java:433)
NoServerForRegionException: Unable to find region for blog_dest,,99999999999999
我在执行hbase官方说明中的一个例子,是用mapreduce连接hbase进行数据读写的一个程序。报了以下错误:rnException in thread "main" java.lang.RuntimeException: org.apache.hadoop.hbase.client.NoServerForRegionException: Unable to <em>find</em> region for blog_dest,,99999999999999 after 14 tries.rn at org.apache.hadoop.hbase.mapreduce.TableOutputFormat.setConf(TableOutputFormat.java:206)rn at org.apache.hadoop.util.ReflectionUtils.setConf(ReflectionUtils.java:73)rn at org.apache.hadoop.util.ReflectionUtils.newInstance(ReflectionUtils.java:133)rn at org.apache.hadoop.mapreduce.JobSubmitter.checkSpecs(JobSubmitter.java:453)rn at org.apache.hadoop.mapreduce.JobSubmitter.submitJobInternal(JobSubmitter.java:342)rn at org.apache.hadoop.mapreduce.Job$10.run(Job.java:1268)rn at org.apache.hadoop.mapreduce.Job$10.run(Job.java:1265)rn at java.security.AccessController.doPrivileged(Native Method)rn at javax.security.auth.Subject.doAs(Subject.java:396)rn at org.apache.hadoop.security.UserGroupInformation.doAs(UserGroupInformation.java:1491)rn at org.apache.hadoop.mapreduce.Job.submit(Job.java:1265)rn at org.apache.hadoop.mapreduce.Job.waitForCompletion(Job.java:1286)rn at com.FindFriend.main(FindFriend.java:80)rn at sun.reflect.NativeMethodAccessorImpl.invoke0(Native Method)rn at sun.reflect.NativeMethodAccessorImpl.invoke(NativeMethodAccessorImpl.java:39)rn at sun.reflect.DelegatingMethodAccessorImpl.invoke(DelegatingMethodAccessorImpl.java:25)rn at java.lang.reflect.Method.invoke(Method.java:597)rn at org.apache.hadoop.util.RunJar.main(RunJar.java:212)rnCaused by: org.apache.hadoop.hbase.client.NoServerForRegionException: Unable to <em>find</em> region for blog_dest,,99999999999999 after 14 tries.rn at org.apache.hadoop.hbase.client.HConnectionManager$HConnectionImplementation.locateRegionInMeta(HConnectionManager.java:1092)rn at org.apache.hadoop.hbase.client.HConnectionManager$HConnectionImplementation.locateRegion(HConnectionManager.java:997)rn at org.apache.hadoop.hbase.client.HConnectionManager$HConnectionImplementation.locateRegionInMeta(HConnectionManager.java:1099)rn at org.apache.hadoop.hbase.client.HConnectionManager$HConnectionImplementation.locateRegion(HConnectionManager.java:1001)rn at org.apache.hadoop.hbase.client.HConnectionManager$HConnectionImplementation.locateRegion(HConnectionManager.java:958)rn at org.apache.hadoop.hbase.client.HTable.finishSetup(HTable.java:251)rn at org.apache.hadoop.hbase.client.HTable.(HTable.java:155)rn at org.apache.hadoop.hbase.client.HTable.(HTable.java:129)rn at org.apache.hadoop.hbase.mapreduce.TableOutputFormat.setConf(TableOutputFormat.java:201)rnrnrn求大神指点
struts2 配置文件 Unable to find parent packages
以下是我的struts2的配置文件:rnstruts.xmlrnrnrnrnrnrn rn rn rn rn rn rn rnrnrnrnrnstruts-default.xnlrnrnrnrnrnrn rnrnrnrn请问以上配置有问题吗?为什么启动服务器的时候老是提示rnUnable to <em>find</em> parent packages default
CXF环境变量设置出现Unable to find cxf-manifest.jar
我的环境变量设置如下rnCXF_HOME=C:\JavaPath\apache-cxf-2.7.8;rnPATH=C:\JavaPath\apache-cxf-2.7.8\bin;rnCLASSPATH=C:\JavaPath\apache-cxf-2.7.8\lib;rnjava环境变量是好的,部署在C:\Program Files\Java\jdk1.6.0_30\jre;下。rn在cmd窗口输入wsdl2java命令,出现Unable to <em>find</em> cxf-manifest.jar in cxf_home\lib 的错误,但是在lib中的的确确是有cxf-manifest.jar文件的。rn尝试了用jdk1.7也无法解决这个问题rn跪求高人啊!
cannot find win.com,unable to continue windows.
98系统,开机提示 cannot <em>find</em> win.com,<em>unable</em> to continue windows. 怎么处理啊?
IIS7 访问MemoryMappedFile, Unable to find the specified file.
我在本地跑了一个Console程序, 并用MemoryMappedFile在内存里写了一个“HelloHere"的值。rn[code=csharp]rnconst MemoryMappedFileRights allRequiredRights = (MemoryMappedFileRights)((int)MemoryMappedFileRights.FullControl | 16);rnrnvar security = new MemoryMappedFileSecurity();rnrnsecurity.AddAccessRule(new AccessRule(new SecurityIdentifier(WellKnownSidType.WorldSid, null), allRequiredRights, AccessControlType.Allow));rnrnMemoryMappedFile.CreateNew("HelloHere", 1000, MemoryMappedFileAccess.ReadWriteExecute, MemoryMappedFileOptions.None, security, HandleInheritability.Inheritable);rn[/code]rnrn然后我建了另外一个MVC工程rn[code=csharp]rnpublic ActionResult Index()rnrn tryrn rn var a = MemoryMappedFile.OpenExisting("HelloLoren");rn rn catch (Exception ex)rn rn rnrn[/code]rnrn我直接运行这个MVC程序,a = MemoryMappedFile.OpenExisting("HelloHere"); 这句代码是能得到值的。但我把MVC程序发布到IIS,然后通过IIS去访问网站,这句代码就报异常了,说是Unable to <em>find</em> the specified <em>file</em>.rn我的IIS版本是7.5,操作系统为win7。rnrn我把同样的代码拿到xp上去运行,IIS版本为5, 却能正常运行。rn有人知道是为什么吗? IIS7.5没有权限还是其他缘故。 多谢各位。
请教boa:cgi_header: unable to find LFLF
比较郁闷的问题:rn通过查看error_log,会现现说是cgi_header: <em>unable</em> to <em>find</em> LFLFrn有两个cgi程序:rnmain.cgi       main_store.cgirn两个cgi程序内均有puts("Content-Type:text/html;charset=gb2312\n\n");rnrn在由*.html跳转至main.cgi时,一切正常,但在main.cgi跳转至main_store.cgi时,就会出现上述错误,郁闷rn我把关键的地方,boa源码中的buf打到error_log中去,发现第一次跳的时候,error_log中记录正常,是第一个网页的内容rn如test:Content-Type:text/html; charset=gb2312 (注:"test:"是我在源码中加上去的)rnrn但是第二次跳的时候,就会变成test: (注:后面什么都没有,这样找"\n\n",应该就找不到了)rnrn不知道是为何,高手如果有经验的话,请赐教,非常感谢
C#,SqlConnection出错Unable to find an entry point
public void run()rn rn string conn_str = "server=MSSQLSERVER01;uid=sunny;pwd=sunnyhoney";rn sqlconn = new SqlConnection(conn_str);rn sqlconn.Open();rn rnrnsqlconn是SqlConnection类,报了个System.EntryPointNotFoundException:“Unable to <em>find</em> an entry point named 'PAL_LocalAlloc' in DLL 'dbnetlib.dll'.”的错在sqlconn.Open()rnSqlClient类是添加引用放进去的,原本没有,是不是有什么东西没装完整
cannot find win.com,unable to continue windows
98系统,开机提示 cannot <em>find</em> win.com,<em>unable</em> to continue windows. 怎么处理啊?
make menuconfig 提示 Unable to find the ncurses ......
详细描述:rn1、公司电脑不能上网,我安装的是64位的Ubuntu 12.04 Desktop版。rn2、需要编译Linux内核,用“make menuconfig”来配置。rn3、ncurses 库及其依赖其实已经通过 dpkg -i xxx 的方式手动安装了。rn4、cd 到内核根目录,直接执行 make menuconfig 是可以的,有正常的配置界面。rn5、但是当我执行完环境变量的配置文件后,再执行 make menuconfig 就会出现以下提示:rn *** Unable to <em>find</em> the ncurses libraries or thern *** required header <em>file</em>s.rn *** 'make menuconfig' requires the ncurses libraries.rn *** rn *** Install ncurses (ncurses-devel) and try again.rn ***rnmake[1]: *** [scripts/kconfig/dochecklxdialog] 错误 1rnmake: *** [menuconfig] 错误 2rn6、我所使用的目标平台是imx6q,交叉编译工具链是 arm-poky-linux-gnueabi- 。rnrn执行环境变量的配置文件的命令:source /opt/poky/1.5.3/environment-setuprn而 environment-setup 的内容如下:rn[code=text]rnexport PATH=/opt/poky/1.5.3/sysroots/x86_64-pokysdk-linux/usr/bin:/opt/poky/1.5.3/sysroots/x86_64-pokysdk-linux/usr/bin/arm-poky-linux-gnueabi:$PATHrnexport PKG_CONFIG_SYSROOT_DIR=/opt/poky/1.5.3/sysroots/cortexa9hf-vfp-neon-poky-linux-gnueabirnexport PKG_CONFIG_PATH=/opt/poky/1.5.3/sysroots/cortexa9hf-vfp-neon-poky-linux-gnueabi/usr/lib/pkgconfigrnexport CONFIG_SITE=/opt/poky/1.5.3/site-config-cortexa9hf-vfp-neon-poky-linux-gnueabirnexport CC="arm-poky-linux-gnueabi-gcc -march=armv7-a -mthumb-interwork -mfloat-abi=hard -mfpu=neon -mtune=cortex-a9 --sysroot=/opt/poky/1.5.3/sysroots/cortexa9hf-vfp-neon-poky-linux-gnueabi"rnexport CXX="arm-poky-linux-gnueabi-g++ -march=armv7-a -mthumb-interwork -mfloat-abi=hard -mfpu=neon -mtune=cortex-a9 --sysroot=/opt/poky/1.5.3/sysroots/cortexa9hf-vfp-neon-poky-linux-gnueabi"rnexport CPP="arm-poky-linux-gnueabi-gcc -E -march=armv7-a -mthumb-interwork -mfloat-abi=hard -mfpu=neon -mtune=cortex-a9 --sysroot=/opt/poky/1.5.3/sysroots/cortexa9hf-vfp-neon-poky-linux-gnueabi"rnexport AS="arm-poky-linux-gnueabi-as "rnexport LD="arm-poky-linux-gnueabi-ld --sysroot=/opt/poky/1.5.3/sysroots/cortexa9hf-vfp-neon-poky-linux-gnueabi"rnexport GDB=arm-poky-linux-gnueabi-gdbrnexport STRIP=arm-poky-linux-gnueabi-striprnexport RANLIB=arm-poky-linux-gnueabi-ranlibrnexport OBJCOPY=arm-poky-linux-gnueabi-objcopyrnexport OBJDUMP=arm-poky-linux-gnueabi-objdumprnexport AR=arm-poky-linux-gnueabi-arrnexport NM=arm-poky-linux-gnueabi-nmrnexport M4=m4rnexport TARGET_PREFIX=arm-poky-linux-gnueabi-rnexport CONFIGURE_FLAGS="--target=arm-poky-linux-gnueabi --host=arm-poky-linux-gnueabi --build=x86_64-linux --with-libtool-sysroot=/opt/poky/1.5.3/sysroots/cortexa9hf-vfp-neon-poky-linux-gnueabi"rnexport CFLAGS=" -O2 -pipe -g -feliminate-unused-debug-types"rnexport CXXFLAGS=" -O2 -pipe -g -feliminate-unused-debug-types -fpermissive"rnexport LDFLAGS="-Wl,-O1 -Wl,--hash-style=gnu -Wl,--as-needed"rnexport CPPFLAGS=""rnexport OECORE_NATIVE_SYSROOT="/opt/poky/1.5.3/sysroots/x86_64-pokysdk-linux"rnexport OECORE_TARGET_SYSROOT="/opt/poky/1.5.3/sysroots/cortexa9hf-vfp-neon-poky-linux-gnueabi"rnexport OECORE_ACLOCAL_OPTS="-I /opt/poky/1.5.3/sysroots/x86_64-pokysdk-linux/usr/share/aclocal"rnexport OECORE_DISTRO_VERSION="1.5.3"rnexport OECORE_SDK_VERSION="1.5.3"rnexport PYTHONHOME=/opt/poky/1.5.3/sysroots/x86_64-pokysdk-linux/usrrnexport ARCH=armrnexport CROSS_COMPILE=arm-poky-linux-gnueabi-rnexport OE_QMAKE_CFLAGS="$CFLAGS"rnexport OE_QMAKE_CXXFLAGS="$CXXFLAGS"rnexport OE_QMAKE_LDFLAGS="$LDFLAGS"rnexport OE_QMAKE_CC=$CCrnexport OE_QMAKE_CXX=$CXXrnexport OE_QMAKE_LINK=$CXXrnexport OE_QMAKE_AR=$ARrnexport OE_QMAKE_LIBDIR_QT=/opt/poky/1.5.3/sysroots/cortexa9hf-vfp-neon-poky-linux-gnueabi//usr/librnexport OE_QMAKE_INCDIR_QT=/opt/poky/1.5.3/sysroots/cortexa9hf-vfp-neon-poky-linux-gnueabi//usr/include/qt4rnexport OE_QMAKE_MOC=/opt/poky/1.5.3/sysroots/x86_64-pokysdk-linux/usr/bin/moc4rnexport OE_QMAKE_UIC=/opt/poky/1.5.3/sysroots/x86_64-pokysdk-linux/usr/bin/uic4rnexport OE_QMAKE_UIC3=/opt/poky/1.5.3/sysroots/x86_64-pokysdk-linux/usr/bin/uic34rnexport OE_QMAKE_RCC=/opt/poky/1.5.3/sysroots/x86_64-pokysdk-linux/usr/bin/rcc4rnexport OE_QMAKE_QDBUSCPP2XML=/opt/poky/1.5.3/sysroots/x86_64-pokysdk-linux/usr/bin/qdbuscpp2xml4rnexport OE_QMAKE_QDBUSXML2CPP=/opt/poky/1.5.3/sysroots/x86_64-pokysdk-linux/usr/bin/qdbusxml2cpp4rnexport OE_QMAKE_QT_CONFIG=/opt/poky/1.5.3/sysroots/cortexa9hf-vfp-neon-poky-linux-gnueabi//usr/share/qt4/mkspecs/qconfig.prirnexport QMAKESPEC=/opt/poky/1.5.3/sysroots/cortexa9hf-vfp-neon-poky-linux-gnueabi//usr/share/qt4/mkspecs/linux-g++rnexport QT_CONF_PATH=/opt/poky/1.5.3/sysroots/x86_64-pokysdk-linux//etc/qt.confrn[/code]rnrn因为公司电脑不能上网,所以不能用 sudo apt-get install libncurses* 的方式安装,不知道是不是我手动安装不正确呢。rn大神路过麻烦帮我看看是怎么回事,谢谢!rn
大虾:Unable to find package import:dclusr.bpr
运行前出现"Unable to <em>find</em> package import:dclusr.bpr..."什么原因?
编译时unable to find package import xxx.bpi问题
我编译时就弹出<em>unable</em> to <em>find</em> package import xxx.bpi,但是我搜索了所有的文件(特别是bpr文件),都没有包含此bpi,不知道哪里包含了,哪位大侠麻烦告诉一下怎么去除,谢谢了!!!
Unable to find record. No key specified的问题
通过clientdataset的commandtext动态设置的sql,点击cxgrid的navigator的delete后applyupdate(-1)报错。rnrn怎么解决?网上搜过了,谁能详细说说
Lotus Notes的Unable to find path to server错误提示?????
当我用到Lotus Notes的邮件、日历、待办事宜时,会出现Unable to <em>find</em> path to server的提示,谁能告诉我什么原因么????
NVIDIA Visual Profiler5.5 unable to find nvprof
NVIDIA Visual Pro<em>file</em>r5.5 create new session时出现问题:<em>unable</em> to pro<em>file</em> application.org.eclipse.core.runtime.CoreException:<em>unable</em> to <em>find</em> nvprofrn请问是什么原因??
unable to find java class on classpath:servlet-class
在JB连接数据库时,出现这个错:rn找不着这org.apache.jasper.servlet.JspServlet.rn请问在哪儿添加servlet-class?classpath添加了无效rn
jni编译错误:Native registration unable to find class
跟着老罗的那个从内核驱动到上层的开发一直做到为上层提供jni接口这,就这在出了问题,哪位高手能帮个忙,告诉我问题出在哪里?都以及2天了rnrn03-02 22:35:34.677: I/Zygote(171): ...preloaded 379 resources in 3944ms.rn03-02 22:35:34.757: D/dalvikvm(171): GC_EXPLICIT freed 20K, 2% free 6461K/6531K, paused 3ms+3msrn03-02 22:35:34.807: I/Zygote(171): ...preloaded 31 resources in 123ms.rn03-02 22:35:34.857: D/dalvikvm(171): GC_EXPLICIT freed 14K, 2% free 6463K/6531K, paused 5ms+4msrn03-02 22:35:34.917: D/dalvikvm(171): GC_EXPLICIT freed 6K, 2% free 6457K/6531K, paused 3ms+3msrn03-02 22:35:34.977: D/dalvikvm(171): GC_EXPLICIT freed set_val(hello_device, val);rn rn /*通过硬件抽象层定义的硬件访问接口读取硬件寄存器val的值*/rn static jint hello_getVal(JNIEnv* env, jobject clazz) rn int val = 0;rn if(!hello_device) rn LOGI("Hello JNI: device is not open.");rn return val;rn rn hello_device->get_val(hello_device, &val);rn rn LOGI("Hello JNI: get value %d from device.", val);rn rn return val;rn rn /*通过硬件抽象层定义的硬件模块打开接口打开硬件设备*/rn static inline int hello_device_open(const hw_module_t* module, struct hello_device_t** device) rn return module->methods->open(module, HELLO_HARDWARE_MODULE_ID, (struct hw_device_t**)device);rn rn /*通过硬件模块ID来加载指定的硬件抽象层模块并打开硬件*/rn static jboolean hello_init(JNIEnv* env, jclass clazz) rn hello_module_t* module;rn rn LOGI("Hello JNI: initializing......");rn if(hw_get_module(HELLO_HARDWARE_MODULE_ID, (const struct hw_module_t**)&module) == 0) rn LOGI("Hello JNI: hello Stub found.");rn if(hello_device_open(&(module->common), &hello_device) == 0) rn LOGI("Hello JNI: hello device is open.");rn return 0;rn rn LOGE("Hello JNI: failed to open hello device.");rn return -1;rn rn LOGE("Hello JNI: failed to get hello stub module.");rn return -1; rn rn /*JNI方法表*/rn static const JNINativeMethod method_table[] = rn "init_native", "()Z", (void*)hello_init,rn "setVal_native", "(I)V", (void*)hello_setVal,rn "getVal_native", "()I", (void*)hello_getVal,rn ;rn /*注册JNI方法*/rn int register_android_server_HelloService(JNIEnv *env) rn LOGI("hellpeng");rn return jniRegisterNativeMethods(env, "com/android/server/HelloService", method_table, NELEM(method_table));rn rn;rn[/code]rnrn然后在onload.cpp里这样加的rn[code=C/C++]rn/*rn * Copyright (C) 2009 The Android Open Source Projectrn *rn * Licensed under the Apache License, Version 2.0 (the "License");rn * you may not use this <em>file</em> except in compliance with the License.rn * You may obtain a copy of the License atrn *rn * http://www.apache.org/licenses/LICENSE-2.0rn *rn * Unless required by applicable law or agreed to in writing, softwarern * distributed under the License is distributed on an "AS IS" BASIS,rn * WITHOUT WARRANTIES OR CONDITIONS OF ANY KIND, either express or implied.rn * See the License for the specific language governing permissions andrn * limitations under the License.rn */rnrn#include "JNIHelp.h"rn#include "jni.h"rn#include "utils/Log.h"rn#include "utils/misc.h"rnrnnamespace android rnint register_android_server_AlarmManagerService(JNIEnv* env);rnint register_android_server_BatteryService(JNIEnv* env);rnint register_android_server_InputApplicationHandle(JNIEnv* env);rnint register_android_server_InputWindowHandle(JNIEnv* env);rnint register_android_server_InputManager(JNIEnv* env);rnint register_android_server_LightsService(JNIEnv* env);rnint register_android_server_PowerManagerService(JNIEnv* env);rnint register_android_server_UsbDeviceManager(JNIEnv* env);rnint register_android_server_UsbHostManager(JNIEnv* env);rnint register_android_server_VibratorService(JNIEnv* env);rnint register_android_server_SystemServer(JNIEnv* env);rnint register_android_server_HelloService(JNIEnv* env);rnint register_android_server_location_GpsLocationProvider(JNIEnv* env);rnint register_android_server_connectivity_Vpn(JNIEnv* env);rn;rnrnusing namespace android;rnrnextern "C" jint JNI_OnLoad(JavaVM* vm, void* reserved)rnrn JNIEnv* env = NULL;rn jint result = -1;rnrn if (vm->GetEnv((void**) &env, JNI_VERSION_1_4) != JNI_OK) rn LOGE("GetEnv failed!");rn return result;rn rn LOG_ASSERT(env, "Could not retrieve the env!");rn register_android_server_PowerManagerService(env);rn register_android_server_InputApplicationHandle(env);rn register_android_server_InputWindowHandle(env);rn register_android_server_InputManager(env);rn register_android_server_LightsService(env);rn register_android_server_AlarmManagerService(env);rn register_android_server_BatteryService(env);rn register_android_server_UsbDeviceManager(env);rn register_android_server_UsbHostManager(env);rn register_android_server_VibratorService(env);rn register_android_server_SystemServer(env);rn LOGE("onhello");rn register_android_server_HelloService(env);rn LOGE("onhelloend");rn register_android_server_location_GpsLocationProvider(env);rn register_android_server_connectivity_Vpn(env);rnrn return JNI_VERSION_1_4;rnrn[/code]rnrn红色的是我加的,make<em>file</em>文件也没问题,因为我以及看到成才的so文件了,但是一致报那个错,模拟器在android那几个字的开机界面起不来,看门口一直不断尝试重启rnrn还有,这个onload.cpp加载的是jni下面的方法还是java下的方法?能否告诉我原理
在struts中,出现Cannot find bean messages in any scope
在action:rn ...rn ActionMessages <em>messages</em> = new ActionMessages(); rn <em>messages</em>.add(ActionMessages.GLOBAL_MESSAGE, new ActionMessage("编号已经被应用")); rn saveMessages(request, <em>messages</em>); rn ...rnrn在jsp1.jsp:rnrnrnrn...rnrn rn rn rnrn...rnrn结果:rnjavax.servlet.ServletException: Cannot <em>find</em> bean <em>messages</em> in any scopern at org.apache.jasper.runtime.PageContextImpl.handlePageException(PageContextImpl.java:471)rn at org.apache.jsp.jsp2$jsp._jspService(jsp2$jsp.java:170)rn....rnrn请高手指正。rn查相关资料,说“application_zh.properties中加入key-value”,但在我的电脑里,没有application_zh这个文件。
为什么总是提示”unable to open include file util.h; unable to open include file parse.h"这两个文件。
我从网上下载了《编译原理及实践》一书后面的编译器源代码,可是运行为什么总是提示”<em>unable</em> to open include <em>file</em> util.h; <em>unable</em> to open include <em>file</em> parse.h"这两个文件。这两个文件明明就在main.c所在的文件夹内。我的路径设置应该正确的。
MTK Messages
MTk消息,描述了MTK消息应用开发原理。
Messages (思维)
MessagesThere are n incoming <em>messages</em> for Vasya. The i-th message is going to be received after ti minutes. Each message has a cost, which equals to A initially. After being received, the cost of a me...
求救:SQL*Loader-500: Unable to open file
从windows下的sqlserver导出的文本文件到linux下,执行oracle sqlldr 报错rnrnrnlog文件rnSQL*Loader-500: Unable to open <em>file</em> (****.dat)rnSQL*Loader-555: unrecognized processing optionrnSQL*Loader-2026: the load was aborted because SQL Loader cannot continue.rn
error:unable to write temp file for saving operation
请教下为什么在SourceInsight下面一直出现<em>unable</em> to write to temp <em>file</em> for saving operation 这样的提示,rn文件是虚拟机上的网络映射上来的.我之前都是在source insight改的,都没有报错,今天一直报错,往事说是更改文件权限,我已经更改了可还是提示,请高手指点。。。
error: unable to open input file:何解?!~
-rw-r--r-- 1 root root 2503 Jul 23 09:55 ClientService.cpprn-rw-r--r-- 1 root root 829 Jul 16 09:18 ClientService.hrn-rw-r--r-- 1 root root 421616 Jul 23 10:51 ClientService.orn-rw-r--r-- 1 root root 733 Jul 17 16:03 Listofport.cpprn-rw-r--r-- 1 root root 847 Jul 17 16:04 Listofport.hrn-rw-r--r-- 1 root root 476768 Jul 23 10:51 Listofport.orn-rw-r--r-- 1 root root 714 Jul 23 10:51 Make<em>file</em>rn-rw-r--r-- 1 root root 1927 Jul 23 09:55 Msgs_Task.cpprn-rw-r--r-- 1 root root 928 Jul 19 14:55 Msgs_Task.hrn-rw-r--r-- 1 root root 488636 Jul 23 10:51 Msgs_Task.orn-rw-r--r-- 1 root root 339 Jul 12 11:16 MyMessageBlock.cpprn-rw-r--r-- 1 root root 495 Jul 18 15:26 MyMessageBlock.hrn-rw-r--r-- 1 root root 354008 Jul 23 10:51 MyMessageBlock.orn-rw-r--r-- 1 root root 3016 Jul 23 09:55 ServerService.cpprn-rw-r--r-- 1 root root 617 Jul 17 10:39 ServerService.hrn-rw-r--r-- 1 root root 550096 Jul 23 10:51 ServerService.orn-rw-r--r-- 1 root root 2050 Jul 23 09:55 UDPhandler.cpprn-rw-r--r-- 1 root root 518 Jul 17 16:07 UDPhandler.hrn-rw-r--r-- 1 root root 393604 Jul 23 10:51 UDPhandler.orn-rw-r--r-- 1 root root 717 Jul 23 09:57 headline.hrn-rw-r--r-- 1 root root 1567 Jul 23 09:55 log.cpprn-rw-r--r-- 1 root root 374 Jul 23 09:55 log.hrn-rw-r--r-- 1 root root 365172 Jul 23 10:51 log.orn-rw-r--r-- 1 root root 2553 Jul 23 10:17 main.cpprn-rw-r--r-- 1 root root 596440 Jul 23 10:51 main.orn-rwxr-xr-x 1 root root 1839311 Jul 23 10:26 mytransferrn-rw-r--r-- 1 root root 4937 Jul 20 12:14 mytransfer.vcprojrn-rw-r--r-- 1 root root 1425 Jul 23 09:39 mytransfer.vcproj.GTSTAR.caikun.userrn-rwxrwxrwx 1 root root 1839311 Jul 23 10:29 testrn-rwxr-xr-x 1 root root 1839311 Jul 23 10:51 transferrn[root@localhost mytransfer]# ./transferrnerror: <em>unable</em> to open input <em>file</em>: rnrn自己写的一个小程序,red hat9下,make ..生成transfer.......运行之, <em>unable</em> to open input <em>file</em>.rn打不开输入文件。rnrn尝试生成不同文件,修改权限,都没有用,运行都是<em>unable</em> to open input <em>file</em>..网上也搜索不到相关信息,求牛人帮助。。
asp.net+Sqlite 时不时出现Unable to open the database file
[color=#FF0000]网站是能运行的起来,只不过时不时的会出现下面这个错误,没有规律的。app_data已经加了everyone写入权限了。[/color]rn=================rnUnable to open the database <em>file</em> rn说明: 执行当前 Web 请求期间,出现未处理的异常。请检查堆栈跟踪信息,以了解有关该错误以及代码中导致错误的出处的详细信息。 rnrn异常详细信息: System.Data.SQLite.SQLiteException: Unable to open the database <em>file</em>rnrn源错误: rnrnrn行 162: rn行 163: if (connection.State != ConnectionState.Open)rn行 164: connection.Open();rn行 165: rn行 166:rnrn===============================rn[color=#FF0000]下面是我的类部份方法,也以及及时的关闭了数据库连接。大家帮忙看看哪里还需要改进的。谢谢[/color]rn[code=C#]rnpublic class SQLiteHelperrnrn public SQLiteHelper()rn rnrn rn //数据库连接字符串(web.config来配置),可以动态更改SQLString支持多数据库. rn public static string connectionString = "Data Source=" + System.Web.HttpContext.Current.Server.MapPath(ConfigurationManager.AppSettings["ConnectionSQLite"]) + ";Version=3;";rnrn public static SQLiteParameter GetOleDbParameter(string paraName, DbType type, int paraSize, Object value)rn rn SQLiteParameter para = new SQLiteParameter(paraName, type, paraSize);rn para.Value = value;rn return para;rn rn public static string GetTableData(string Fields, string ID)rn rn string Sql = "select " + Fields + " From [table] where id='" + ID + "'";rn return GetData(Sql);rn rnrn public static string GetData(string Sql)rn rn object obj = GetSingle(Sql);rn if (obj == null)rn rn return "";rn rn return obj.ToString();rn rnrn public static int GetMaxID(string FieldName, string TableName)rn rn string strsql = "select max(" + FieldName + ")+1 from " + TableName;rn object obj = GetSingle(strsql);rn if (obj == null)rn rn return 1;rn rn elsern rn return int.Parse(obj.ToString());rn rn rnrn public static bool Exists(string strSql)rn rn object obj = GetSingle(strSql);rn int cmdresult;rn if ((Object.Equals(obj, null)) || (Object.Equals(obj, System.DBNull.Value)))rn rn cmdresult = 0;rn rn elsern rn cmdresult = int.Parse(obj.ToString());rn rn if (cmdresult == 0)rn rn return false;rn rn elsern rn return true;rn rn rnrn public static bool Exists(string strSql, params SQLiteParameter[] cmdParms)rn rn object obj = GetSingle(strSql, cmdParms);rn int cmdresult;rn if ((Object.Equals(obj, null)) || (Object.Equals(obj, System.DBNull.Value)))rn rn cmdresult = 0;rn rn elsern rn cmdresult = int.Parse(obj.ToString());rn rn if (cmdresult == 0)rn rn return false;rn rn elsern rn return true;rn rn rnrn #endregionrnrn /// rn /// 保证数据库连接处于打开状态rn /// rn /// rn public static void OpenDb(SQLiteConnection connection)rn rn if (connection.State != ConnectionState.Open)rn connection.Open();rn rnrn public static int ExecuteSql(string SQLString)rn rn using (SQLiteConnection connection = new SQLiteConnection(connectionString))rn rn using (SQLiteCommand cmd = new SQLiteCommand(SQLString, connection))rn rn OpenDb(connection);rn tryrn rn int rows = cmd.ExecuteNonQuery();rn return rows;rn rn catch (System.Data.SQLite.SQLiteException E)rn rn throw new Exception(E.Message);rn rn rn rn rnrn public static int ExecuteSql(string SQLString, string content)rn rn using (SQLiteConnection connection = new SQLiteConnection(connectionString))rn rn OpenDb(connection);rn SQLiteCommand cmd = new SQLiteCommand(SQLString, connection);rn using (cmd)rn rn SQLiteParameter myParameter = new SQLiteParameter("@content", DbType.String);rn myParameter.Value = content;rn cmd.Parameters.Add(myParameter);rn tryrn rn if (connection.State != ConnectionState.Open)rn connection.Open();rn int rows = cmd.ExecuteNonQuery();rn return rows;rn rn catch (System.Data.SQLite.SQLiteException E)rn rn throw new Exception(E.Message);rn rn finallyrn rn cmd.Dispose();rn connection.Close();rn rn rn rn
Unable to load configuration. - bean - jar:file
严重: Dispatcher initialization failedrnUnable to load configuration. - bean - jar:<em>file</em>:/D:/Program%20Files/Tomcat%206.0/webapps/StrutsTest/WEB-INF/lib/struts2-core-2.2.3.1.jar!/struts-default.xml:29:72rn at com.opensymphony.xwork2.config.ConfigurationManager.getConfiguration(ConfigurationManager.java:58)rn at org.apache.struts2.dispatcher.Dispatcher.init_PreloadConfiguration(Dispatcher.java:374)rn at org.apache.struts2.dispatcher.Dispatcher.init(Dispatcher.java:418)rn at org.apache.struts2.dispatcher.ng.InitOperations.initDispatcher(InitOperations.java:69)rn at org.apache.struts2.dispatcher.ng.filter.StrutsPrepareAndExecuteFilter.init(StrutsPrepareAndExecuteFilter.java:51)rn at org.apache.catalina.core.ApplicationFilterConfig.getFilter(ApplicationFilterConfig.java:275)rn at org.apache.catalina.core.ApplicationFilterConfig.setFilterDef(ApplicationFilterConfig.java:397)rn at org.apache.catalina.core.ApplicationFilterConfig.(ApplicationFilterConfig.java:108)rn at org.apache.catalina.core.StandardContext.filterStart(StandardContext.java:3709)rn at org.apache.catalina.core.StandardContext.start(StandardContext.java:4363)rn at org.apache.catalina.core.ContainerBase.addChildInternal(ContainerBase.java:791)rn at org.apache.catalina.core.ContainerBase.addChild(ContainerBase.java:771)rn at org.apache.catalina.core.StandardHost.addChild(StandardHost.java:525)rn at org.apache.catalina.startup.HostConfig.deployDirectory(HostConfig.java:926)rn at org.apache.catalina.startup.HostConfig.deployDirectories(HostConfig.java:889)rn at org.apache.catalina.startup.HostConfig.deployApps(HostConfig.java:492)rn at org.apache.catalina.startup.HostConfig.start(HostConfig.java:1149)rn at org.apache.catalina.startup.HostConfig.lifecycleEvent(HostConfig.java:311)rn at org.apache.catalina.util.LifecycleSupport.fireLifecycleEvent(LifecycleSupport.java:117)rn at org.apache.catalina.core.ContainerBase.start(ContainerBase.java:1053)rn at org.apache.catalina.core.StandardHost.start(StandardHost.java:719)rn at org.apache.catalina.core.ContainerBase.start(ContainerBase.java:1045)rn at org.apache.catalina.core.StandardEngine.start(StandardEngine.java:443)rn at org.apache.catalina.core.StandardService.start(StandardService.java:516)rn at org.apache.catalina.core.StandardServer.start(StandardServer.java:710)rn at org.apache.catalina.startup.Catalina.start(Catalina.java:578)rn at sun.reflect.NativeMethodAccessorImpl.invoke0(Native Method)rn at sun.reflect.NativeMethodAccessorImpl.invoke(NativeMethodAccessorImpl.java:39)rn at sun.reflect.DelegatingMethodAccessorImpl.invoke(DelegatingMethodAccessorImpl.java:25)rn at java.lang.reflect.Method.invoke(Method.java:597)rn at org.apache.catalina.startup.Bootstrap.start(Bootstrap.java:288)rn at org.apache.catalina.startup.Bootstrap.main(Bootstrap.java:413)rnCaused by: Unable to load bean: type: class:com.opensymphony.xwork2.ObjectFactory - bean - jar:<em>file</em>:/D:/Program%20Files/Tomcat%206.0/webapps/StrutsTest/WEB-INF/lib/struts2-core-2.2.3.1.jar!/struts-default.xml:29:72rn at com.opensymphony.xwork2.config.providers.XmlConfigurationProvider.register(XmlConfigurationProvider.java:221)rn at org.apache.struts2.config.StrutsXmlConfigurationProvider.register(StrutsXmlConfigurationProvider.java:101)rn at com.opensymphony.xwork2.config.impl.DefaultConfiguration.reloadContainer(DefaultConfiguration.java:169)rn at com.opensymphony.xwork2.config.ConfigurationManager.getConfiguration(ConfigurationManager.java:55)rn ... 31 morernCaused by: Bean type class com.opensymphony.xwork2.ObjectFactory with the name xwork has already been loaded by bean - jar:<em>file</em>:/D:/Program%20Files/Tomcat%206.0/webapps/StrutsTest/WEB-INF/lib/struts2-core-2.1.8.1.jar!/struts-default.xml:29:72 - bean - jar:<em>file</em>:/D:/Program%20Files/Tomcat%206.0/webapps/StrutsTest/WEB-INF/lib/struts2-core-2.2.3.1.jar!/struts-default.xml:29:72rn at com.opensymphony.xwork2.config.providers.XmlConfigurationProvider.register(XmlConfigurationProvider.java:205)rn ... 34 morern2011-12-31 17:06:26 org.apache.catalina.core.StandardContext filterStartrn严重: Exception starting filter struts2rnUnable to load configuration. - bean - jar:<em>file</em>:/D:/Program%20Files/Tomcat%206.0/webapps/StrutsTest/WEB-INF/lib/struts2-core-2.2.3.1.jar!/struts-default.xml:29:72rn at org.apache.struts2.dispatcher.Dispatcher.init(Dispatcher.java:431)rn at org.apache.struts2.dispatcher.ng.InitOperations.initDispatcher(InitOperations.java:69)rn at org.apache.struts2.dispatcher.ng.filter.StrutsPrepareAndExecuteFilter.init(StrutsPrepareAndExecuteFilter.java:51)rn at org.apache.catalina.core.ApplicationFilterConfig.getFilter(ApplicationFilterConfig.java:275)rn at org.apache.catalina.core.ApplicationFilterConfig.setFilterDef(ApplicationFilterConfig.java:397)rn at org.apache.catalina.core.ApplicationFilterConfig.(ApplicationFilterConfig.java:108)rn at org.apache.catalina.core.StandardContext.filterStart(StandardContext.java:3709)rn at org.apache.catalina.core.StandardContext.start(StandardContext.java:4363)rn at org.apache.catalina.core.ContainerBase.addChildInternal(ContainerBase.java:791)rn at org.apache.catalina.core.ContainerBase.addChild(ContainerBase.java:771)rn at org.apache.catalina.core.StandardHost.addChild(StandardHost.java:525)rn at org.apache.catalina.startup.HostConfig.deployDirectory(HostConfig.java:926)rn at org.apache.catalina.startup.HostConfig.deployDirectories(HostConfig.java:889)rn at org.apache.catalina.startup.HostConfig.deployApps(HostConfig.java:492)rn at org.apache.catalina.startup.HostConfig.start(HostConfig.java:1149)rn at org.apache.catalina.startup.HostConfig.lifecycleEvent(HostConfig.java:311)rn at org.apache.catalina.util.LifecycleSupport.fireLifecycleEvent(LifecycleSupport.java:117)rn at org.apache.catalina.core.ContainerBase.start(ContainerBase.java:1053)rn at org.apache.catalina.core.StandardHost.start(StandardHost.java:719)rn at org.apache.catalina.core.ContainerBase.start(ContainerBase.java:1045)rn at org.apache.catalina.core.StandardEngine.start(StandardEngine.java:443)rn at org.apache.catalina.core.StandardService.start(StandardService.java:516)rn at org.apache.catalina.core.StandardServer.start(StandardServer.java:710)rn at org.apache.catalina.startup.Catalina.start(Catalina.java:578)rn at sun.reflect.NativeMethodAccessorImpl.invoke0(Native Method)rn at sun.reflect.NativeMethodAccessorImpl.invoke(NativeMethodAccessorImpl.java:39)rn at sun.reflect.DelegatingMethodAccessorImpl.invoke(DelegatingMethodAccessorImpl.java:25)rn at java.lang.reflect.Method.invoke(Method.java:597)rn at org.apache.catalina.startup.Bootstrap.start(Bootstrap.java:288)rn at org.apache.catalina.startup.Bootstrap.main(Bootstrap.java:413)rnCaused by: Unable to load configuration. - bean - jar:<em>file</em>:/D:/Program%20Files/Tomcat%206.0/webapps/StrutsTest/WEB-INF/lib/struts2-core-2.2.3.1.jar!/struts-default.xml:29:72rn at com.opensymphony.xwork2.config.ConfigurationManager.getConfiguration(ConfigurationManager.java:58)rn at org.apache.struts2.dispatcher.Dispatcher.init_PreloadConfiguration(Dispatcher.java:374)rn at org.apache.struts2.dispatcher.Dispatcher.init(Dispatcher.java:418)rn ... 29 morernCaused by: Unable to load bean: type: class:com.opensymphony.xwork2.ObjectFactory - bean - jar:<em>file</em>:/D:/Program%20Files/Tomcat%206.0/webapps/StrutsTest/WEB-INF/lib/struts2-core-2.2.3.1.jar!/struts-default.xml:29:72rn at com.opensymphony.xwork2.config.providers.XmlConfigurationProvider.register(XmlConfigurationProvider.java:221)rn at org.apache.struts2.config.StrutsXmlConfigurationProvider.register(StrutsXmlConfigurationProvider.java:101)rn at com.opensymphony.xwork2.config.impl.DefaultConfiguration.reloadContainer(DefaultConfiguration.java:169)rn at com.opensymphony.xwork2.config.ConfigurationManager.getConfiguration(ConfigurationManager.java:55)rn ... 31 morernCaused by: Bean type class com.opensymphony.xwork2.ObjectFactory with the name xwork has already been loaded by bean - jar:<em>file</em>:/D:/Program%20Files/Tomcat%206.0/webapps/StrutsTest/WEB-INF/lib/struts2-core-2.1.8.1.jar!/struts-default.xml:29:72 - bean - jar:<em>file</em>:/D:/Program%20Files/Tomcat%206.0/webapps/StrutsTest/WEB-INF/lib/struts2-core-2.2.3.1.jar!/struts-default.xml:29:72rn at com.opensymphony.xwork2.config.providers.XmlConfigurationProvider.register(XmlConfigurationProvider.java:205)rn ... 34 morern2011-12-31 17:06:26 org.apache.catalina.core.StandardContext startrn严重: Error filterStartrn2011-12-31 17:06:26 org.apache.catalina.core.StandardContext startrn严重: Context [/StrutsTest] startup failed due to previous errorsrn2011-12-31 17:06:26 org.apache.coyote.http11.Http11Protocol startrn信息: Starting Coyote HTTP/1.1 on http-8080rn2011-12-31 17:06:26 org.apache.jk.common.ChannelSocket initrn信息: JK: ajp13 listening on /0.0.0.0:8009rn2011-12-31 17:06:26 org.apache.jk.server.JkMain startrn信息: Jk running ID=0 time=0/16 config=nullrn2011-12-31 17:06:26 org.apache.catalina.startup.Catalina start
[Ilink32 error]fatal:unable to open file 'RAIMAGE.BPI'
[Ilink32 error]fatal:<em>unable</em> to open <em>file</em> 'RAIMAGE.BPI'
Unable to locate file 'jpeg.pas'是什么错误?
需要处理Jpeg图像,但在uses单元中加入uses jpeg就出现Unable to locate <em>file</em> 'jpeg.pas'的错误是怎么回事?
sql2005问题,Unable to open the physical file 何解?
具体是这样的:我在另外一个电脑上用vs08的登陆控件做了个登陆器。然后系统自动生成了那个aspnetdb的数据库。rn今天换了电脑了,把项目转移过来,发现出现了这个问题:rnUnable to open the physical <em>file</em> "F:\Project——基于身份验证的电子邮件系统\MailCode\App_Data\aspnetdb.mdf". Operating system error 5: "5(拒绝访问。)".rnAn attempt to attach an auto-named database for <em>file</em> F:\Project——基于身份验证的电子邮件系统\MailCode\App_Data\aspnetdb.mdf failed. A database with the same name exists, or specified <em>file</em> cannot be opened, or it is located on UNC share. rn说明: 执行当前 Web 请求期间,出现未处理的异常。请检查堆栈跟踪信息,以了解有关该错误以及代码中导致错误的出处的详细信息。 rnrn异常详细信息: System.Data.SqlClient.SqlException: Unable to open the physical <em>file</em> "F:\Project——基于身份验证的电子邮件系统\MailCode\App_Data\aspnetdb.mdf". Operating system error 5: "5(拒绝访问。)".rnAn attempt to attach an auto-named database for <em>file</em> F:\Project——基于身份验证的电子邮件系统\MailCode\App_Data\aspnetdb.mdf failed. A database with the same name exists, or specified <em>file</em> cannot be opened, or it is located on UNC share.rn请问这是怎么回事?
Unable to load jar:file jsonplugin-0.34.jar!/struts-plugin.xml
严重: Exception starting filter struts2-filterrnUnable to load configuration. - Class: java.net.URLrnFile: URL.javarnMethod: rnLine: 601 - java/net/URL.java:601:-1rn at com.opensymphony.xwork2.config.ConfigurationManager.getConfiguration(ConfigurationManager.java:58)rn at org.apache.struts2.dispatcher.Dispatcher.init_PreloadConfiguration(Dispatcher.java:360)rn at org.apache.struts2.dispatcher.Dispatcher.init(Dispatcher.java:403)rn at org.apache.struts2.dispatcher.FilterDispatcher.init(FilterDispatcher.java:190)rn at org.apache.catalina.core.ApplicationFilterConfig.getFilter(ApplicationFilterConfig.java:275)rn at org.apache.catalina.core.ApplicationFilterConfig.setFilterDef(ApplicationFilterConfig.java:397)rn at org.apache.catalina.core.ApplicationFilterConfig.(ApplicationFilterConfig.java:108)rn at org.apache.catalina.core.StandardContext.filterStart(StandardContext.java:3709)rn at org.apache.catalina.core.StandardContext.start(StandardContext.java:4363)rn at org.apache.catalina.core.ContainerBase.start(ContainerBase.java:1045)rn at org.apache.catalina.core.StandardHost.start(StandardHost.java:719)rn at org.apache.catalina.core.ContainerBase.start(ContainerBase.java:1045)rn at org.apache.catalina.core.StandardEngine.start(StandardEngine.java:443)rn at org.apache.catalina.core.StandardService.start(StandardService.java:516)rn at org.apache.catalina.core.StandardServer.start(StandardServer.java:710)rn at org.apache.catalina.startup.Catalina.start(Catalina.java:578)rn at sun.reflect.NativeMethodAccessorImpl.invoke0(Native Method)rn at sun.reflect.NativeMethodAccessorImpl.invoke(NativeMethodAccessorImpl.java:39)rn at sun.reflect.DelegatingMethodAccessorImpl.invoke(DelegatingMethodAccessorImpl.java:25)rn at java.lang.reflect.Method.invoke(Method.java:597)rn at org.apache.catalina.startup.Bootstrap.start(Bootstrap.java:288)rn at org.apache.catalina.startup.Bootstrap.main(Bootstrap.java:413)rnCaused by: Unable to load jar:<em>file</em>:/D:/workspace/.metadata/.plugins/org.eclipse.wst.server.core/tmp0/wtpwebapps/Struts2Jquery/WEB-INF/lib/jsonplugin-0.34.jar!/struts-plugin.xml - Class: java.net.URLrnFile: URL.javarnMethod: rnLine: 601 - java/net/URL.java:601:-1rn at com.opensymphony.xwork2.config.providers.XmlConfigurationProvider.loadConfigurationFiles(XmlConfigurationProvider.java:890)rn at com.opensymphony.xwork2.config.providers.XmlConfigurationProvider.loadDocuments(XmlConfigurationProvider.java:144)rn at com.opensymphony.xwork2.config.providers.XmlConfigurationProvider.init(XmlConfigurationProvider.java:111)rn at com.opensymphony.xwork2.config.impl.DefaultConfiguration.reloadContainer(DefaultConfiguration.java:164)rn at com.opensymphony.xwork2.config.ConfigurationManager.getConfiguration(ConfigurationManager.java:55)rn ... 21 morernCaused by: Class: java.net.URLrnFile: URL.javarnMethod: rnLine: 601 - java/net/URL.java:601:-1rn at com.opensymphony.xwork2.util.DomHelper.parse(DomHelper.java:115)rn at com.opensymphony.xwork2.config.providers.XmlConfigurationProvider.loadConfigurationFiles(XmlConfigurationProvider.java:885)rn ... 25 morernCaused by: java.net.MalformedURLExceptionrn at java.net.URL.(URL.java:601)rn at java.net.URL.(URL.java:464)rn at java.net.URL.(URL.java:413)rn at com.sun.org.apache.xerces.internal.impl.XMLEntityManager.setupCurrentEntity(XMLEntityManager.java:650)rn at com.sun.org.apache.xerces.internal.impl.XMLEntityManager.startEntity(XMLEntityManager.java:1316)rn at com.sun.org.apache.xerces.internal.impl.XMLEntityManager.startDTDEntity(XMLEntityManager.java:1283)rn at com.sun.org.apache.xerces.internal.impl.XMLDTDScannerImpl.setInputSource(XMLDTDScannerImpl.java:283)rn at com.sun.org.apache.xerces.internal.impl.XMLDocumentScannerImpl$DTDDriver.dispatch(XMLDocumentScannerImpl.java:1168)rn at com.sun.org.apache.xerces.internal.impl.XMLDocumentScannerImpl$DTDDriver.next(XMLDocumentScannerImpl.java:1068)rn at com.sun.org.apache.xerces.internal.impl.XMLDocumentScannerImpl$PrologDriver.next(XMLDocumentScannerImpl.java:988)rn at com.sun.org.apache.xerces.internal.impl.XMLDocumentScannerImpl.next(XMLDocumentScannerImpl.java:645)rn at com.sun.org.apache.xerces.internal.impl.XMLNSDocumentScannerImpl.next(XMLNSDocumentScannerImpl.java:140)rn at com.sun.org.apache.xerces.internal.impl.XMLDocumentFragmentScannerImpl.scanDocument(XMLDocumentFragmentScannerImpl.java:508)rn at com.sun.org.apache.xerces.internal.parsers.XML11Configuration.parse(XML11Configuration.java:807)rn at com.sun.org.apache.xerces.internal.parsers.XML11Configuration.parse(XML11Configuration.java:737)rn at com.sun.org.apache.xerces.internal.parsers.XMLParser.parse(XMLParser.java:107)rn at com.sun.org.apache.xerces.internal.parsers.AbstractSAXParser.parse(AbstractSAXParser.java:1205)rn at com.sun.org.apache.xerces.internal.jaxp.SAXParserImpl$JAXPSAXParser.parse(SAXParserImpl.java:522)rn at javax.xml.parsers.SAXParser.parse(SAXParser.java:395)rn at com.opensymphony.xwork2.util.DomHelper.parse(DomHelper.java:113)rn ... 26 morern2009-7-29 10:21:12 org.apache.catalina.core.StandardContext startrn严重: Error filterStart
unable to open input file c:\masm5.asm"?">"unable to open input file c:\masm5.asm"?
昨天还可以用masm,今天不行了,不知道我在哪里搞了一下,重新覆盖也没有用,不知道有没有人能帮帮忙?rn非常感谢,等待中。
怎么老显示 Unable to open file 'SMPACK.LIB'
我编了一个数据库的小程序 编译怎么老是显示rn[Linker Fatal Error] Fatal: Unable to open <em>file</em> 'SMPACK.LIB'rn什么意思啊???谢谢
FastReport控件Unable to open include file
C++ Builder6.0;安装了FastReport.v3.18控件。rnrn安装FastReport控件也知道是否成功,我的安装方法是:rn 运行“recompile.exe”文件,设置相应选项:rn A. Select the compiler 设置为 Builder6rn B. Select the FR3 Version 设置为 Professionalrn C. Select the TeeChart version 设置为 TeeChart6rn D. What you want to do 下的 Change language To: 设置为:Recompile all packer 点Compile按钮。rnrnrn之后调试程序的时候,老是提示:rnrn[C++ Warning] kehu.cpp(40): W8053 'sleep(unsigned int)' is obsoletern[C++ Error] Unit2.h(20): E2209 Unable to open include <em>file</em> 'FR_Class.hpp'rn[C++ Error] Unit2.h(21): E2209 Unable to open include <em>file</em> 'FR_DBSet.hpp'rn[C++ Error] Unit2.h(22): E2209 Unable to open include <em>file</em> 'FR_DSet.hpp'rn[C++ Error] Unit2.h(23): E2209 Unable to open include <em>file</em> 'AdPort.hpp'rn[C++ Error] Unit2.h(24): E2209 Unable to open include <em>file</em> 'OoMisc.hpp'rn[C++ Error] Unit3.h(15): E2209 Unable to open include <em>file</em> 'DBGridEh.hpp'rnrn请不惜赐教,多谢rn
file *.pas "的问题">Delphi2010中"Unable to Locate file *.pas "的问题
我在Delphi2010中想查看" Windows, Messages, SysUtils, Variants, Classes, Graphics, Controls, Forms,rn Dialogs, StdCtrls"等这些单元文件时,总是提示"Unable to Locate <em>file</em> *.pas ",rn为什么在Delphi2010中不能查看上述单元文件的源代码?rn应该如何操作才能查看?请大家赐教,谢谢!
Unable to open file 'VCLMID40.BPI'.是什么原因?
我使用c++builder4 编译出错!Unable to open <em>file</em> 'VCLMID40.BPI'.是什么原因?
单片机经历的点点提提下载
工作快1年了,刚进公司的时候本来有3个月的时间试用的,就是做5个练习项目而已,不过后来没有做完就被捉去做项目了,不过现在回想起来,这些练习都非常非常经典,能学到很多东西,不过练习都时针对俺现在做的家电这个行业的,至于单片机的其它应用领域暂时不做讨论了,也没有这个水平 相关下载链接:[url=//download.csdn.net/download/lgy198612/2380217?utm_source=bbsseo]//download.csdn.net/download/lgy198612/2380217?utm_source=bbsseo[/url]
360Amigo注册机下载
360Amigo 7.60 高级版 注册机 相关下载链接:[url=//download.csdn.net/download/khy891108/3702703?utm_source=bbsseo]//download.csdn.net/download/khy891108/3702703?utm_source=bbsseo[/url]
VB精彩编程200例下载
VB精彩编程200例 相关下载链接:[url=//download.csdn.net/download/qq_15160177/7316649?utm_source=bbsseo]//download.csdn.net/download/qq_15160177/7316649?utm_source=bbsseo[/url]
相关热词 c++和c#哪个就业率高 c# 批量动态创建控件 c# 模块和程序集的区别 c# gmap 截图 c# 验证码图片生成类 c# 再次尝试 连接失败 c#开发编写规范 c# 压缩图片好麻烦 c#计算数组中的平均值 c#获取路由参数
我们是很有底线的