xcb_io.c:228:_XSend: 断言“!dpy->xcb->request_extra”失败。

移动开发 > Qt [问题点数:20分,结帖人chen19880827]
等级
本版专家分:0
结帖率 66.67%
等级
本版专家分:58169
勋章
Blank
红花 2012年6月 移动平台大版内专家分月排行榜第一
2012年5月 移动平台大版内专家分月排行榜第一
2012年4月 移动平台大版内专家分月排行榜第一
2012年3月 移动平台大版内专家分月排行榜第一
2012年2月 移动平台大版内专家分月排行榜第一
2012年1月 移动平台大版内专家分月排行榜第一
2011年12月 移动平台大版内专家分月排行榜第一
2011年11月 移动平台大版内专家分月排行榜第一
2011年10月 移动平台大版内专家分月排行榜第一
2011年9月 移动平台大版内专家分月排行榜第一
2011年6月 移动平台大版内专家分月排行榜第一
2011年5月 移动平台大版内专家分月排行榜第一
2011年4月 移动平台大版内专家分月排行榜第一
Blank
黄花 2011年8月 移动平台大版内专家分月排行榜第二
2011年7月 移动平台大版内专家分月排行榜第二
2011年3月 移动平台大版内专家分月排行榜第二
Blank
蓝花 2012年8月 移动平台大版内专家分月排行榜第三
2012年7月 移动平台大版内专家分月排行榜第三
等级
本版专家分:0
等级
本版专家分:0
chen19880827

等级:

java: xcb_xlib.c:50: xcb_xlib_unlock: Assertion `c->xlib.lock' failed

当你在linux中安装eclipse或者安装其他的包时遇到这样得问题:java: xcb_xlib.c:50: xcb_xlib_unlock: Assertion `c->xlib.lock' failed,可以按照下面步骤:第一:倒退回FC7的libx11. 卸载以下两个包的时候,可能有...

SIGABRT [xcb] Assertion `!xcb_xlib_threads_sequence_lost' failed

deadbeef: xcb_io.c:263: poll_for_event: Assertion `!xcb_xlib_threads_sequence_lost' failed. Thread 1 "deadbeef-gtkui" received signal SIGABRT, Aborted. 0x00007ffff7c63d7f in raise () ...

openscad: xcb_io.c:165: dequeue_pending_request: Assertion `!xcb_xlib_unknown_req_in_deq' failed.

openscad: xcb_io.c:165: dequeue_pending_request: Assertion `!xcb_xlib_unknown_req_in_deq' failed. Aborted (core dumped)</p> <p>Using</p> <p>openscad -v OpenSCAD version 2015.03-3</p> <p>该...

Assertion `!xcb_xlib_threads_sequence_lost' failed

window: ../../src/xcb_io.c:274: poll_for_event: Assertion `!xcb_xlib_threads_sequence_lost' failed. Aborted (core dumped) </code></pre><p>该提问来源于开源项目:rust-windowing/glutin</p>...

PyGame application crashes on SIGABRT - xcb_io.c:165: dequeue_pending_request: Assertion `!xcb_xlib_...

python: ../../src/xcb_io.c:165: dequeue_pending_request: Assertion `!xcb_xlib_unknown_req_in_deq' failed. Neúspěšně ukončen (SIGABRT)</p> <p>The code is multithreaded, starting and ...

fatal error: xcb/xcb.h: 没有那个文件或目录

libavdevice/xcbgrab.c:25:10: fatal error: xcb/xcb.h: 没有那个文件或目录 #include <xcb/xcb.h> ^~~~~~~~~~~ compilation terminated. 编译xcb https://blog.csdn.net/quantum7/artic...

java bug:java: xcb_xlib.c:50: xcb_xlib_unlock: Assertion `c->xlib.lock' failed.

(1)Ubuntu feisty 的問題: xcb_xlib.c:50: xcb_xlib_unlock: Assertion `c-&gt;xlib.lock’ failed. (2)永中集成Office For Linux » f8下不能安装(3)FedoraForum.org &gt; Fedora Support &gt...

Pytorch编译maskRCNN问题:cpp_extension.py:189: UserWarning: Error checking compiler version for cl.....

先给出两个报错的内容: d:\Anaconda3\envs\torch\lib\site-packages\torch\utils\cpp_extension.py:189: UserWarning: Error checking compiler version for cl: [WinError 2] 系统找不到指定的文件。...

qt之库编译错误:xfixes.c:(.text+0x4e):对‘xcb_send_request’未定义的引用

错误描述 g++ -Wl,--no-undefined -Wl,-O1 -Wl,--enable-new-dtags -Wl,-z,origin -Wl,-rpath,\$ORIGIN/../../lib -shared -o libqxcb-egl-integration.so .obj/qxcbeglintegration.o .obj/qxcbeglwindow.o .obj/...

编译ffmpeg:libavdevice/xcbgrab.c:28:10: fatal error: xcb/xfixes.h: 没有那个文件或目录

https://xorg.freedesktop.org/archive/individual/xcb/xcb-proto-1.13.tar.bz2 https://xorg.freedesktop.org/archive/individual/xcb/libxcb-1.13.tar.bz2 先编译前一个,再编译后一个。 ...

多线程的坑

robot@robot:~/ck_test1_wjw $ rosrun yuyi location Segmentation fault (core dumped) robot@robot:~/ck_test1_wjw $ rosrun yuyi location freeglut ERROR: Internal error <FBConfig with necessary capab...

../../src/xcb_io.c:274: poll_for_event: Assertion `!xcb_xlib_threads_sequence_lost' failed.

java: ../../src/xcb_io.c:274: poll_for_event: Assertion `!xcb_xlib_threads_sequence_lost' failed. Aborted (core dumped) </code></pre><p>该提问来源于开源项目:caprica/vlcj</p></div>

0.58beta8 crash xcb_lock.c:77: _XGetXCBBuffer: Assertion ...

openlierox: ../../src/xcb_lock.c:77: _XGetXCBBuffer: Assertion `((int) ((xcb_req) - (dpy->request)) >= 0)' failed. CrashHandler called, minidump_id: 77e3175e-7575-095f-6dbdbb4e-685a...

xcb_xlib.c:50: xcb_xlib_unlock: Assertion 'c->xlib.lock' failed

yum --enablerepo=development update libxcb export LIBXCB_ALLOW_SLOPPY_LOCK=1 

ERROR:java: xcb_xlib.c的解决方案

java: xcb_xlib.c:50: xcb_xlib_unlock: Assertion `c->xlib.lock' failed. 经过多方googling后,原来是BUG。关于SUN-JDK BUG 解决办法: 第一、自己修改java程序代码。这种方式太麻烦,万一要安装多个...

dust3d: symbol lookup error: /usr/lib/x86_64-linux-gnu/libGLX_mesa.so.0: undefined symbol: xcb_dri3_...

<div><p>seems related to: https://github.com/maxrd2/subtitlecomposer/issues/117 which says: Solution: Please do not bundle</p> ...</code></pre><p>该提问来源于开源项目:huxingyi/dust3d</p></div>

转引-xcb_xlib.c错误

xcb_xlib.c:50: xcb_xlib_unlock: Assertion c->xlib.lock failed.”类似错误,包括最近的SuSE10.x、Fedora8以及Ubuntu7.x系统,网上文章到处贴,一共提出了两种观点:1,倒退回FC7的libx11,卸载以下两个包的时候,...

Qt报错:qt.qpa.xcb: QXcbConnection: XCB error: 8 (BadMatch).....

Qt编译完后运行程序报如下错误 17:46:32: Starting /home/wyl/Documents/Qtcode/RSViewer/RSViewer_build/...qt.qpa.xcb: QXcbConnection: XCB error: 8 (BadMatch), sequence: 770, resource id: 136314920, m...

macos10.15系统下终端命令启动glassfish4.0提示JVM failed to start: java.io.IOException: Cannot run ...

macos10.15系统下终端命令启动glassfish4.0提示JVM failed to start: java.io.IOException: Cannot run program "/usr/libexec/StartupItemContext" (in directory "/Library/glassfish4/glassfish/domains/domain1/...

启动 genymotion 报错: /usr/lib/x86_64-linux-gnu/libX11.so.6: undefined symbol: xcb_wait_for_reply64

在通过 genymotion-2.8.1_x64.bin 安装genymotion 的时候,出现了错误: undefined symbol: xcb_wait_for_reply64 解决:将 genymotion 目录下的 libxcb.so.1 删除或是移动到其他的地方即可解决。 如果删除 ...

grpc java client, go server 错误 io.grpc.StatusRuntimeException: UNAVAILABLE

java client 获取 channel 的代码如下: public ManagedChannel getChannel() { ManagedChannel channel = ManagedChannelBuilder.forAddress(config.getGrpc().getHost(), config.getGrpc().getPort()) ...

Ubuntu18.04下解决Qt出现qt.qpa.plugin:Could not load the Qt platform plugin “xcb“问题

主要介绍了Ubuntu18.04下解决Qt出现qt.qpa.plugin:Could not load the Qt platform plugin “xcb“问题,本文给大家分享解决方案,需要的朋友可以参考下

Opencv 多线程显示错误 [xcb] Unknown request in queue while dequeuing [xcb] Most likely this is a ...

opencv 多线程显示出现...[xcb] Unknown request in queue while dequeuing [xcb] Most likely this is a multi-threaded client and XInitThreads has not been called [xcb] Aborting, sorry about that. Blurring

qt.qpa.xcb: could not connect to display :0

<div><p>Hi! running <code>runIt.sh</code> I got this error:</p> <pre><code> Using default tag: latest latest: Pulling from gvit/legion Digest: sha256:3eafe65287aee943bd6789af705290546f769c16dc9ac68e6...

Qt5.9.9 程序启动报错:libQt5XcbQpa.so.5: undefined symbol: FT_Get_Font_Format

今天使用Qt5.9.9编译程序,成功,但是运行时报错:libQt5XcbQpa.so.5: undefined symbol: FT_Get_Font_Format 解决办法:安装freetype和freetype-devel sudo yum install freetype freetype-devel ...

MATLAB: xcb_xlib.c:50: xcb_xlib_unlock: Assertion `c->xlib.lock' failed问题

错误信息:MATLAB: xcb_xlib.c:50: xcb_xlib_unlock: Assertion `c->xlib.lock failed.与以下四个文件有关libxcb-xlib0 1.0-1.1 X C Binding, Xlib/XCB interface librarylibxcb-xlib0-dev

Redis启动报错 linux64目录 /libX11.so.6: undefined symbol: xcb_wait_for_reply64 解决

Redis-desktop-manager一次安装后启动报错经历 解决: 删除libxcb.so.1 删除 RedisDesktop安装目录\lib\libxcb.so.1 文件解决。 ...最近因为装黑苹果后固态硬盘分配不合理重装了 debian ,在下载Redis-desktop时...

pyinstaller 打包的可执行程序运行出错ImportError: /tmp/_MEIICfyah/libX11.so.6: undefined symbol: xcb_...

pyinstaller 打包的执行文件在另一台机子上运行出错,错误如下: [root@hubrhel# ./main  Traceback (most recent call last):  File "main.py", line 1, in &lt;module&gt;...

xcb-keysyms not found for 32-bit build

<div><p>I am trying to build 32-bit targets on a 64-bit Ubuntu 16.04 platform.</p> <p>I am able to build the Vulkan-LoaderAndValidationLayers repo using the instructions there, i.e. I set these:</p> ...

Assertion `!c->out.queue_len' failed.

<p>shotcut: ../../src/xcb_conn.c:186: write_vec: Assertion `!c->out.queue_len' failed.</p> <p>re-ran, play, crash again.</p> <p>Now trying to reproduce, doesn't crash. </p><p>该提问来源...

相关热词 c# mssql操作 c#免费的人脸识别sdk c# image c#書籍推薦 c#打印pdf中的图片 c# 抽象函数的作用 mono打包c# c#网关技术选型 c#比java简单 c#线程和锁