drivers/net/dm9000.c:154: error: static declaration of 'dm9k_probe' follows

张铁通 2012-10-19 08:35:57
编译内核时出现这样的错误怎么回事?望不吝赐教!

drivers/net/dm9000.c:154: error: static declaration of 'dm9k_probe' follows non-
static declaration
drivers/net/dm9000.c:125: error: previous declaration of 'dm9k_probe' was here
make[2]: *** [drivers/net/dm9000.o] Error 1
make[1]: *** [drivers/net] Error 2
make: *** [drivers] Error 2
...全文
194 回复 打赏 收藏 转发到动态 举报
写回复
用AI写文章
回复
切换为时间正序
请发表友善的回复…
发表回复

6,166

社区成员

发帖
与我相关
我的任务
社区描述
硬件/嵌入开发 硬件设计
社区管理员
  • 硬件设计社区
加入社区
  • 近7日
  • 近30日
  • 至今
社区公告
暂无公告

试试用AI创作助手写篇文章吧