Android编译源码时出现“make: execvp: /bin/bash: 参数列表过长”是怎么回事???? [问题点数:20分,结帖人zuolongsnail]

Bbs1
本版专家分:25
结帖率 80%
Bbs1
本版专家分:25
Bbs1
本版专家分:91
Blank
GitHub 绑定GitHub第三方账户获取
Bbs1
本版专家分:25
Bbs1
本版专家分:0
Linux下 报错“命令参数列表过长”解决方法
rn先用find . -name "*.jpg" | xargs tar -rf picture.tar  命令打包然后用gzip命令把打出的包压缩rngzip -v picture.tarrn rnrm test* -rf 改为:find . -name "test*" | xargs rm -rf "test*"rn...
rm 提示 参数列表过长 解决方法(另一种删除方式)
find . -name "2*" | xargs rm -rfnn"2*"可根据需要自己编写,这个是删除当前目录所有2开头的文件及文件夹,如果只删文件不删文件夹rm后可只跟-fnnfind . -name "*" | xargs rm -rfnn这个是删除当前目录所有文件及文件夹,慎用,删之前请再三确认目录是否正确...
find rm 参数列表过长
使用 xargs -I {}  rm -f {}         大写inn例如:find $1  -type f -atime +$2 -print0|xargs -0  -I {} rm -f {} ; nn nn删除数据用atimenn删除日志用mtime (日志的mtime一直更新,atime可能一直不变)nnctime为change time,chmod,chown等操作会更改ctime...
用rm提示参数列表过长的解决办法
在linux中删除大量文件时,直接用rm会<em>出现</em>:-<em>bash</em>: /<em>bin</em>/rm: <em>参数列表</em><em>过长</em>,的错误。 nnn这时可以用find命令来结合使用。 nnn例: nnn1、rm * -rf 改为: nnn      find . -name "*" | xargs rm -rf '*' 就行了。 nnn2、rm test* -rf 改为: nnn      find . -name "test*" |
rm -rf 提示参数列表过长
n在linux中删除大量文件时,直接用rm会<em>出现</em>:-<em>bash</em>: /<em>bin</em>/rm: <em>参数列表</em><em>过长</em>的错误。rn rnrm提示<em>参数列表</em><em>过长</em>及find&amp;amp;xargs遇到含空格文件名的解决办法rn在linux中删除大量文件时,直接用rm会<em>出现</em>:-<em>bash</em>: /<em>bin</em>/rm: <em>参数列表</em><em>过长</em>,的错误。1、rm * -rf 改为:find . -name &quot;*&quot; -print | xargs rm -rf ...
ANDROID 编译源码6.0 问题记录
1、Ubuntu 系统Ubuntu 14.04 LTS,n2、<em>android</em>源码来自于清华TUNA镜像源n    http://aosp.tuna.tsinghua.edu.cn/<em>android</em>/n3、下载完<em>android</em>源码后,进行源码编译。根目录<em>make</em>n4、<em>make</em>发现错误,无法编译。报如下错误:nYou asked for an OpenJDK 7 build but your
命令mkdir、mv、ls、diff、ln的用法
苏嵌                                                                                                                              项目实战nnnn学习日志                                     姓名:        日期:nnn  n ...
ubantu17.04 编译android 遇到的问题以及解决方法
115 . build/envsetup.sh n 116 lunch n 117 <em>make</em> -j4 n问题1 : n /<em>bin</em>/<em>bash</em>:m4:command not found n 解决方法: n 118 sudo apt-get install m4 n 重新编译 n<em>make</em> -j4 n<em>出现</em>错误但是没找到出错对应的行,于是单线程编译 n 123 <em>make</em> -j1
make: aarch64-himix100-linux-gcc: Command not found 找不到编译器的解决方案:查看交叉编译器的版本
<em>make</em>的时候<em>出现</em>如下错误:rn<em>make</em>: aarch64-himix100-linux-gcc: Command not found。rn1)查看编译器版本命令“aarch64-himix100-linux-gcc -v”rn结果:rn<em>bash</em>: /opt/hisi-linux/x86-arm/aarch64-himix100-linux/<em>bin</em>/aarch64-himix100-linux-gcc: ...
Tar Argument list too long 参数列表过长的办法
如果我们想对一个目录里面的部分文件进行压缩(tar),而这个文件数量超过三万个,就会遇到标题中的问题。nn查了一下,好像文件数超过3万,就会报这个错。nn网上搜的方法一般都是用xargs来解决的,亲测并不行,压缩文件不完整。nn网上找了一个可行的解决办法:nnnfind . -name '*.txt' -print &amp;gt;/tmp/test.manifestntar -cvzf textfile...
[问题-已解决]arm-none-linux-gnueabi-gcc没有那个文件或目录
解决问题 arm-none-linux-gnueabi-gcc:没有哪个文件或目录
rm命令参数过长解决方案
当一个目录下,文件过多,造成无法删除该目录下的文件drwx------ 2 4294967294 4294967294 12640256 Apr 9 21:17 taoke.session_file可以看到,这个目录下有接近12640256个文件PS:目录大小总是4096的倍数,当目录文件数量在4096以下时,目录大小为4096,在4096与8192之间时,目录大小为8192。如此类推。使用rm无...
Linux CentOS 7编译redis报错"cc:未找到命令"解决方案
关于Linux CentOS 7编译redis报错“cc:未找到命令”
解决:make:cc 命令未找到的解决方法
安装Redis的时候报这个错误nnn原因:nn未安装gccnn解决方法:nn安装gccnn[root@VM_220_111_centos redis-3.2.9]# yum -y install gcc auto<em>make</em> autoconf libtool <em>make</em>
hadoop源码编译方法,以及编译问题总结
一、编译所需的一些软件1.jdk1.7 n2.maven 3.3.9 n3.findbugs 3.0.1 n4.protocolBuffer 2.5.0 n5.c<em>make</em> 2.6 n6.zlib-devel n7.openssl-devel n8.gcc-c++ n9.autoconf n10.auto<em>make</em> n11.hadoop-2.7.3-src.tar.gz二、编译hadoop源码步骤首先需
scp 拷贝数据从一台服务器到另一台 出现的参数太长导致无法拷贝的问题解决方式
常见拷贝方式有scp -r 与scp --------/* ,这两者方式都有人用,但是后者用的话会造成问题就是传递给scp的参数太长,导致失败,解决办法是使用scp -r 进行copy,why we can use this way to solve this problem? Because scp 采用的是递归的方式复制,众所周知,递归方式可以节省资源,所以完美的解决了这个办法。nn同时记录一...
关于make:未找到命令的解决
问题:nn    最近在运行部分java程序是需要编译好的exe文件,但是github的开源项目下只有.c和.h还有<em>make</em>file文件。在没有安装VS的情况下,网上查询windows下<em>make</em>命令的部分搜索结果行不通。后面想到了使用Cygwin(Mingw没有<em>make</em>,需要另外加装<em>make</em>)来在模拟Linux平台下编译C程序。Cygwin官网下载,然后点点点,一路安装完,运行,发现没有<em>make</em>n...
关于liunx代码编译中提示\r找不到文件或者目录
今天在编译文件中<em>bin</em>/dashboard-server时,提示我/r找不到文件或目录,后来发现主要原因是因为在windows中编译过后,再linux中的格式还是dos格式,而linux只能执行为unix格式的脚本。nn在网上找到了解决方案: n 用vim打开sh脚本文件 vim filename打开后输入nn:set ff 然后回车 再重新设置下文件格式:nn:set ff=unix 然...
opencv编译中遇到的error(1)
错误1 error C4996: 'fopen': This function or variable may be unsafe. Consider using fopen_s instead. To disable deprecation, use _CRT_SECURE_NO_WARNINGS. See online help for details. f:\opencv2.
安装php扩展时执行命令/user/bin/phpize 出现错误
执行命令/user/<em>bin</em>/phpize <em>出现</em>如下错误nnCannot find config.m4.nMake sure that you run '/usr/<em>bin</em>/phpize' in the top level source directory of the modulenn解决方法:nn执行如下命令找到config0.m4nnfind / -nameconfig0.m4nn查看其所在...
Android源码编译的记录
2017.6.15 这是个人笔记来着,路人请自动跳过Refer to https://source.<em>android</em>.com/source/buildingn <em>bash</em> n cd xd_build_x86 n <em>bash</em> ./aosp_init.sh ~/XDRoot/<em>android</em>_6.0.0_r41 n cd ../<em>android</em>_6.0.0_r41 n source build/env
Linux中如何利用make进行源码的编译和安装
写这篇文章仅仅来解释<em>make</em>工具的源码编译功能,不去涉及gcc, 不去涉及为什么源码编译安装软件。 n首先,<em>make</em>是一个编译程序,但是这仅仅是一个程序,不能适用于所有的内核,所以在编译不同的源码的时候需要不同的规则来编译,而这个规则写在Makefile文件当中,当使用<em>make</em>的时候,<em>make</em>会使用该目录下的Makefile作为参数配置文件,来进行<em>make</em>的编译操作,听起来好像很简单,那么来看一下...
安装redis 及常见问题
安装1、检查是否安装了redis[root@location ~]# rpm -qa | grep redis2、下载redis官网地址:http://redis.io/      我下的版本:redis-4.0.10.tar.gz下载地址http://download.redis.io/releases/redis-4.0.10.tar.gz3.创建文件夹[root@location ~]# m...
出现Permission denied的解决办法
sudo passwdn输入密码nsu rootn再次输入密码n变成root加上用户名即可nn
高通andriod编译问题与解决
问题1:/<em>bin</em>/<em>bash</em>: prebuilts/misc/linux-x86/bison/bison: No such file or directory n当<em>出现</em>该问题时,通过阅读,并不是没有bison这个运行库,而是没有找到该库; n执行下面命令即可。 nsudo apt-get install g++-multilib gcc-multilib lib32ncurses5-dev lib3...
编译android源码时的错误
mkdir: 无法创建目录"out": 权限不够rn/<em>bin</em>/<em>bash</em>: out/target/product/generic/clean_steps.mk: 没有那个文件或目录rnmkdir: 无法创建目录"out": 权限不够rnChecking build tools versions...rnmkdir: 无法创建目录"out": 权限不够rn/<em>bin</em>/<em>bash</em>: out/casechec
根目录vmlinux的编译过程
vmlinux的依赖和编译过程
arm-arago-linux-gnueabi-gcc没有那个文件或目录
用飞凌提供的交叉编译工具cross-tools-am335x-4.5.3.tar.bz2  解压后得到arm-arago-linux-gnueabi-gcc,在配置环境变量后发现narm-arago-linux-gnueabi-gcc没有那个文件或目录,于是跳到<em>bin</em>下去执行发现还是提示:arm-arago-linux-gnueabi-gcc没有那个文件或目录nnnn可在<em>bin</em>下明明存在
android8.1 高通平台abl 编译不过问题
代码从服务器拉下来,编译都没问题,但是由于磁盘空间小,挪了个位置,导致能编译过的代码编译失败:nnn [  0% 827/118012] build out/target/product/apollo/abl.elfn FAILED: out/target/product/apollo/abl.elf n /<em>bin</em>/<em>bash</em> -c &quot;<em>make</em> -j4 -C bootable/bootloader/...
Ubuntu 14.04 编译Android系统遇到的为题
Ubuntu 14.04 下载Android源码后执行编译时遇到的问题记录:n1、bmp_to_raw 未知命令nfile /vendor/mediatek/proprietary/bootable/bootloader/lk/dev/logo/tool/bmp_to_raw  显示为32位文件nuname -a  显示64位系统n解决方法:napt-get install g++-mu
Android源码编译:Android系统源码编译时遇到的错误及解决方法
下面是在编译安卓源码是遇到的错误,记录下来,防止再次遇到。nn1.编译时候<em>出现</em>如下错误:nnbuild/core/base_rules.mk:134: *** prebuilts/gcc/darwin-x86/arm/arm-linux-<em>android</em>eabi-4.6/lib32: nnMODULE.HOST.STATIC_LIBRARIES.libbfd already defined by p...
[已解决]cygwin -bash:make: 未找到命令,发现没有安装makemake -v 报错,那么直接安装就好了
cygwin -<em>bash</em>:<em>make</em>: 未找到命令,n重新点击我们的安装包n在选择保的时候,展开Develnn参考:nhttp://blog.sina.com.cn/s/blog_70e6ed3a01019dmq.html
Android SELinux 一个编译错误
最近在做Android6.0项目,修改了SELinux的te文件, 单独编译这个模块没问题,后来<em>make</em> clean后编译不过了。报下面的错误.nn/<em>bin</em>/<em>bash</em>: out/host/linux-x86/<em>bin</em>/insertkeys.py: Permission deniedn<em>make</em>: *** [out/target/product/msm8909/obj/ETC/mac_permis
centos7.2 安装最新版本git
参考网站git-scm.com/book/en/v2/Getting-Started-Installing-Gitnnnnn安装遇到问题nn[root@VM_8_244_centos git-2.12.0]# <em>make</em> configuren GEN configuren/<em>bin</em>/sh: autoconf: command not foundn<em>make</em>: *
Android 源码编译make的错误处理
Android 源码编译<em>make</em>的错误处理
编译android4.4源代码出现的问题及解决
0 由于编译uboot和kernel都比较顺利,因此不做描述nn1 /<em>bin</em>/<em>bash</em>:bios:未找到命令解决:sudo apt-get install bisonn2 cannot find flexn解决:sudoapt-get install flex n3 安装软件时发生依赖问题,n解决:更换国内软件源,网易、搜狐等n4 <em>编译源码</em><em>出现</em>:host Executable
makefile中SHELL变量的设置
以前在很多<em>make</em>file中也看到过对SHELL的设置,但是没看到哪里有引用,不清楚为什么要设置SHELL;很多<em>make</em>工程中没有设置SHELL执行起来也好像没有问题,所以一直也没有发现SHELL问题,最近调试<em>make</em>file想起来了,学习总结下<em>make</em>file中SHELL变量的设置。
ubuntu 12.04.5 LTS搭建海思android SDK编译环境遇到的问题总结
java环境安装:rn下载jdk1.6.0_45.<em>bin</em>并安装rn假设jdk的安装目录为/usr/java/,在/etc/profile末尾加上如下语句:rnexport JAVA_HOME=/usr/java/jdk1.6.0_45rnexport CLASSPATH=.:$JAVA_HOME/lib/dt.jar:$JAVAPATH/lib/tools.jarrnexport PATH=$PA
Ubuntu每次打开终端出现错误提示的解决方法
每次打开终端会<em>出现</em>问题,那就说明<em>bash</em>rc文件<em>出现</em>问题,rnrnrn第一步,排除法,确定是哪个用户的哪个<em>bash</em>rc文件<em>出现</em>问题rnrnrnrn切换到root用户登陆,打开终端,结果没有<em>出现</em>问题,说明问题<em>出现</em>在jeremy用户上rn切回jeremy用户,寻找是哪个<em>bash</em>rc文件,将/home/jeremy/.<em>bash</em>rc的<em>bash</em>rc文件移动到其他文件夹,结果打开后,错误消失,说明,问题<em>出现</em>在
搭建fabric1.0开发环境 make peer和make docker命令时遇到的问题集合
中间因为各种原因遇到了很多很多的问题,趁着自己还记住一些赶紧记录下来:n    1:<em>make</em> docker 时遇到了 “fork/exec /usr/<em>bin</em>/gcc: cannot allocate memory" during docker build”报内存不够,那就增大虚拟机的内存即可:(点击设置,内存增大即可)nn   n   2:fatal error: ltdl.h: No s
ubuntu 14.04 PCL源码编译报错
In file included from /usr/include/eigen3/Eigen/LU:27:0,                 from /usr/include/eigen3/Eigen/Eigenvalues:11,                 from /home/seven/lib/pcl/common/include/pcl/common/eigen.h:60,  ...
android编译错误,找不到命令
rn举个例子:rn  UIMAGE  arch/arm/boot/uImagern"mkimage" command not found - U-Boot images will not be builtrn/home/liwei/share/my<em>android</em>/kernel_imx/arch/arm/boot/Makefile:80: recipe for target 'arch/arm/
CentOS 安装g++ (make提示:g++命令未找到)
通常情况下在centos下安装软件就用yum. rn 关键是,使用yum你的知道安装包的名字是什么。rn如果直接键入yum install g++,会告诉你没有这个包。rn所以你应该使用gcc-c++,这才是这个包的名字。rn所以应该是执行:yum install gcc-c++
安装 mips linux gnu gcc 提示找不到文件
把 mips-inux-gnu-gcc 所在的<em>bin</em>目录加入到path中运行,提示找不到文件 No such file or directory n此时安装 lsb-core 即可解决 nsudo apt-get install lsb-core n<em>出现</em>问题的原因是有些程序编译时候和 lsb-core 的一些库混在一起了,这样在其他地方运行,自然提示找不到文件。...
linux ln 链接-符号连接层数过多问题解决
语法:ln -s 源文件 目标文件n[root@bogon <em>bin</em>]# ln -s ./c<em>make</em> ../c<em>make</em>nn导致Linux符号连接的层数过多问题n其实就是创建符号链接的时候一定要使用绝对路径,nn
Linux下rm命令提示“Argument list too long”无法执行解决方法
rm命令  Argument list too long错误。 rnrnls|xargs rm -f
Linux下执行可执行文件提示:No such file or directory的解决方法
最近在Linux下安装交叉编译链工具,解压完成后执行却提示:No such file or directory。查了一下发现我是64位的Ubuntu系统但是执行的是32位程序,缺少32位lib库所以无法执行。rn  tips: uname命令可打印系统信息rnfile命令可打印文件信息 rn  解决方法: rn安装i386架构及系列库rn  root权限下 rndpkg --add-archite
linux编译错误问题记录
1.linux下编译busybox-1.28.0时使用<em>make</em> menuconfig出错问题:rnHOSTCC  scripts/basic/fixdeprnIn file included from /usr/include/sys/socket.h:40,rn                 from /usr/include/netinet/in.h:25,rn               
Linux下安装memcached遇到的一系列问题
root@VM_24_101_centos libevent-2.1.8-stable]# <em>make</em> n  GEN      test/rpcgen-attemptednwhich: no python2 in (/usr/local/s<em>bin</em>:/usr/local/<em>bin</em>:/s<em>bin</em>:/<em>bin</em>:/usr/s<em>bin</em>:/usr/<em>bin</em>:/root/<em>bin</em>:/root/<em>bin</em>)n  File "
linux下Make编译出错,输入/输出错误原因及解决办法
输入/输出错误rnrncollect2: error: ld returned 1 exit statusrnrnrn原因:rn          编译时工程放在 /mnt/hgfs 共享目录下了rnrnrn解决办法:rn         把工程放在本地的其他目录下,即可编译成功
LFS编译记录
磁盘分区cfdisk /dev/hdan出错了,由于系统分配磁盘时不一定用hda作为名称,有可能是hdd或其他名称的,只要把名称找到并修改成相应的代码即可进入下一步cd /devnls | grep hdn n既然如此,使用hdd吧。cfdisk /dev/hddn n【交换分区swap】 n通过‘左右’键移动到【new】->【primary】->【size】输入512->【beginning】获得
记一次编译Android源码
前言:已经是第二次编译Android源码了,由于距离第一次编译Android源码的时间较长,所以有一些<em>编译源码</em>的命令以及编译的时候遇到问题的解决方法都忘记了,需要重新查找相关资料,这样就显得有些事倍功半了,故写下这篇文章记录编译Android源码的方式以及编译的时候遇到的问题。nnnnn编译前的准备nn  工欲善其事,必先利其器。在<em>编译源码</em>前需要进行一些相关环境的配置,有以下几点需要准备nnn电脑
rm -f ./* 参数列表过长
用以下命令替换:nfind . -name “"|xargs rm -rf "”nn
安装keepalived, 以及安装时遇见的问题
安装keepalived1、下载keepalived安装包。官网地址2、上传到linux相关目录,并且用tar -xvf 报名解压,解压后相关目录如下图:3、在当前目录执行 ./configure命令3.1如果<em>出现</em>类似错误,说明安装失败。n configure: error: n !!! OpenSSL is not properly installed on your system. !
Linux执行 wget命令:提示command not found的两种解决方法
1、rpm 安装nn下载wget的RPM包:nnhttp://mirrors.163.com/centos/6.8/os/x86_64/Packages/wget-1.12-8.el6.x86_64.rpmnn执行 rpm -ivh wget-1.12-8.el6.x86_64.rpm2、yum安装nnyum -y install wgetnn这里详细讲解第二种方法yum安装nn使用wget命令,...
安装交叉编译工具arm-linux-gcc命令未找到的问题
arm-linux-gcc -v 查看交叉编译工具版本号$ arm-linux-gcc -vnarm-linux-gcc:未找到命令$ cd /usr/local/arm/4.5.1/<em>bin</em>n$ ./arm-linux-gcc -vn<em>bash</em>: ./arm-linux-gcc: 没有那个文件或目录n$ ./arm-none-linux-gnueabi-gcc -vn<em>bash</em>: ./arm-none...
新版本caffe脚本运行无权限,#!/usr/bin/env sh
今天运行新版caffe(150818)运行脚本老师提示 无权限。 rn在论坛里看到下面这个解释rn应该就是没有指定<em>bash</em>作为此脚本的解释器,在最var这个脚本rn的最上面加上#!/<em>bin</em>/<em>bash</em>看看。rnrnrn我马上打开自带的一个脚本:如下rn#!/usr/<em>bin</em>/env shrn./build/tools/caffe train --solver=examples/mnist/lenet_
Python编译器实现内幕:添加一个新语句
Python编译器实现内幕:添加一个新语句本文尝试理解Python前端的编译实现内幕,如果仅仅是读取文档,或者查看Python的实现代码,会让人感觉迷迷糊糊的,所以我的想法是动手来做一些事情:添加一个新语句until到Python编译器实现里。 所有跟本文相关的代码,都是使用Python3.4.3版本的代码,可以从CSDN的代码托管里找到,连接如下:https://code.csdn.net/ca
shell练习题二
n一、取出/etc/passwd文件中shell<em>出现</em>的次数rn问题:下面是一个/etc/passwd文件的部分内容。题目要求取出shell并统计次数,shell是指后面的/<em>bin</em>/<em>bash</em>,/s<em>bin</em>/nologin等,如下面/<em>bin</em>/<em>bash</em><em>出现</em>4次,/s<em>bin</em>/nologin<em>出现</em>22次。rn/<em>bin</em>/<em>bash</em>rn/s<em>bin</em>/nologinrn/s<em>bin</em>/nologinrn/s<em>bin</em>/nolog...
编译文件时make install报错
在一般用户使用时rn正常编译文件四步骤:rn$ tar -zxvf filename //解压rn$ ./configure //去解压目录下执行rn$ <em>make</em> //编译所有rn$ <em>make</em> install //将编译好的文件进行安装rnrn在执行<em>make</em> install时遇到了下面的错误:rn[hadoop@hadoop01 ~/tools/xz-5.0.3]$ <em>make</em> installrnMaking ...
gcc-linaro-arm-linux-gnueabihf-4.7-2013.04-20130415_linux.tar.xz
树莓派3的linaro系列系统的交叉编译器
【slam初探】安装opencv中遇到的问题(cmake)
我使用的系统为Ubuntu Kylin,安装opencv时依旧遇到了一些令人困惑的问题。整理如下:n1.c<em>make</em>过程中下载ippicv_linux_20151201长时间无响应n原因:网络原因,下载速度极慢nn解决方法:手动下载,然后替换已下载的不完整文件。n      下载地址:https://raw.githubusercontent.com/Itseez/opencv_3rdpa
打造自己的Android源码学习环境之五:编译Android源代码
打造自己的Android源码学习环境之五:编译Android源代码下载<em>android</em>源代码之后,可以开始编译了。0. 编译Android源码0.1 设置环境当前目录是执行repo init时所在的目录。$ . build/envsetup.sh或者$ source build/envsetup.sh$ source build/envsetup.shincluding device/asus/fug
android源码编译错误的解决
一定要看配置环境,如果缺少库文件或者环境不对,出的错误提示简直各种各样nn nn以Ubuntu16.04编译<em>android</em>8.1为例nnnsudo apt-get install libx11-dev:i386 libreadline6-dev:i386 libgl1-mesa-dev g ++ - multilib nsudo apt-get install -y git flex biso...
总结一下protobuf安装
protobuf可以在github上:https://github.com/google/protobuf n或者直接下载2.6.1版本:https://github.com/google/protobuf/archive/v2.6.1.zipnn直接下载的2.6.1安装包可以按照以下步骤安装:ntar -xzf protobuf-2.6.1.tar.gz ncd protobuf-2.
linux新创建用户登陆后-bash
为linux 创建用户后登录之后不显示用户名 显示如:-<em>bash</em>-xx$ 是因为没有为用户拷贝.<em>bash</em>等文件
ubuntu16.04 编译android6.0遇到的两个错误解决办法
编译出错n<em>bash</em>: prebuilts/misc/linux-x86/ccache/ccache: 没有那个文件或目录nCannot launch Jack Server
RK3399编译
参考官网开始编译n官网n下载地址n编译前准备: 环境搭建n安装openjdk8nsudo add-apt-repository ppa:openjdk-r/ppansudo apt-get updatensudo apt-get install openjdk-8-jdknn安装其他依赖库nsudo apt-get install git-core gnupg flex bison gperf l...
第一次编译Android源码及碰到的问题
一、安装Ubuntu rn1、在虚拟机里安装ubuntu-16.04-desktop-amd64.isornrnrn2、安装VMware Tools  rn rnrnrnrnrn如果是未安装应该显示为 “安装VMware Tools”,点下去。 rn稍等一会会弹出界面 rn rn主要就是那份.gz的安装包。 复制到tmp,解压rncp VMwareTools-10.1.6-5214329.tar.
源码太多,编译太慢了怎么办?
<em>make</em> -j4nn利用多条CPU流水线nn完事
分布式spark-2.1.0-bin-hadoop2.6集群环境搭建
安装spark之前需要安装scala-2.12.6nnspark初始目录状态nnnn配置scala环境变量nnvim ~/.<em>bash</em>_profilennnnnnexport SCALA_HOME=/home/hadoop/spark/scala-2.12.6nn${SCALA_HOME}/<em>bin</em>nnnn键入source ~/.<em>bash</em>_profile使scala环境变量立刻生效nn键入scala...
安装caffe的每一个小问题
遇到了很多问题,必须mark一下,估计未来还会经历rnrnrn@在编译caffe的时候<em>出现</em><em>make</em>: /usr/local/<em>bin</em>/mexext命令未找到错误,其实这个mexext存在于matlab的安装路径里。是因为它没有安装到/usr/loacal/<em>bin</em>下,所以这里mexext命令在<em>bash</em>中找不到,把matlab安装目录/<em>bin</em>/mex链接到/usr/<em>bin</em>, (lnrn -s 我的mat
flume-ng启动时遇到报错时的解决
rn在命令行下启动<em>bin</em>/flume-ng时,竟然遇到报错,找到如下解决办法rn错误如下:rn<em>bin</em>/flume-ng: line 82: syntax error in conditional expression: unexpected token `('rn<em>bin</em>/flume-ng: line 82: syntax error near `^java\.library\.path=(.'rn...
MacOSX10.5
解决在Mac上<em>编译源码</em>时,<em>出现</em>缺少MacOSX10.5的问题。。。。
执行*.sh命令出现问题,解决方案
n背景 执行*.sh命令时候<em>出现</em>如下问题nnn: invalid optionnUsage: /<em>bin</em>/<em>bash</em> [GNU long option] [option] ...n /<em>bin</em>/<em>bash</em> [GNU long option] [option] script-file ...nGNU long options:n --debugn --debugg...
Linux下出现permission denied的解决办法
Linux下经常<em>出现</em>permission denied,原因是由于权限不足n命令行中输入nsudo passwdn他会提示输入密码然后确认nsu rootn再次输入密码即可n这时候你会发现你输入命令前的 $ 号已经变成 # 号,这就证明你已经成功了nnn...
rlwrap安装(解决Linux下无法使用上下键)
在Linxu下的sqlplus无法使用上下键问题可以安装rlwrap来解决,具体如下:--安装readlinen[root@rac1 iso]# yum install readline*--安装rlwrapn[root@rac1 opt]# tar -zxvf rlwrap-0.42.tar.gzn[root@rac1 opt]# cd rlwrap-0.42n[root@rac1 rlwrap-
redis在Linux安装报错
redis在CentOS7上安装及配置开机启动服务
公司编译Jack Server报错
Communication error with Jack server (60), try 'jack-diagnose' or see Jack server lognn假期前新来了员工,因为提前请假回家。放假回来编译系统发现jack server报了这个错,首先想到是端口被占用了nn修改了home目录下的nnY:\.jack-server\config.propertiesnnY:\.jac...
linux下的脚本文件格式导致脚本运行出现invalid option失败
如果脚本文件在执行的时候<em>出现</em>如下图所示的错误: n n请检查下改脚本文件是否是格式问题: n通过vim编辑器访问该文件,进去的时候查看最下面一行的文件格式即可: n n如下是脚本的格式问题导致执行的时候<em>出现</em>invalid option的选项。nn解决办法: n在vim编辑器的模式下,使用set ff=unix的方式实现dos格式转化为unix格式。nn如下便是正常的unix格式的文档。 n...
linux安装jdk报错无法执行二进制文件
    今天本来美滋滋的在linux上安装jdk,一顿操作之后一个java -version甩出,结果给我报错,说无法执行二进制文件!What?什么鬼?    好,先检查是不是环境变量没有配置好,检查完了没问题。    这就奇怪了,一般jdk不行都是环境变量的问题啊,于是我直接到jdk的<em>bin</em>目录下执行java命令,也是报错。突然一想,二进制文件,为什么这里面的都是二进制文件,叮~特么不会是我的l...
cm13 编译过程中遇到的几个问题及解决方法
在尝试编译一个cm13的rom刷到小米3W上,编译过程中遇到一些问题,在这里记录一下解决方法。问题一[ERROR] Failed to execute goal org.apache.maven.plugins:maven-dependency-plugin:2.10:get (default-cli) on project standalone-pom: Couldn't download art
使用useradd添加用户后默认sh为/bin/sh导致无法使用history
ubuntu使用useradd添加用户后默认sh为/<em>bin</em>/sh导致无法使用historyn很多按键也会<em>出现</em>乱码。n这是由于使用的sh是/<em>bin</em>/sh而不是/<em>bin</em>/<em>bash</em>导致的。nnn既然已经创建了用户,只能通过修改/etc/passwd解决了。nyourUserName:x:1002:1003::/home/yangming:n改为nyourUserName:x:1002:1
bash: usr/local/3.4.1/bin/arm-linux-gcc: 没有该文件或目录 解决方法!
网上一般<em>出现</em>这种问题都是一些依赖的东西没有安装<em>出现</em>的问题,如果排除了这些问题,那么请试一试我的方法。1、 进入你的交叉编译工具的目录执行 ldd arm-poky-linux-gnueabi-gcc,会<em>出现</em>一些依赖的关系,下面是我的信息提醒:linux-vdso.so.1 (0x00007ffe24557000) libm.so.6 =&amp;gt; /home/xufan/tbox/poky/1.6....
make出现错误
<em>make</em>file文件执行出错
3.cdh hue3.9编译集成问题(tar)
环境依赖参考对应版本:nn     http://archive.cloudera.com/cdh5/cdh/5/hue-3.9.0-cdh5.7.2/manual.htmlnn nn1.避免在编译的时候缺少libmysqlclient错误nn使用rpm安装解压后rpm -qa | grep -i mysql才能显示所有的mysql服务nn在编译hue时候会无法识别到mysql的环境,nn注意在安...
linux 命令行出现-bash-4.2$的解决办法
输入这两句话,然后关闭终端,重新登录一下就好了nncp /etc/skel/.<em>bash</em>rc /root/nncp /etc/skel/.<em>bash</em>_profile /root/nn同样的方法,如果是非root而是某用户,就把目标路径换成相对应的用户路径即可。nn这两个文件通常在建立用户目录是自动添加,如果是你手动创建文件夹在/etc/passwd指定目录也会<em>出现</em>该错误。...
深入浅出ESP32开发之一Linux下ESP32交叉编译环境搭建
--作者:燕十三(flyingcys)rn-- blog:http://blog.csdn.net/flyingcysrn--QQ:294102238rn一、ESP32概述rnEPS32是乐鑫最新推出的集成2.4GWi-Fi和蓝牙双模的单芯片方案,采用台积电(TSMC)超低功耗的40nm工艺,拥有最佳的功耗性能、射频性能、稳定性、通用性和可靠性,适用于多种应用和不同的功耗要求。rnESP32搭载低
当在cygwin中执行java中的命令时,提示No such file or directory
当在cygwin中执行java中的命令时,提示No such file or directoryrnrnadmin@admin-PC /rn$ hadoop versionrn/cygdrive/f/大数据视频/HadoopTool/hadoop-0.20.2/hadoop-0.20.2/<em>bin</em>/hadoop:行258: /cygdrive/f/JDK/jdk/<em>bin</em>/java: No such
搭建海思开发环境遇到的小问题
1.安装交叉开发工具链时的错误n错误log: narm-hisiv300-linux-gcc: command not foundn解决方法: n这是因为宿主机是64 位 而交叉编译器是针对32位的开发板制作的。所以要安装对应的32位库。 n我的linux宿主机是ubuntu 16.04 64位。 n安装命令: nsudo apt install lib32z1-devn2.执行 sdk.un
linux安装redis遇到过的一些坑
linux配置redis
cygwin make未找到命令
重新打开setup.exe nn在下包的时候选择categorynn选择Devel-&amp;gt;<em>make</em> 
Android之TextView实现文字过长时省略部分或者滚动显示
Android之TextView实现文字<em>过长</em>时省略部分或者滚动显示
make时提示GCC找不到,但又能查到版本问题
daron@daron-virtual-machine:~/linux/tiny6410/linux-2.6.38$ <em>make</em><em>make</em>: gcc: Command not found  HOSTCC  scripts/kconfig/conf.o/<em>bin</em>/sh: 1: gcc: not found<em>make</em>[2]: *** [scripts/kconfig/conf.o] Error 127<em>make</em>...
强连通分量及缩点tarjan算法解析
强连通分量: 简言之 就是找环(每条边只走一次,两两可达) 孤立的一个点也是一个连通分量   使用tarjan算法 在嵌套的多个环中优先得到最大环( 最小环就是每个孤立点)   定义: int Time, DFN[N], Low[N]; DFN[i]表示 遍历到 i 点时是第几次dfs Low[u] 表示 以u点为父节点的 子树 能连接到 [栈中] 最上端的点   int
C++链表实现的多项式乘法下载
C++链表实现的多项式乘法 需要逐项输入 相关下载链接:[url=//download.csdn.net/download/LegolasMzy/2241028?utm_source=bbsseo]//download.csdn.net/download/LegolasMzy/2241028?utm_source=bbsseo[/url]
中文版C#Web服务高级编程Part02下载
中文版C#Web服务高级编程,总共有十二个文件,其中一个文件是原代码。 相关下载链接:[url=//download.csdn.net/download/yannizhang/2791327?utm_source=bbsseo]//download.csdn.net/download/yannizhang/2791327?utm_source=bbsseo[/url]
WINCC模拟设置步骤下载
实现西门子WINCC人机界面与PLCSIM模拟软件通信的操作步骤 相关下载链接:[url=//download.csdn.net/download/net_happlsx/2961173?utm_source=bbsseo]//download.csdn.net/download/net_happlsx/2961173?utm_source=bbsseo[/url]
文章热词 机器学习教程 Objective-C培训 交互设计视频教程 颜色模型 设计制作学习
相关热词 mysql关联查询两次本表 native底部 react extjs glyph 图标 区块链什么时候出现的 学习java基础语法时
我们是很有底线的