error C2059: 语法错误 : “{” [问题点数:40分,结帖人weiweixiaopasta]

一键查看最优答案

确认一键查看最优答案?
本功能为VIP专享,开通VIP获取答案速率将提升10倍哦!
Bbs1
本版专家分:97
结帖率 94.29%
Bbs12
本版专家分:362222
版主
Blank
名人 2013年 荣获名人称号
Blank
探花 2011年 总版技术专家分年内排行榜第三
2010年 总版技术专家分年内排行榜第三
Blank
进士 2012年 总版技术专家分年内排行榜第五
Blank
金牌 2012年1月 总版技术专家分月排行榜第一
Bbs12
本版专家分:433039
版主
Blank
榜眼 2009年 总版技术专家分年内排行榜第二
2005年 总版技术专家分年内排行榜第二
Blank
进士 2018年总版新获得的技术专家分排名前十
Blank
银牌 2009年7月 总版技术专家分月排行榜第二
2009年3月 总版技术专家分月排行榜第二
2009年1月 总版技术专家分月排行榜第二
2005年7月 总版技术专家分月排行榜第二
2005年5月 总版技术专家分月排行榜第二
2005年3月 总版技术专家分月排行榜第二
Blank
优秀版主 优秀小版主
2015年8月优秀小版主
2015年9月优秀小版主
2015年5月优秀小版主
2015年2月论坛优秀版主
Bbs6
本版专家分:5507
Bbs2
本版专家分:390
Bbs1
本版专家分:97
Bbs1
本版专家分:97
Bbs1
本版专家分:97
Bbs2
本版专家分:390
Bbs1
本版专家分:97
Bbs6
本版专家分:6541
Bbs2
本版专家分:390
Bbs1
本版专家分:97
【VS2013】error C2059: 语法错误:“::” error C2589: “(”:“::”右边的非法标记
【VS2013】<em>error</em> <em>C</em>2059: <em>语法错误</em>:“::” <em>error</em> <em>C</em>2589: “(”:“::”右边的非法标记
fatal error LNK1181: 无法打开输入文件 错误
vs2008 编译一个软件 错误 1 fatal <em>error</em> LNK1181: 无法打开输入文件“nafxcw.lib;LIB<em>C</em>MT.lib;../common/zlib/zlib.lib” 是不是
C语言#error的作用
#<em>error</em> 使您可以从代码中的特定位置生成错误;就是说执行到这一句时自动产生错误,例如:#if DEBUG#<em>error</em> DEBUG is defined // 进入这里将产生错误#endif
VS2015报C2059和C2334错误如何修改?
有如下一段代码: Filter<em>C</em>allTab(const cvv::impl::Filter<em>C</em>all &filter<em>C</em>all, const QString& filterViewId) : Multi
error C2143: syntax error : missing ';' before '}' 怎么解决
#include #include class A { int x,y; public: int z; A(int xx=0;int yy=0;int zz=
1>LINK : fatal error LNK1181: 无法打开输入文件"rassapi.lib”
1>LINK : fatal <em>error</em> LNK1181: 无法打开输入文件"rassapi.lib” 请问大家VS2010这个问题怎么解决?
./configure: error: the HTTP rewrite module requires the PCRE library
有时候,我们需要单独安装nginx,来处理大量的下载请求。单独在<em>C</em>entos5安装nginx遇到的rewrite和HTTP cache错误解决办法: wget http://nginx.org/download/nginx-0.8.33.tar.gz tar -zxvf nginx-0.8.33.tar.gz  cd nginx-0.8.33 ./configure --prefi
VS2015 fatal error LNK1104: 无法打开文件“kernel32.lib”
VS2015 装了Boost 测试程序时,报错 fatal <em>error</em> LNK1104: 无法打开文件“kernel32.lib” 附加依赖项已经添加了
关于LINK : fatal error LNK1181: 无法打开输入文件“kernel32.lib”
我的工程最开始的时候不会出现这个错误,是我后来改了一下用户环境变量就一直出现在这个问题 LINK : fatal <em>error</em> LNK1181: 无法打开输入文件“kernel32.lib”, 然后我重
error: request for member ‘RESIDUE’ in something not a structure or union
我也是在linux下,用gcc编译的.c文件。以上各种方法(*m)->、 (*m). 、*(m)我都试过了,还是报错。<em>error</em>: request for member ‘RESIDUE’ in so
VS + CUDA 出现语法错误 error C2059: 语法错误:“<” 求大神帮解决下啊~~~
-
关于【error: expected identifier before ‘(’ token】错误的检查
今天编译一个文件时老是出错,把源头定位到一个结构体中是这样 typedef struct GPJ0 { volatile unsigned int GPJ0<em>C</em>ON; volatile unsigned int GPJ0DAT; }gpio_reg_r; 错误就是: <em>error</em>: expected identifier before '(' token 最后在网上找了一下,发现是GPJ...
error C2589: “(”: “::”右边的非法标记 error C2059: 语法错误 : “::
错误代码举例: size.Width = std::max(size.Width, elementSize.Width); 错误原因:    函数模板max与Visual <em>C</em>++中的全局的宏max冲突。 解决方法:   第一种办法:设置项目属性,在预定义处理器中添加定义NOMINMAX来禁止使用Vsual <em>C</em>++的min/max宏定义。                        ...
error C2059: syntax error : ']',怎么解决。
-
pandas读取csv处理时报错:ParserError: Error tokenizing data. C error: Expected 1 fields in line 29, saw 2
csv文件默认的是以逗号为分隔符,但是中文中逗号的使用率很高,爬取中文数据室就容易造成混淆,所以使用pandas写入csv时可以设置参数 sep=’\t’ ,即以tab为分隔符写入。毕竟tab在中文习惯里用的很少嘛。 那这样在后面读取csv进行数据处理时,一定记得加上一个参数delimiter:delimiter="\t" #这样读入: df=pd.read_csv('path',delimite
jquery ajax error函数和及其参数详细说明
使用jquery的ajax方法向服务器发送请求的时候,常常需要使用到<em>error</em>函数进行错误信息的处理,本文详细的说明了ajax中<em>error</em>函数和函数中各个参数的用法。 一般<em>error</em>函数返回的参数有三个: function(jqXHR jqXHR, String textStatus, String <em>error</em>Thrown)。常见调用代码如下: $.ajax({ u
这是什么原因造成的?LINK : fatal error LNK1181: cannot open input file "D:\Program.obj"
我只是生成了一个dll而已,怎么会这样? LINK : fatal <em>error</em> LNK1181: cannot open input file "D:\Program.obj"
fatal error C1189: #error : "No Target Architecture" 解决办法一
在编译程序的时候发现报这个错误,在网上看到很多文章,说设置include路径,lib目录等等,都没有解决。最后调整了以下include文件的顺序,问题解决了。例如 从头文件a.h中截取的一段 typedef struct {     DWORD Data1;     WORD Data2;     WORD Data3;     BYTE Data4[ 8 ]; } GUI
error C2059:----为什么会有这么奇怪的错误
正在学数据结构(严蔚敏),第二章的线性表想实验下,发现问题了... 在<em>C</em>方面我还是个新手,希望高手们指教指教 编程环境为vc++6.0 代码如下: DataStructure.h: #ifndef _
configure: error: no acceptable C compiler found in $PATH 问题解决
转自http://raulkang.blog.51cto.com/210239/573151 [root@localhost ~]# cd msmtp-1.4.20 [root@localhost msmtp-1.4.20]# ./configure checking build system type... i686-pc-linux-gnu checking host syste
IOError: [Errno 2] 错误
做python开发,经常遇到IOError: [Errno 13]
小程序 图片出错、加载失败处理(image组件的binderror事件处理)
先说下思路:这种处理 都是修改 原有的 出错数组图片路径对应的值 ,将其改为正确的图片路径。(小程序类似这样的改错,都是这个思路) 正题: 官网的image组件我就不详细说了,官网bind<em>error</em>错误事件处理并没有详细的说明,如果在获取网络图片出现404 nofound的情况下要怎样处理呢? 有单张图片的处理、和多张(数组)图片的处理 写法大同小异 以前html的写...
ERROR: Could not delete DB checkpoint for REPLICAT RLISDBCC (Database login required to delete datab
在OGG的replicat进程配置完成后,发现配置错误,或者想删除某个进程的时候,报‘ERROR: <em>C</em>ould not delete DB checkpoint for REPLI<em>C</em>AT RLISDB<em>C</em><em>C</em> (Database login required to delete database checkpoint).’ GGS<em>C</em>I (centerdb) 22&gt; delete rlisdbcc...
Error: #260-D: explicit type is missing ("int" assumed)的解决方法
今天编译一个STM32程序的时候,遇到了一个问题,编译通不过。 输出的错误信息是: ..\SYSTEM\usart\usart.c(41): <em>error</em>: #260-D: explicit type is missing ("int" assumed) 借鉴他人的解决方法: 双击这个错误,定位到USART.<em>C</em>文件中的第41行。 然后在_sys_exit前面加上void。 ...
求解:error C2059: 语法错误 : “<”
错误发生在这一行: fft<<>>(data2); 很是诧异啊。。 这不是标准的格式吗?
CC++混合编程(error C2059: syntax error : 'string')
extern "<em>C</em>"表示编译生成的内部符号名使用<em>C</em>约定。<em>C</em>++支持函数重载,而<em>C</em>不支持,两者的编译规则也不一样。函数被<em>C</em>++编译后在符号库中的名字与<em>C</em>语言的不同。例如,假设某个函数的原型为:void foo( int x, int y ); 该函数被<em>C</em>编译器编译后在符号库中的名字可能为_foo,而<em>C</em>++编译器则会产生像_foo_int_int之类的名字(不同的编译器可能生成的名字不同,但是都采用了
QtCreator编译错误: -1: error: [debug/main.o] Error 1 问题的解决办法
    在使用Qt的时候经常会出现一些莫名奇妙的编译报错,有时候真的是无语,经常会遇到诸如 -1: <em>error</em>: [debug/main.o] Error 1 这样的问题,调试了很多次后发现和我自己设置的预编译stdafx.h的头文件有关系。    我常常在.pro文件中使用<em>C</em>ONFIG += precompile_headerPRE<em>C</em>OMPILED_HEADER = stdafx.h    来进...
["32位移植到64"]
情景 在<em>C</em>/<em>C</em>++一些代码中为了高效及方便,是允许嵌入汇编。这在VS的32位编译中,直接嵌入都是没问题的,不需要另外处理,但在64位中编译就会报错了。64位就不支持混编了,错误如下: 1>.\test2.cpp(16) : <em>error</em> <em>C</em>4235: 使用了非标准扩展: 不支持在此结构上使用“__asm”关键字 1>.\test2.cpp(19) : <em>error</em> <em>C</em>2065: “rdtsc”:
(新手求助)错误 1 error C4700: 使用了未初始化的局部变量“a
怎么改??
Redis (error) NOAUTH Authentication required.解决方法
出现认证问题,应该是设置了认证密码,输入密码既可以啦 主要字符串形式! 127.0.0.1:6379> auth "yourpassword"------------------------------------------------------------ 127.0.0.1:6379> set name "hello" (<em>error</em>) NOAUTH Authentication re
error: expected ‘)’ before ‘PRId64’ 解决办法(转)
本文转自:https://blog.csdn.net/beitiandijun/article/details/19156849 <em>error</em>: expected ‘)’ before ‘PRId64’ 原来这个宏定义给c用的,<em>C</em>++要用它,就要定义一个__STD<em>C</em>_FORMAT_MA<em>C</em>ROS宏显示打开它。 c++使用PRID64,需要两步: 包含头文件:&amp;lt;inttypes.h&amp;gt;...
Redis第一次启动,SHUTDOWN时提示: (error) ERR Errors trying to SHUTDOWN. Check logs.
今天我也是第一次玩redis,从下载到安装到helloworld一切顺风顺水,谁知在最后关闭redis时,出现了(<em>error</em>) ERR Errors trying to SHUTDOWN. <em>C</em>heck logs.错误。下面贴出我的解决过程(可能有点繁琐): 错误重现: 解决过程: ...
std::min error C2059: 语法错误:“::” 的解决方法
std::min <em>error</em> <em>C</em>2059: <em>语法错误</em>:“::” 的解决方法下面这段代码: size_t n = std::min(count_, num_elements);编译会出现这样的错误:1> <em>error</em> <em>C</em>2059: <em>语法错误</em>:“::” 1> <em>error</em> <em>C</em>2589: “(”:“::”右边的非法标记解决办法将std::min用括号括起来,问题解决。 size_t
error C4996---解决方法
<em>error</em> <em>C</em>4996: 'pcl::SA<em>C</em>_SAMPLE_SIZE': This map is deprecated and is kept only to prevent breaking existing user code. Starting from P<em>C</em>L 1.8.0 model sample size is a protected member of the Sample<em>C</em>onsen
[ERROR] Failed to execute goal org.eclipse.jetty:jetty-maven-plugin:9.4.14.v20181114:run (default-cl
[ERROR] Failed to execute goal org.eclipse.jetty:jetty-maven-plugin:9.4.14.v20181114:run (default-cli) on project springExec: Failure: Failed to bind to 0.0.0.0/0.0.0.0:8080: Address already in use: b...
fatal error LNK1181: cannot open input file 'qtmain.lib'
先安装vs2008,然后安装QT4.6,再安装QT-VS add on插件。 配置后,找了一个qt例子运行,debug可以链接exe文件,但是在release下提示: fatal <em>error</em> LNK1
[ERROR] Failed to execute goal org.apache.maven.plugins:maven-surefire-plugin:2.22.1:test (default-t
1.解决方法一种是直接在pom文件中配置 &lt;!--执行测试用例的插件--&gt; &lt;plugin&gt; &lt;groupId&gt;org.apache.maven.plugins&lt;/groupId&gt; &lt;artifactId&gt;maven-suref...
【LoadRunner】Error -35061: The “CorrelationParameter_1” argument (number 1) 问题解决方案
在LoadRunner回放时遇到了这个问题 Error -35061: The “<em>C</em>orrelationParameter_1” argument (number 1) is unrecognized or misplaced 这个是指关联时保存的值超出了长度,在web_reg_save_param_ex方法后面加上一句NotFound=warning,变成下面的这个样子就可以了: ...
[报错] [Ubuntu] [Python] MemoryError: Unable to allocate array with shape (x, x) and data type float64
错误信息 MemoryError: Unable to allocate array with shape (430949, 430949) and data type float64 系统环境 Ubuntu 18.04 LTS Python 3.6 原因分析 据传 [1] 是因为触发了系统的 overcommit handing 模式。 事情是这样的,我打算生成一个形状为[430949, ...
【请问】try...catch...可以捕获所有的异常吗?
try { //省略代码 } catch(...) { //省略代码 } 代码大概如上如示。我本以为可以catch所有的异常,没想到结果还是出现了“exe已停止工作” 请问,这是怎么回事?有哪些异常
try-catch处理异常
什么是异常?异常就是不可预测的不正常情况。比如你出门被人打,走路掉坑里等...在程序中异常就是程序出现了bug,而导致程序无法按我们的指令办事。Java采用了 一种面向对象的机制,即把异常看作一种类型,每当发生这种事件时,Java就自动创建一个异常对象,并执行相应的代码去处理该事件。在java当中异常一共分为两种:一种是Exception,另一种则是Error。而Exception下面又分两类,一...
Exception和Error的区别
世界上存在永远不会出错的程序吗?也许这只会出现在程序员的梦中。随着编程语言和软件的诞生,异常情况就如影随形地纠缠着我们,只有正确的处理好意外情况,才能保证程序的可靠性。 java语言在设计之初就提供了相对完善的异常处理机制,这也是java得以大行其道的原因之一,因为这种机制大大降低了编写和维护可靠程序的门槛。如今,异常处理机制已经成为现代编程语言的标配。 今天我要问你的问题是,***请对比Exce...
Exception和Error有什么区别
之前写了一个基础知识的文章,里边已经介绍了Exception和Error的区别,也介绍了异 常的使用规则,但是没有具体说一下在日常使用中的一个规范,有时,面试时会问到的一些 点。 本篇文章稍微梳理一下。 在日常代码编写过程中,肯定不会出现没有错误的程序,无错误的程序有可能会出现在“码农”的幻想中。我们在日常的开发中,异常的处理肯定是大家经常碰到的,但是碰到的时候,咱们是否能正确的把异常...
处理异常方式,try.....catch()
异常 :指的是程序在执行过程中或编译过程中出现了问题,最终会导致JVM的非正常停止 异常的根类是java.lang.Throwable ,其下有两个子类: java.lang.Error   java.lang.Exception 这个就是我们平时说的异常   Throwable体系: Error:严重错误Error,无法通过处理的错误,只能事先避免。 Exception:表示异常,异常产生...
解决ValueError: bad input shape (xxxx, x)
下面看一段机器学习代码: from sklearn import datasets from sklearn.model_selection import train_test_split from sklearn.naive_bayes import GaussianNB from sklearn.model_selection import cross_val_score iris=dat...
ModuleNotFoundError:no module named 'tools.nnwrap' 解决办法
ModuleNotFoundError:no module named ‘tools.nnwrap’ 解决办法 版本 Python3.7 pip 10.0.1 使用‘pip3 install torch’,命令安装torch库,提示如下错误: 经过多方寻找解决方案,仍然无效~~ 最后在PyTorch官网利用其提供的安装命令,成功安装torch库。 根据自己的python版本和电脑配置选择安装命令...
C语言错误 error C2059
如果你也碰到这个错误,并且也排除了参数写错等原因,那么提醒你:可能你定义这个函数的名字系统已经使用了!换个名字试试!
postgresql中sql查询语句报错处理——ERROR: failed to find conversion function from unknown to text
执行复杂查询遇到ERROR: failed to find conversion function from unknown to text 。 后来通过查资料,原来我里面用到别名了,别名直接用的话会报上述错误。  所以需要加 ::text 转换成文本类型 ::int 转换成int类型...
error C2065: 'HMONITOR' : undeclared identifier
-
DELETE_FAILED_INTERNAL_ERROR
DELETE_FAILED_INTERNAL_ERROR Error while Installing APKs 运行安卓项目到真机的时候,遇到了这个问题,手机上安装的此程序已经卸载掉了,可是还是运行失败,安装时删除旧的apk失败,解决办法: 1.点击File 2.点击Settings 3.点击Build,Execuion,Deployment 4.点击Instant Run 5.把打钩的全部去...
CaffeMFC:caffe.pb.h(2525): error C2059: syntax error : 'constant'
下边的语句会报 syntax <em>error</em> : 'constant'。static const Dim<em>C</em>heckMode STRI<em>C</em>T = V1LayerParameter_Dim<em>C</em>heckMode_STRI<em>C</em>T;static const Dim<em>C</em>heckMode PERMISSIVE = V1LayerParameter_Dim<em>C</em>heckMode_PERMISSIVE排错方法:在STRI<em>C</em>T和PE...
error C2059: 语法错误:“::” error C2589: “(”:“::”右边的非法标记
pcl1.7版本pcd_io.h 70:<em>error</em>: <em>C</em>2589: “(”:“::”右边的非法标记
Java异常Error和Exception的区别
异常发生的原因有很多,通常包含以下几大类: 用户输入了非法数据。 要打开的文件不存在。 网络通信时连接中断,或者JVM内存溢出。 这些异常有的是因为用户错误引起,有的是程序错误引起的,还有其它一些是因为物理错误引起的。-要理解Java异常处理是如何工作的,你需要掌握以下三种类型的异常: 检查性异常:最具代表的检查性异常是用户错误或问题引起的异常,这是程序员无法预见的。例如要打开一个不存在文件时,一个
Error: Current license file does not support the EP4C6F17C8N device解决办法(实测有效)
      今天在破解quartus11.0的时候遇到的问题,在正常使用了半天后,突然出现Error: <em>C</em>urrent license file does not support the EP4<em>C</em>6F17<em>C</em>8N device的错误,打开软件已经没有30天试用提示,所以软件应该是破解了,经过多方百度,和实践得到下面解决方法和结果:       1.用破解后bin64下的sys_cpt.dll替换bi...
C/C++ 错误集
开发环境及工具:win7 + Visual Studio 2010 1. unsigned 的边界问题 for (unsigned u = 10; u &amp;gt;= 0; --u) { cout &amp;lt;&amp;lt; u &amp;lt;&amp;lt; &quot; &quot; &amp;lt;&amp;lt; endl; } u = 0 再减就得 -1 不符合要求,这里会转成一个合法的无符号数 4294967295 替代的办法是: ...
求助大佬:MFC检测扩展显示器时回调函数错误怎么解决。
-
求救:编译时出错 ,error C2059 和error C2238
在编译的时候出错,而且奇怪的是,在有些机器上可以编译,有些机器就不行,其中,我引用了 ado.h 这个文件,是不是这个文件有问题? --------------------<em>C</em>onfiguration:
rtmp错误,WriteN, RTMP send Error10054
时间戳过大会导致该错误
visual studio2017错误C2059
//my_list.h #ifndef _MY_LIST_H_ #define _MY_LIST_H_ typedef struct TelPhone { char Name; char TelNum
C# 请教这个设置多显示器复制扩展的类怎么调用?麻烦各位了!
-
vb6.0用什么方法检测是否有副屏存在,求帮忙,急用
-
C语言问题:error C2059: syntax error : '{'
#include #define FORMAT "%c\n%s\n%f\n%f\n%f\n" struct student { char num; char name; float
VS2019安装问题
有没有大佬帮忙教一下,antv-1怎么下载?我的vs2019每次下载到这里就卡住了,官网给的链接也打不开,谢谢大佬们啦!求求你们了。monkey:15.gifmonkey:15.gifmonkey:1
vc++2010MFC如何在对话框里点击两个不同的按钮显示两张不同的图片在界面?
-
ERROR: Not authorized. Analyzing this project requires to be authenticated.
ERROR: Error during SonarQube Scanner execution ERROR: Not authorized. Analyzing this project requires to be authenticated. Please provide the values of the properties sonar.login and sonar.password....
error code=12029 (cannot connect) and retry limit (0">Error -27492: "HttpSendRequest" failed, Windows error code=12029 (cannot connect) and retry limit (0
Error -27492: "HttpSendRequest" failed, Windows <em>error</em> code=12029 (cannot connect) and retry limit (0) exceeded for URL="https://host/xxxx/get<em>C</em>ashierJson.htm?payOrderId=1512140000000076171&amp;ts=14482...
Error: Already running on PID 2510 (or pid file '/home/tarena/airflow/airflow-webserver.pid' is stal
如何解决?
Error:error: style attribute 'attr/colorPrimary (aka attr/colorPrimay) not found
这是什么情况,用得好好的,突然就这样了
Error: Unspecified error (The function is not implemented. Rebuild the library with Windows, GTK+ 2.
@Ubuntu16.04 安装opencv3.4.1后,c++程序编译通过,执行可执行文件时报错 Open<em>C</em>V Error: Unspecified <em>error</em> (The function is not implemented. Rebuild the library with Windows, GTK+ 2.x or <em>C</em>arbon support. If you are on Ubuntu or...
..\..\User\bsp-led\bsp_led.c(11): error: #268: declaration may not appear after executable statemen
…\User\bsp-led\bsp_led.c(11): <em>error</em>: #268: declaration may not appear after executable statement in block 在keil5下报错:声明不能出现在可执行状态之后,就是定义变量必须放在大括号之后,这是<em>C</em>89的标准,但<em>C</em>99就可以随便定义。所以要解决这个报错就要将软件平台设置成支持<em>C</em>99标准,或是将变...
ERROR 1045 (28000): Access denied for user 'root'@'localhost' (using password: YES)
问题描述: 1.mysql命令直接能进去 mysql 2. mysql -uroot -p 输入密码,报下面显示的错误 . 解决方案: 1.首先关闭mysql service mysqld stop 查看mysql状态 service mysqld status 2.设置使用命令跳过输入密码过程 mysqld_safe --user=mysql --s...
error C2059: 语法错误 : “public”等错误
我在hex.h定义: #ifndef __BTOHEX_H #define __BTOHEX_H #include #include using namespa
在Playground中使用RxSwift出错的解决方法
最近在学习Raywenderlich的RxSwift视频教程,当我在Playground中使用RxSwift时,出现错误: Playground execution failed: <em>error</em>: <em>C</em>ouldn’t lookup symbols: __T07RxSwift14ObservableTypePAAE2ofAA0<em>C</em>0<em>C</em>y1EQzGSayAHGd_AA018Imm...
C++出现Runtime Error要怎么解决?
-
使用git clone error: RPC failed
git clone时,出现这个错误. remote: <em>C</em>ounting objects: 4592517, done. remote: <em>C</em>ompressing objects: 100% (1140430/1140430), done. <em>error</em>: RP<em>C</em> failed; result=56, HTTP code = 2008.82 MiB | 4.72 MiB/s    f
预处理器标识#error的目的是什么
编译程序时,只要遇到 #<em>error</em> 就会跳出一个编译错误,既然是编译错误,要它干嘛呢?其目的就是保证程序是按照你所设想的那样进行编译的。 下面举个例子: 程序中往往有很多的预处理指令 #ifdef XXX ... #else #endif 当程序比较大时,往往有些宏定义是在外部指定的(如makefile),或是在系统头文件中指定的,当你不太确定当前是否定义了 XXX 时,
spring 错误 error creating bean with name
-
java中error和exception的区别
Error类和Exception类的父类都是throwable类,他们的区别是: Error类一般是指与虚拟机相关的问题,如系统崩溃,虚拟机错误,内存空间不足,方法调用栈溢等。对于这类错误的导致的应用程序中断,仅靠程序本身无法恢复和和预防,遇到这样的错误,建议让程序终止。 Exception类表示程序可以处理的异常,可以捕获且可能恢复。遇到这类异常,应该尽可能处理异常,使程序恢复运行,而不应该
error C2589: “(”: “::”右边的非法标记 error C2059: 语法错误 : “::”
1. 错误输出     ./zlibrary/ui/src/win32/w32widgets/W32VBorderBox.cpp(114) : <em>error</em> <em>C</em>2589: “(”: “::”右边的非法标记     ./zlibrary/ui/src/win32/w32widgets/W32VBorderBox.cpp(114) : <em>error</em> <em>C</em>2059: <em>语法错误</em> : “::” 2. 错
error: expected '(' before 'void' __asm void WFI_SET(void)
使用Eclipse编译STM32中的sys.c文件编译报出这个错误时: __asm void WFI_SET(void) { WFI; } 我的是上面那种写法,修改成下面的 void WFI_SET(void) { __ASM volatile("WFI"); } ...
Error: An unexpected error occurred during the `brew link` step The formula built, but is not sym...
安装python错误详细提示 ==&amp;gt; Pouring python-3.7.1.mojave.bottle.8.tar.gz Error: An unexpected <em>error</em> occurred during the `brew link` step The formula built, but is not symlinked into /usr/local Permission de...
Error:java: Compilation failed: internal java compiler error 解决办法
报错信息: 报错原因: 项目中Java版本不一致,可以查看项目中的jdk配置 1、查看项目的jdk(<em>C</em>trl+Alt+shift+S) File ->Project Structure->Project Settings ->Project 2、查看工程的jdk(<em>C</em>trl+Alt+shift+S) File ->Project Structure->Project Settings ->
error C2059: 语法错误 : “字符串”
ArActionLimiterForwards.h文件中类的声明: class ArActionLimiterForwards : public ArAction { public: /// <em>C</em>ons
ERROR: invalid input syntax for type double precision: ""
当我在做乘法相乘的时候出现的问题:这种空的情况就不能统一下, 空值的表达有几种:     1、不为空 Select   *   From   table Where id&amp;lt;&amp;gt;'' Select   *   From   table Where id!='' 2、为空 Select   *   From   table Where id='' Select   *   ...
RROR Error: Uncaught (in promise): Error: Template parse errors: Unexpected closing tag "app-config-
错误信息:RROR Error: Uncaught (in promise): Error: Template parse <em>error</em>s: Unexpected closing tag &quot;app-config-module&quot;. It may happen when the tag has already been closed by another tag. 背景:angulr6 错误原因:在...
程序员真是太太太太太有趣了!!!
网络上虽然已经有了很多关于程序员的话题,但大部分人对这个群体还是很陌生。我们在谈论程序员的时候,究竟该聊些什么呢?各位程序员大佬们,请让我听到你们的声音!不管你是前端开发...
裸机下控制台显示驱动开发下载
裸机下控制台显示驱动开发,搭建OS开发基本环境,实验控制台驱动的编写及验证。 相关下载链接:[url=//download.csdn.net/download/bingyu2046/4767622?utm_source=bbsseo]//download.csdn.net/download/bingyu2046/4767622?utm_source=bbsseo[/url]
Matlab程序代码下载
clear all close all load ('2_degree_observor.txt') load ('10_degree_observor.txt') x = X2_degree_observor (:,1) y = X2_degree_observor(:,2) y2=X2_degree_observor (:,3) y3=X2_degree_observor(:, 4) plot (x,y,x,y2,x,y3) xlabel ('Wavelength (nm)') ylabel ('Tristimulus Values') title ('CIE Standard Obser 相关下载链接:[url=//download.csdn.net/download/u012545505/6441725?utm_source=bbsseo]//download.csdn.net/download/u012545505/6441725?utm_source=bbsseo[/url]
Kafka入门与实践.pdf下载
Kafka最初是由LinkedIn公司开发的消息系统,现在已成为Apache的开源项目。早期版本的Kafka主要是作为一个分布式、可分区和具有副本的消息系统,随着版本的不断迭代,在0.10.x版本之后Kafka已成为一个分布式流数据处理平台,特别是KafkaStreams的出现,使得Kafka对流数据处理变得更加简单。   Kafka发展至今已具备很多特性,如分布式、高吞吐量、低延迟、高水平扩展性、高容错性等,也正是由于Kafka具备这些特性,使Kafka在大数据处理、日志收集、实时监控、离线统计分析等应用场景都被广泛使用。......... 相关下载链接:[url=//download.csdn.net/download/weixin_41582312/10255187?utm_source=bbsseo]//download.csdn.net/download/weixin_41582312/10255187?utm_source=bbsseo[/url]
相关热词 c#二进制字符转字节 c# rc4 c#中md5加密 c# 新建mvc项目 c# 引用mysql c#动态加载非托管dll c# 两个表数据同步 c# 返回浮点json c# imap 链接状态 c# 漂亮字
我们是很有底线的