VC6.0 出现 Cannot execute program 问题 [问题点数:40分,结帖人vio4677]

Bbs1
本版专家分:0
结帖率 87.8%
Bbs7
本版专家分:13478
Blank
黄花 2014年7月 C++ Builder大版内专家分月排行榜第二
2014年6月 C++ Builder大版内专家分月排行榜第二
2013年2月 C++ Builder大版内专家分月排行榜第二
2013年1月 C++ Builder大版内专家分月排行榜第二
2012年12月 C++ Builder大版内专家分月排行榜第二
2012年11月 C++ Builder大版内专家分月排行榜第二
2012年10月 C++ Builder大版内专家分月排行榜第二
2012年7月 C++ Builder大版内专家分月排行榜第二
Blank
蓝花 2013年4月 C++ Builder大版内专家分月排行榜第三
2013年3月 C++ Builder大版内专家分月排行榜第三
2012年9月 C++ Builder大版内专家分月排行榜第三
2012年8月 C++ Builder大版内专家分月排行榜第三
Bbs1
本版专家分:0
Bbs9
本版专家分:93058
版主
Blank
黄花 2012年4月 C++ Builder大版内专家分月排行榜第二
2011年4月 C++ Builder大版内专家分月排行榜第二
2009年12月 C++ Builder大版内专家分月排行榜第二
2009年11月 C++ Builder大版内专家分月排行榜第二
2009年10月 C++ Builder大版内专家分月排行榜第二
2009年8月 C++ Builder大版内专家分月排行榜第二
2007年5月 C++ Builder大版内专家分月排行榜第二
2002年5月 C++ Builder大版内专家分月排行榜第二
2001年10月 C++ Builder大版内专家分月排行榜第二
Blank
蓝花 2013年5月 C++ Builder大版内专家分月排行榜第三
2012年7月 C++ Builder大版内专家分月排行榜第三
2012年5月 C++ Builder大版内专家分月排行榜第三
2011年5月 C++ Builder大版内专家分月排行榜第三
2011年3月 C++ Builder大版内专家分月排行榜第三
2010年12月 C++ Builder大版内专家分月排行榜第三
2010年10月 C++ Builder大版内专家分月排行榜第三
2010年1月 C++ Builder大版内专家分月排行榜第三
2009年9月 C++ Builder大版内专家分月排行榜第三
2009年7月 C++ Builder大版内专家分月排行榜第三
2009年6月 C++ Builder大版内专家分月排行榜第三
2009年5月 C++ Builder大版内专家分月排行榜第三
2006年3月 C++ Builder大版内专家分月排行榜第三
2005年9月 C++ Builder大版内专家分月排行榜第三
Bbs7
本版专家分:13478
Blank
黄花 2014年7月 C++ Builder大版内专家分月排行榜第二
2014年6月 C++ Builder大版内专家分月排行榜第二
2013年2月 C++ Builder大版内专家分月排行榜第二
2013年1月 C++ Builder大版内专家分月排行榜第二
2012年12月 C++ Builder大版内专家分月排行榜第二
2012年11月 C++ Builder大版内专家分月排行榜第二
2012年10月 C++ Builder大版内专家分月排行榜第二
2012年7月 C++ Builder大版内专家分月排行榜第二
Blank
蓝花 2013年4月 C++ Builder大版内专家分月排行榜第三
2013年3月 C++ Builder大版内专家分月排行榜第三
2012年9月 C++ Builder大版内专家分月排行榜第三
2012年8月 C++ Builder大版内专家分月排行榜第三
Bbs1
本版专家分:0
VC新手安装出现 cannot execute 'c1'错误解决办法
将 VC98/bin/C1XX.dll 改为 C1.dll就可以了nn
运行错误!!cannot execute program
VC++ 6.0 运行错误!!“<em>cannot</em> <em>execute</em> <em>program</em>”,怎么解决呀??
cannot execute program
我在EVC环境下包含sqlite3的头文件,sqlite3.lib等相关文件也复制到了工程目录下,当执行的时候就<em>出现</em><em>cannot</em> <em>execute</em> <em>program</em>,编译已经通过没错误,注释掉sqlite语句后正常,请问这是啥<em>问题</em>呢~~~?在线等!!
使用Jenkins 启动shell脚本所遇到的问题
sh命令无法使用:rnrnrnBuilding in workspace C:\Program Files (x86)\Jenkins\workspace\testn[test] $ sh -xe C:\Windows\TEMP\hudson6299483223982766034.shnThe system <em>cannot</em> find the file specifiednnFATAL: L'exéc
一次AIX系统报错的问题处理思路
今天遇到一个同事在AIX 5.3环境中启动程序时报错的<em>问题</em>,错误截图如下: 其中报错内容如下: $ ./MBAFileAgent 0509-036 Cannot load <em>program</em> ./MBAFileAgent because of the following errors: 0509-022 Cannot load module ./jre/bin/libstd
cannot execute the specified program"">安装服务时出现"The system cannot execute the specified program"
Visual Studio 2013下的Windows服务程序,在安装服务时<em>出现</em>"The system <em>cannot</em> <em>execute</em> the specified <em>program</em>",原因1: 文件不全,需要重新编译;原因2:配置文件有<em>问题</em>,比如<em>出现</em>value="... 少个引号等。 转载于:https://www.cnblogs.com/zhangtingzu/p/5453774.html...
程序运行出现cannot execute program的原因
今天的程序第一次遇到这个<em>问题</em>..在网上找到这个解释,不是太懂,先收藏了程序编译通过,仅说明程序本身无语法错误,并不意味着程序能够顺利的执行。这是一种经常遇到的<em>问题</em>。根据自己对OpenCV程序的体会,主要存在以下几种情况。1 数据类型及长度的不匹配。比如说,某些函数处理图像时,要求将它需要的某些参数的数据长度定为8位,16位或32位。还有有无数据类型区分。如果不满足条件,执行时将出错。2 对图像
X264运行提示“cannot execute program ” 提示框
-
出现Cannot execute program的错误,什么原因?
main()rnrn static float score[][4]=60,70,80,90,56,89,67,88,34,78,90,66;rn float *search();rn float *p;rn int i,m;rn printf("enter the number of student:");rn scanf("%d",&m);rn printf("the scores of no.%d are:\n",m);rn p=search(score,m);rn for(i=0;i,*(p+i));rnrn rnfloat *Search(pint,n)rnfloat (* pint)[4];rnint n;rnrn float *pt;rn pt=*(pint+n);rn return(pt);rnrnrn着是潭浩强编的书上的一个例子,在TC下没有<em>问题</em>,但是在VC中调试就有Cannot <em>execute</em> <em>program</em>的错误,白思不得其解!
hadoop 搭建后初始化及运行出现错误 cannot execute binary file
请问大神们  这是什么<em>问题</em>  软件版本操作系统:红帽5   jdk:10.1.0  hadoop :3.1.0  我是根据书上一步一步来的 可能版本和用的系统不一样 书上是centos急!!!! ...
Linux中出现这个问题怎么解决
Cannot find tomcat/bin/setclasspath.sh This file is needed to run this <em>program</em>解决的办法: vim catalina.sh进入到文件中找到cygwin=false这一句,然后在这一句上面加入: JAVA_HOME= JAVA_HOME=/usr/lib/jvm/jdk1.8.0_161保存退出 jdk1.8.0_161=...
cannot execute program 是什么错误?
这是其他人的程序,好像executable for debug session的路径是写死了的!但是我改也没有用!rn<em>问题</em>出在什么地方?
cannot execute program是为什么
建 了个 WIN32 CONSOLE APPLICATION rn随便写了个HELLO WORLD 的程序 rn运行的时候就<em>出现</em><em>cannot</em> <em>execute</em> <em>program</em> 为什么啊
IIS部署错误-拒绝访问 CS0016
1 错误描述nnn2 错误原因n3 解决
win下编译hadoop项目--踩过的坑
装了IDEA,一直没有配环境。最近非得搞环境了--nn第一次在Terminal上运行nnnmvn package -Pdist,native,docs -DskipTests -Dtarnn<em>出现</em>以下error:nnn[ERROR] Failed to <em>execute</em> goal org.apache.maven.plugins:maven-antrun-plugin:1.7:run (pre-dis...
Eclipse 进行 ANT 时错误 Javadoc failed java.io.IOException Cannot run program javadoc
Eclipse 进行 ANT 时错误 Javadoc failed java.io.IOException Cannot run <em>program</em> javadoc
使用PyCharm遇到的一个小问题及解决方案
使用PyCharm<em>出现</em>Error running ‘xxx’: Cannot run <em>program</em> “E:\Program Files\PycharmProjects\aaa\python.exe” (in directory “E:\Program Files\PycharmProjects\bbb”): CreateProcess error=2, 系统找不到指定的文件。nn首先排查pyth...
linux安装node避坑
linux centos7 64位搭建node环境nn运行 node -v 如果报错bash: ./node: <em>cannot</em> <em>execute</em> binary filenn可能是下载的node版本不对,请核对是否是linux centos7 64位版的nodenn安装node如下:nn1、wget https://nodejs.org/dist/v8.11.1/node-v8.11.1-linux-...
VC6.0代码转到VS2010 遇到以下报错的解决办法
错误现象:n1>d:\<em>program</em> files (x86)\microsoft visual studio 10.0\vc\atlmfc\include\atlcore.h(112): error C3861: “InitializeCriticalSectionAndSpinCount”: 找不到标识符n1>d:\<em>program</em> files (x86)\microsoft visual s
操作dosbox0.74时遇到的几个问题
下载好dosbox0.74之后,找到目录下DOSBox 0.74 Options.bat文件,打开拖到最后一行,n加上这样一段代码后。TASM是自己创建的一个文件夹。nMOUNT C F:\TASMnC:n即如下:n[autoexec]n# Lines in this section will be run at startup.n# You can put your MOUNT l
Hive出现问题汇总
1.<em>出现</em><em>问题</em>的前提条件:我在Hive中创建一个表然后想向表中插入数据,每次插入数据都会<em>出现</em>如下异常;nnjava.io.IOException: org.apache.hadoop.yarn.exceptions.YarnException: Failed to submit application_1533616024453_0004 to YARN : Application applicat...
Codeblocks中遇到的调试问题,已解决
我单独讨论如下的两类<em>问题</em>:nn1 ERROR: You need to specify a debugger <em>program</em> in the debuggers’s settings. n(For MinGW compilers, it’s ‘gdb.exe’ (without the quotes))nn(For MSVC compilers, it’s ‘cdb.exe’ (without t...
Genymotion缺失文件reg.exe
Exception (VBoxManage): java.io.IOException: Cannot run <em>program</em> "D:\Program Files\Genymobile\Genymotion\/reg": CreateProcess error=2, 系统找不到指定的文件。
安装hadoop 时遇到的问题,格式化文件系统时,不能成功
rn 安装hadoop 时遇到的<em>问题</em>,格式化文件系统时,不能成功rn执行命令: hadoop namenode –formatrn<em>出现</em>下面错误:rn/usr/bin/hadoop: line 321: /usr/java/default/bin/java: No such file or directoryrn/usr/bin/hadoop: line 387: /usr/java/default...
oracle 字符集问题
<em>问题</em>描述:这是在将dmp文件导入oracle的时候,遇到的另一个<em>问题</em>。在导入的时候遇到如下提示:已经完成 ZHS16GBK 字符集和 AL16UTF16 NCHAR 字符集中的导入报错如下:IMP-00019: 由于 ORACLE 错误 12899 而拒绝行IMP-00003: 遇到 ORACLE 错误 12899ORA-12899: 列 &quot;SYSTEM&quot;.&quot;表名&quot;.&quot;字段名&quot; 的值太大 (实际值...
java备份数据库的时出错
java备份数据库的时候,<em>出现</em>以下报错;先写下文档记录下:rnjava.io.IOException: Cannot run <em>program</em> "mysqldump": CreateProcess error=2, 系统找不到指定的文件。rnrnrnat java.lang.ProcessBuilder.start(Unknown Source)rnat java.lang.Runtime.exec
自动化项目部署过程可能遇到的各种BUG
不断补充中。。rn0、maven 启动 测试用例 报错<em>问题</em>。rn错误日志如下。rn***********************日志bigan*************************************rn[ERROR] Failed to <em>execute</em> goal com.github.eirslett:frontend-maven-plugin:1.0:npm (npm inst
wince5 响应右键时事 cannot execute program
添加相应的头文件和库rnrn但执行时 rn if(::SHRecognizeGesture(&shrg) == GN_CONTEXTMENU)//长按键消息 rn rnrn在这条语句<em>出现</em>了 <em>cannot</em> <em>execute</em> <em>program</em> 请问怎样解决?
关于GNS3 IOU 和 VM主机相连的问题
小弟有个<em>问题</em>,我用GNS31.2.3 iou 模拟了交换机和路由器,但不知道为什么不能和VM里安装的XP想连。请帮我看看吧。 我的操作过程在增加一台主机,不知道这个对话框是什么意思?
tensorflow学习入门
深度学习框架tensorflow安装,基本概念,入门学习
jhipster项目启动报错Application run failed,跪求大神给个解决思路
jhipster项目启动报错Application run failed,跪求大神给个解决思路n错误内容如下:n[ERROR] Failed to <em>execute</em> goal com.github.eirslett:frontend-maven-plugin:1.6:npm (npm install) on project myapplication: Failed to run task: ‘np...
程序调试没错误了还是出现cannot execute program 提示框?
为什么我的程序调试没错误了 还是<em>出现</em><em>cannot</em> <em>execute</em> <em>program</em> 提示框?生成的程序无法执行呢
R语言学习笔记之
<em>问题</em>1:安装<em>问题</em>n由于R涉及到Fortran语言,要下载gcc-gfortran包nnn<em>问题</em>2:nnunsupported URL schemenWarning: unable to access index for repository https://rweb.crmda.ku.edu/cran/src/contribn镜像<em>问题</em>,解决方式有两种:1)换镜像,即在选择的时候改
下面的 消息响应 错在哪里,出现错误 cannot execute program 错误
rnstruct message rnrn unsigned int age; rn unsigned int workcode;rn unsigned int reg;rn char username[32];rn unsigned int datalen;rn char data[100]; rn ;rnrnrnDWORD WINAPI CKaiDlg::RecvProc(LPVOID lpParam)rnrn CKaiDlg *pCKaiDlg=(CKaiDlg*)(lpParam);rn struct message recvmsg,*pRecvmsg = NULL; rn ////////////rn char *pPostmsgbuf ;rn pPostmsgbuf = new char[200]; rn rn while(1)rn rn memset(pPostmsgbuf, 0, sizeof(pPostmsgbuf)); rn recvfrom(pCKaiDlg->sockClient,pPostmsgbuf,100,0,(SOCKADDR*)&(pCKaiDlg->addrSrv),&(pCKaiDlg->len));rn memcpy(&recvmsg,pPostmsgbuf, sizeof(pPostmsgbuf)); rn rn ::PostMessage(::FindWindow(NULL,"客户信息显示"),WM_YOURMSG,(WPARAM)pPostmsgbuf,NULL);rn rn rn delete []pPostmsgbuf;rn pCKaiDlg->m_Set.Close(); rn return 0;rnrnrn//////////////////////////////////////////////////////////////////rn LRESULT CKaiDlg::OnYourMsg(WPARAM wp, LPARAM lp)rnrn int getdotleft;rn char *handlebuf = new char[200];rn handlebuf =( char *)wp;rn memset(&handlebuf,0,sizeof(handlebuf));//rn struct message handlemsg;rn memcpy(&handlemsg, handlebuf, sizeof(handlebuf));// ////////////////rn rn delete []handlebuf;rn return 0;rn
IntelliJ IDEA无法正常使用SVN解决办法
<em>问题</em>描述:nn IntelliJ IDEA安装之后,使用SVN进行提交或更新以及检出代码的时候会<em>出现</em>如下错误:nCannot load supported formats: Cannot run <em>program</em> "svn": CreateProcess error=2nn 原因是SVN使用了命令行工具,如果本地没有SVN的命令行工具,则导致出错。
Linux 调用FFmpeg截图
在Windows中调用FFmpeg:http://www.tuicool.com/articles/ARFnMfrn按照上面的示例可以在Windows中正常截图。rn而在Linux就会报错:java.io.IOException: Cannot run <em>program</em> "../ffmpeg.exe": error=13, Permission deniedrn在Linux中需要安装FFmpeg然后
Node.js安装express框架出现问题级解决
1:命令行下:cd C:\Program Files\nodejs\node_modules\npm\rn2:命令行下:npm install express rn3:这时会发现C:\Program Files\nodejs\node_modules\npm\node_modules\.bin文件夹存在express、express.cmd两个文件。rn4:在电脑系统环境变量path中加入C:\P
jsp页面引入bootstrap时出现异常
异常:nutil.js:56 Uncaught TypeError: Cannot read property ‘fn’ of undefinednat setTransitionEndSupport (util.js:56)nat util.js:147nat util.js:10nat bootstrap.js:9nat bootstrap.js:10n引入的bootstrap的文件n&amp;lt;...
oozie错误
1、nCannot run <em>program</em> &quot;en.sh&quot; (in directory &quot;/home/install/hadoop-2.5.0-cdh5.3.6/tmp/nm-local-dir/usercache/hadoop/appcache/application_1523583797725_0010/container_1523583797725_0010_01_000002&quot;):erro...
VC6.0 atlsd.lib文件
VC6.0 缺少 atlsd.lib 文件提示,下载这个就<em>问题</em>
IDEA从svn检出项目报错Cannot checkout from svn: 'C:\Program' 不是内部或外部命令,也不是可运行的程序 或批处理文件。
Cannot checkout from svn: ‘C:\Program’ 不是内部或外部命令,也不是可运行的程序n或批处理文件。nn解决方法:nnn去掉默认框里面的勾就可以了nn
Cannot run program "python": CreateProcess error=2, 系统找不到指定的文件——IDEA本地Test解决方案记录
首先确定是否安装python,rnwindows下使用cmd命令,键入 python 回车。rn命令未查找到即未安装,如下图显示版本号即安装完成。rn安装Anaconda时勾选自动添加环境变量配置按钮。rnrn已安装,未配置环境变量的需手动配置。rnPATH=D:\Anaconda3;D:\Anaconda3\Library\mingw-w64\bin;rnD:\Anaconda3\Library\usr\bi...
IDE Fix Pack 6.2
解决C++Builder 2010启动时<em>出现</em><em>cannot</em> create xxxx\EditorLineEnds.ttr<em>问题</em>
解决hue编写MR streaming 无法上传文件问题
今天在使用hue编写streaming程序的时候,上传文件一直<em>出现</em>报错,报错信息如下:rnrnCaused by: java.io.IOException: Cannot run <em>program</em> "/u01/yarn/nm/usercache/xuemingpang/appcache/application_1443862109059_23987/container_1443862109059_2
Android Studio更新到3.1.2后的问题解决过程
整天Android Studio都提示更新,强迫症看不下去了,也想用一下最新的IDE。所以今天把Android Studio从2.2更新到3.1.2。nn第一次尝试:nn在镜像网站下下来以后直接按流程做,打开以前做的程序,显示“Gradle project sync failed.”,底部提示“Error:connection reset”。nnnn网上说是gradle下载不完全,按照方法进入di...
安装eclipse时jdk、ADT、sdk的配置问题解决办法
本想写一下安装linux时遇到的<em>问题</em>,可昨天保存的截图不翼而飞了~~作罢,正好昨天重装的双系统,今天配置下win7下的eclipse,遇到了<em>问题</em>还要下软件,翻看以前的笔记,麻烦。rn说一下,有的解决办法时转载的,当时是保存到笔记里把链接删了,今天又拿出来不知道原地址了,这里是汇总一下我当时安装时<em>出现</em>的<em>问题</em>。rn接下来进入主题:rnrnrnrn先说下安装过程,然后讲述一下安装过程中<em>出现</em>的<em>问题</em>:rn1
用VC6.0建MFC工程的时候,出现:"致命错误RC1015: 无法打开包含文件 'afxres.h'.”的解决过程
这两天在做课程设计,需要用MFC做一个图形界面的数字滤波器仿真系统,但在用VC6.0建MFC工程的时候,遇到了一个<em>问题</em>:致命错误RC1015: 无法打开包含文件 'afxres.h。我网上查了一下,根据热心网友的建议“打开vc界面rn 点击VC“TOOLS(工具)”—>“Option(选择)”—>“Directories(目录)”重新设置“Excutable Fils、Include Files、
Ubuntu-树莓派之交叉编译
[前言]调试IOT设备SDK(派模拟设备端功能)需要,在UBUNTU系统的笔记本上编写和编译C程序Demo,然后scp编译后的文件到派上,缩减树梅派本身性能导致的编译时间长的<em>问题</em>。
编译器GCC/CLANG 使用摘记
clang++: error: unable to <em>execute</em> command: Killed nclang++: error: linker command failed due to signal (use -v to see invocation)nnnRef: https://stackoverflow.com/questions/5682854/why-is-the-link
Myeclipse添加外部Tomcat出现启动故障的问题解决
故障:rnrn1.java.lang.IllegalStateException: No output folderrnrn分析:work文件夹无写权限rnrn解决:找到tomcat的安装文件夹,右键点击work文件夹“属性”,在“安全”卡中编辑权限,把当前用户组的权限修改为“修改”即可。rnrn2.java.io.FileNotFoundException: C:\Program Files\A
解决多次添加FileTool.dll到vc失败的问题
https://blog.csdn.net/chen1083376511/article/details/53856728nn这个注册表部分改用下面文章nnhttps://blog.csdn.net/yyattery/article/details/47311059nn完成了注册。nn nn但是https://blog.csdn.net/dahongdahong/article/details/4...
dev-c++ unable to run program file 问题解决办法
主要解决dev-c++ 在编译的时候报unable to run <em>program</em> file 错误的<em>问题</em> mail:gychqyl@126.com
Jenkins使用问题记录
1. 启动n使用Jenkins的版本为2.138.3,下载war包后启动即可运行:n# 指定使用8080端口,可自定义njava -jar jenkins.war --httpPort=8080nn建议后台启动,命令如下:n# 1. 启动n# 指定后台启动nnohup java -jar jenkins.war --httpPort=8080 &amp;amp;amp;amp;amp;amp;n# 再指定日志路径nappending o...
ubuntu下如何处理出现“ unable to execute ./DrClientLinux: No such file or directory”,“没有那个文件或目录”的问题
最近在重装ubuntu的时候遇到了一个<em>问题</em>,因为在安装的时候没有连网,导致了没有下载32位的库,导致了没法运行校园网的登录客户端,因为那个客户端是用32位写的,所以<em>出现</em>了各种<em>问题</em>,经过L同学的帮助,最终弄好了,特意贴出代码,希望能够帮助大家。千万别遇到类似<em>问题</em>,不然会崩溃的。rnrnudo ./DrClientLinuxn[sudo] ytc 的密码:nsudo: unable to execut
MySQL错误2014原因无法执行查询--P…
网上查了不少n最后定位到PDO这个类nnhttp://stackoverflow.com/questions/17434102/causes-of-mysql-error-2014-<em>cannot</em>-<em>execute</em>-queries-while-other-unbuffered-queries&usg=ALkJrhgqG0PsXgSYk9W7uMgljOGEUbiwawn这个网址说的不错nnMySQL客
openoffice4 不能正常启动终极解决方案
环境:[root@a786 zwy]# cat /etc/issuenCentOS release 6.7 (Final)nKernel \r on an \mopenoffice 不能正常启动原因排查。症状:没有任何输出,启动后,输出对应pid,但是会闪退。解决方案整理如下: n步骤1:卸载已安装的openoffice4。1.1 干掉已安装包和文件[root@dev ~]# rpm -e `rpm
Mac配置Eclipse CDT的Debug出现问题
<em>问题</em>1:<em>出现</em> Could not determine GDB version using command: gdb --version原因:mac上没有安装gdb或者gdb位置配置有<em>问题</em>解决方法:1 安装gdb,2 如果确定已经安装了gdb,需要配置Eclipse中Debuger的路径:项目右键-》Debug As-》Debug Configurations-》左侧C++ Application找...
node.js系统找不到指定文件报错
<em>问题</em>: nException occurred executing command line. nCannot run <em>program</em> “node” (in directory “C:\Users\Calora\workspace2\hw”): CreateProcess error=2, 系统找不到指定的文件。系统:win32 n解决方法: n1.下载node.exe 下载地址:https:/
HBase编译过程中碰到的问题
测试环境上hbase采用maven编译,只要安装了maven就行.rn在hbase目录下mvn package -Dmaven.test.skip.exec=true编译好的jar放在targetrn目录下,将jia包替换以后。rn1.重启集群发现一个<em>问题</em>:HMaster启动了,但是Regionserver没有起来rn rn后来分析maven编译之前时候会把依赖都下到.m2/目录下,Hbase集群...
Centos安装NodeJs 二进制文件方法
1、在官网https://nodejs.org/en/download/下载Linux Binaries (.tar.xz)文件:node-v4.4.2-linux-x64.tar.xzrn2、解压 xz -d  得到node-v4.4.2-linux-x64.tarrn再使用命令 tar -xvf node-v4.4.2-linux-x64.tar  解压文件rn3、设置环境变量rnvim /e
JLINK驱动刷新之WIN7
今天遇到一个<em>问题</em>,我在新的版本KEIL提示我更新JLINK驱动之后,<em>出现</em>JLINK驱动丢失现象,指示灯也不亮了。在网上查了许多资料尝试了好久,最后终于弄好了n1、主要<em>问题</em><em>出现</em>在我执行完各个操作之后,最后在PORT<em>出现</em>了 bossa <em>program</em> com 这样的一个驱动,直接导致我设置好 SAM-PROG2.4之后,write按钮一直显示为灰色。n2、然后我禁止了系统自动UPDATE驱动,选择
编译hbase-1.2.3源代码
目录n目录 1n1. 约定 1n2. 安装jdk 1n3. 安装maven 1n4. 网络配置 2n4.1. eclipse 3n4.2. maven 3n5. 从hbase官网下载源代码包: 4n6. eclipse导入hbase源代码 4n7. 编译hbase-thrift 6n8. Problems opening an editor ... does not exis
使用MyBatis进行数据库的操作,出现XAER_RMFAIL错误
n org.infinispann infinispan-commonsn 8.0.2.Finalnnn org.springframework.boot</g
could not execute
could not <em>execute</em>:bad executable format(win32 error 193) 下了一个实现MD5的代码,编译时没有错误,但是执行的时候却提示:could not <em>execute</em>:bad executable format(win32 error 193)
最新在Ubuntu 14.04.5 64位上编译OpenJDK7和错误解决
编译环境:n      笔者是在虚拟机上进行的安装,虚拟机上安装Ubuntu 14.04.5 LTS下载链接地址。n一.编译前的准备n    1.下载OpenJDK7 下载链接www.java.net/download/openjdk/jdk7u40/promoted/b43/openjdk-7u40-fcs-src-b43-26_aug_2013.zipn解压到一个你的工作路径下,最好看
Android工程中方法数超过65536解决方法(Kotlin)
Android Studio报错:nThe number of method references in a .dex file <em>cannot</em> exceed 64K.nCaused by: com.android.tools.r8.utils.AbortException: Error: Cannot fit requested classes in a single dex file (# me...
PyCharm-错误-找不到指定文件python.exe
1、现象nn系统提示找不到指定的文件:nnError running 'hello': Cannot run <em>program</em> &quot;B:\pystudy\venv\Scripts\python.exe&quot; (in directory &quot;\python-study&quot;): CreateProcess error=2, 系统找不到指定的文件。nnnn2、原因nn原来的工程目录(B盘)下,保存了python的编...
IntelliJ IDEA 13 无法正常使用SVN的问题和解决办法
rnIntelliJ IDEA 13 无法正常使用SVN的<em>问题</em>和解决办法rn rn<em>问题</em>描述:IntelliJ IDEA 13.1.2安装后,使用SVN进行提交或更新时候会<em>出现</em>如下错误:Cannot load supported formats: Cannot run <em>program</em> &quot;svn&quot;: CreateProcess error=2, μ或者svn: E204899: Cannot run ...
Win10更新后出现vc++6.0不能用的问题解决方法
Win10更新后安装VC++6.0不能打开的<em>问题</em>,通过替换相应的文件可以解决
eclipse插件启动Genymotion模拟器失败解决方案
下载下来 Genymotion eclipse插件 并复制到eclipse插件文件夹,点击eclipse 上的 Genymotion 模拟器图标,eclipse打印错误,如下:Loading Genymotion librarynGenymotion directory: C:\Program Files\Genymobile\GenymotionnTrying to initialize
C++6.0软件所遇Bug汇总
注:红色为网上搜索的解决方式,红色粗体为自己检验有效方法和部分原创方法n n1.C++6.0在WIN7,WIN8,WIN10上安装时,使用“打开文件”,程序崩溃n解决方法:http://www.mamicode.com/info-detail-517499.htmlnnn2. assistantX安装以及程序窗口无法关闭<em>问题</em>解决n解决方法:http://blog.sina.com.c
Prometheus配置过程中出现的bug及解决方案
一、简介rnNode exporter,Promenade和Alertmanager在安装配置后,Prometheus运行<em>出现</em>的bug,并针对这些bug进行了解决。本博客主要总结这些bug和解决方案,进行记录。rnPrometheus运行命令参考如下:rndocker run -p 9090:9090 -v /tmp/prometheus.yml:/etc/prometheus/prometheus.y...
一个mysql_PDO错误的解决
新版本的pdo会有这个<em>问题</em>:rnrn General error: 2014 Cannot <em>execute</em> queries while other unbuffered queries are active. Consider using PDOStatement::fetchAll(). Alternatively, if your code is only ever going to ru...
springboot 项目配置成linux中的系统服务
注意:CentOS和readhat的配置不同,CentOS6.5和CentOS7的配置也不同。nn下面是把nginx服务器(CentOS6.5)上安装发送短信程序(springboot项目),并把发送短信程序配置成系统服务运行。(系统服务就是随系统启动而启动的服务)nn nn第一种情况:项目为可执行jarnn把项目通过maven打包成可执行jar,配置为系统服务,随电脑启动而启动。nn第1步:生成...
VC++6.0显示此程序存在兼容问题解决办法
在windows7及windows7以上版本使用vc++6.0是会<em>出现</em>以下<em>问题</em>:nnnn解决兼容性<em>问题</em>,需要打开下载好的VC++6.0,在文件中打开如下目录: 你VC++6.0所在的文件夹\Common\MSDev98\Binnn在里面找到MSDEV.EXEnn原本的文件名是没有办法进行改变兼容性的,可以将它的文件名改为任意名字,然后右击—&amp;gt;属性—&amp;gt;兼容性—&amp;gt;勾选上以兼容模式运行...
phpstorm配置使用svn
首先得安装svn,并且安装svn的时候选择安装command line client tools(因为svn默认不安装) n n不安装这个的话,phpstorm会报nnnnCannot load supported formats: Cannot run <em>program</em> &quot;svn&quot;: CreateProcess error=2, nn安装好后,phpstorm里面在下面这儿设置下就可以了...
elasticsearch 后集群状态下 聚合时 类型转换错误 原因及分析
先来看下错误前端错误n两层聚类时,外面一层返回的key是乱码,这个乱码并不是编码<em>问题</em>,而是根本没有对第二层的聚类分类。第一层里面的数据全部都是一样的。n直接报错,500或者503,类型转换错误或者解析异常。n后台错误:[2015-11-30 11:06:56,105][DEBUG][action.search.type ] [local] failed to reduce search
hadoop搭建(一)——远程执行脚本缺少环境变量
文章目录hadoop搭建(一)<em>问题</em>追踪解决nhadoop搭建(一)n本次安装的是3.1.5版本hadoop的伪分布式,按照官方的指导手册quickly start进行<em>出现</em>了JAVA_HOME无法找到的<em>问题</em>nsirius@sirius:~/hadoop$ sbin/start-dfs.shnStarting namenodes on [localhost]nlocalhost: ERROR: JAV...
【Lua】---Window下编译Lua源码
Window下编译Lua源码nn源码下载:nhttp://www.lua.org/download.htmln n编译参考:nhttp://www.lua.org/manual/5.3/readme.htmln n编译工具: VS005n编译方法: 编写bat脚本调用cl.exen n脚本如下:n@rem Build Lua Src 5.3 by mkLua.bat@rem Script to build L
webstorm运行javascript时报错:Program path not specified 的解决方案——安装并配置Node.js路径
webstorm小白我本人在运行javascript时报错:Program path not specifiedn摆渡一下找到了原因是没有配置Node.js,解决<em>问题</em>后的我开心的给大家来一个WebStorm2018.2.5+Node.js环境配置攻略n1. 下载WebStorm2018.2.5n官网走起:Download WebSrotmn2. 下载Node.jsn官网走起:Download No...
史上巨坑eureka注册,出现TransportException异常
由于自己造轮子,所以踩了好久的坑,导致<em>出现</em>以下异常。com.netflix.discovery.shared.transport.TransportException: Cannot <em>execute</em> request on any known servern at com.netflix.discovery.shared.transport.decorator.RetryableEurekaHttp...
PhpStorm中报 “Cannot run program git.exe, 系统找不到指定的文件” 错误的解决方法
在使用PhpStorm的GitHub或Git功能时,经常会<em>出现</em>以下错误信息:rnrnCannot run <em>program</em> "git.exe": CreateProcess error=2, 系统找不到指定的文件。rnrnrn原因分析:rnrnrn电脑还未安装git客户端虽然安装了git客户端,但系统无法直接找到git.exe文件,即路径不完整rnrnrnrn解决方法:rn1. 从Github Fo
can't execute program
F7编译没错误,点感叹号,就<em>出现</em>这个对话框!什么意思啊?
解决win10 VC++6.0 应用程序无法正常运行 0xc0000142
最近很多同学都升级win10 周年更新版,结果vc用不了了。显示应用程序无法正常运行 0xc0000142。我最先在贴吧发的帖子,后来又发了一篇百度经验,无奈百度产品实在垃圾,我写错了都不可改。所以来到csdn发博客,重新写了一下步骤。而且我发现有的人盗了我的贴,到处装逼,不是说我这个方法有多少技术含量,只是我发现了,总结了一下,好歹也尊重一下吗。转载你就声明一下嘛。转载请申明http://blog.csdn.net/w_9449/article/details/52864135
VC++6.0运行MFC程序常见报错解决办法
Visual C++6.0是微软早期开发的一个IDE。n计算机二级考试的官方指定产品。。很多学校教授C/C++也都用得是VC6。nVC6体积小,界面简洁。但兼容性很差,在win7,win10上存在很多兼容性<em>问题</em>,现在总结如下:n(首先我还是建议使用Visual Studio 2015)n遇到<em>问题</em>时首先重装,重装不能解决再往下看n1,致命错误:无法打开包含文件“xxxxxx.h";nca
Windows下用Eclipse搭建C/C++开发环境
本文假定你已经熟悉Java,Eclipse的安装,并能顺利启动和运行Eclipse.此外因为各软件版本在不断更新,有些地方可能不准确,以最新的、原文资料为准。rnrn距上一次写和调C++程序,已经5、6年了,光阴荏苒岁月无情,现在再重新拾起来,很多东西都要从头来。Windows下C/C++的IDE有很多,我知道的就有MS Visual Studio,Borland C++等,但这些是要版权的。不要...
Maven项目部署到tomcat+部署中的各种问题
第一次写东东,心情有点儿小激动,因为今天刚刚把maven在tomcat上跑起来,所以趁热打铁,写写过程中经历的很多小挫折以及心中狂奔过的无数个草泥马。n    还是先写如何配置吧,没接触maven的我,以为只要直接maven build,然后run起来就可以在tomcat上飞快的奔跑起来,真是好多时候真心觉得自己每天都不带脑子的。虽然我内心也在挣扎,好像我什么都没在tomcat上干过,但是我就想
Vc6.0链接Mysql数据库的几点问题
由于<em>vc6.0</em>仅支持32位,而我的电脑是64位以及我安装的mysql也是64位,导致<em>vc6.0</em>在链接libmysql.lib时出了<em>问题</em>,我的解决办法是去mysql官网上下了一个32位的.zip包,设置成链接这个32位包里面libmysql.lib文件(实际上我这么设置了也还是提示我有<em>问题</em>),或者是把libmysql.lib和libmysq.dll这两个文件拷到工程文件里(这个是没有<em>问题</em>的)n在解
IDEA从svn检出项目报错Cannot checkout from svn: 'D:\Program' 不是内部或外部命令,也不是可运行的程序 或批处理文件
序言n项目突然换了版本控制工具(svn),然后就有了这篇随笔,记录一下遇到的小麻烦。今天先讲述下idea如何配置svn。n准备工作n首先你的idea得有svn这个插件,如下所示,一般都会有,没有自行百度安装下。在一个就是下载小乌龟,也就是TortoiseSVN客户端,官网快速通道戳这里。nn当你安装的时候注意一点,windows默认不安装第二个,你要选择安装一下。一般安装完会自动配置好环境变量,可...
Mybatis 批量操作
目录nnMybatis批量操作推荐nnMybatisplus真假批量操作nn第一篇、Mybatis批量操作推荐nn在工作中使用mybatis操作mysql的时候,难免会有些批量更新或批量插入操作,此时应该启用mybatis的批量查询功能,即设置nnallowMultiQueries=true,以及配合mybatis的&amp;lt;foreach&amp;gt;&amp;lt;/foreach&amp;gt;标签完成批量操作。n...
CreateProcess error=2, 系统找不到指定的文件
今天在AndroidStudio中写了一个gradle插件,但是在执行的时候,报了一个错误: njava.io.IOException: Cannot run <em>program</em> “E:/software/AndroidStudio/SDK/build-tools/25.0.3/dx”: CreateProcess error=2, 系统找不到指定的文件。dx是SDK\build-tools\版本号\
解决IDEA启动wkhtmltopdf问题
1.检查是否安装了wkhtmltopdfnn2.若安装,检查是否配置了path的环境变量。可通过cmd输入 wkhtmltopdf -V 来尝试。nn3.若环境变量以配置,测试下wkhtmltopdf是否能正常使用。可在cmd命令中输入  wkhtmltopdf  www.baidu.com aaaaaa.pdf    点击回车,cmd面板会显示生成100%并且success,可以在user目录下...
Web Design All-in-One For Dummies下载
Web Design All-in-One For Dummies 相关下载链接:[url=//download.csdn.net/download/Augusdi/2602892?utm_source=bbsseo]//download.csdn.net/download/Augusdi/2602892?utm_source=bbsseo[/url]
机械测量助手软件EXE格式下载
机械测量助手,机械测量的好帮手,工厂测量工程测量。 相关下载链接:[url=//download.csdn.net/download/chaugo/2723254?utm_source=bbsseo]//download.csdn.net/download/chaugo/2723254?utm_source=bbsseo[/url]
css 二级下拉导航菜单下载
在网上找的一个简单的css二级导航菜单实例,适合CSS初学者 相关下载链接:[url=//download.csdn.net/download/lengyudongfang/2890563?utm_source=bbsseo]//download.csdn.net/download/lengyudongfang/2890563?utm_source=bbsseo[/url]
文章热词 机器学习教程 Objective-C培训 交互设计视频教程 颜色模型 设计制作学习
相关热词 mysql关联查询两次本表 native底部 react extjs glyph 图标 java学习常出现的问题 区块链问题
我们是很有底线的