.

扩充话题 > 灌水乐园 [问题点数:300分]
等级
本版专家分:23280
结帖率 99.72%
等级
本版专家分:12008
勋章
Blank
技术圈认证 用户完成年度认证,即可获得
Blank
签到新秀 累计签到获取,不积跬步,无以至千里,继续坚持!
等级
本版专家分:78632
等级
本版专家分:14236
等级
本版专家分:14441
等级
本版专家分:14441
等级
本版专家分:14441
等级
本版专家分:12544
等级
本版专家分:23280
等级
本版专家分:108973
勋章
Blank
蓝花 2008年7月 VC/MFC大版内专家分月排行榜第三
2007年11月 VC/MFC大版内专家分月排行榜第三
dbger

等级:

下载类Download.php

class Download { var $filepath; var $downname; var $ErrInfo; var $is_attachment = false; var $_LANG = array( 'err' => '错误', 'args_empty' => '参数错误。', 'file_not_exists' =>... .

vs2015链接错误 fatal error C1001: An internal error has occurred in the compiler.

解决方法: 将下述框中的选项置为No:

AutoJs4.1.0实战教程---最后惊喜的一篇

把代码和Apk分享给大家,各取所需,挂机的直接Apk,编程的程序员直接源代码:https://pan.baidu.com/s/188OYDdpFG6y77evWONE-9A 提取码:49xt ...我在抖音上看到一个疯子发个视频说:每天写1000篇软文发布...

特殊字符--百度百科

‱ ⅿ ⅾ ⅽ ⅼ ⅻ ⅺ ⅹ ⅸ ⅷ ⅶ ⅵ ⅴ ⅳ ⅲ ⅱ ⅰ ↂ ↁ Ⅿ Ⅾ Ⅽ Ⅼ Ⅻ Ⅺ Ⅹ Ⅸ Ⅷ Ⅶ Ⅵ Ⅴ Ⅳ Ⅲ ...Ⅾ Ⅿ ⅰ ⅱ ⅲ ⅳ ⅴ ⅵ ⅶ ⅷ ⅸ ⅹ ⅺ ⅻ Ⅰ Ⅱ Ⅲ Ⅳ Ⅴ Ⅵ Ⅶ Ⅷ Ⅸ Ⅹ Ⅺ Ⅻ Ⅿ ⅿ Ⅾ ↁ ⅾ Ⅽ ⅽ...

Unicdoe【真正的完整码表】对照表(一)

真正完整的Unicode码表,其中CJK = Chinese-...查看完整索引到:http://blog.csdn.net/xjgprs/article/details/5780574 2E80-2EFF:CJK 部首补充 (CJK Radicals Supplement)  2F00-2FDF:康熙字典部首 (Kangxi Ra

牛客编程题1:请实现一个函数,将一个字符串中的每个空格替换成另一个字符 ——Python

目的: 旨在记录在牛客网上刷题的过程,作纪念。 题目: 请实现一个函数,将一个字符串中的每个空格替换成“%20”。例如,当字符串为We Are Happy....样例字符串相当于一个字符list,遍历样例字符串,遇到...实现代码...

微信表白代码

天气越来越冷了 榴莲越来越懒了 国庆假期也过完了 元旦假期什么时候来啊 ...2、ไม่ว่าจะเกิดอะไรขึ้นก็ตามโปรดอย่าปล่อยมือฉันด้วย ฉันต้องการจ...

Python numpy.transpose 详解

前言看Python代码时,碰见 numpy.transpose 用于高维数组时挺让人费解,通过一番画图分析和代码验证,发现 transpose 用法还是很简单的。 正文Numpy 文档 numpy.transpose 中做了些解释,transpose 作用是改变序列,...

狗血的Mybatis文件路径问题(org.apache.ibatis.binding.BindingException: Invalid bound statement (not ...

@[toc](org.apache.ibatis.binding.BindingException: Invalid bound statement (not found)) 1、问题描述   今天学习Mybatis运行程序的时候不出意外,出现异常了。 org.apache.ibatis.binding.BindingException: ...

org.hibernate.validator.internal.engine.ConfigurationImpl.getDefaultParameterNameProvider()Ljavax/va

1、错误描述严重: StandardWrapper....org.springframework.beans.factory.BeanCreationException: Error creating bean with name 'org.springframework.validation.beanvalidation.OptionalValidatorFactoryBean#0

hive环境搭建提示: java.lang.NoSuchMethodError: com.google.common.base.Preconditions.checkArgument

提示的错误信息: SLF4J: Actual binding is of type [org.apache.logging.slf4j.Log4...Exception in thread "main" java.lang.NoSuchMethodError: com.google.common.base.Preconditions.checkArgument(ZLj...

【spark】异常:org.apache.spark.sql.AnalysisException: resolved attribute(s)

本人菜鸟一只,天天写bug,今天又来记录一个解决了的bug! 业务逻辑: 1、从一张行为表中,抽取有特点行为的用户 2、将这部分用户id拿到之后保存 3、然后再将这部分用户id关联回行为表,获得这部分用户的所有......

com.android.builder.dexing.DexArchiveMergerException: Error while merging dex

问题: 导入第三方库或者框架之后没有任何问题,在编译运行的时候出现:Caused by: java.lang.RuntimeException: ...org.gradle.api.tasks.TaskExecutionExcep...

来大神看看java.io.FileNotFoundException:

java.io.FileNotFoundException: F:\Users\file\.metadata\.plugins\org.eclipse.wst.server.core\tmp0\wtpwebapps\*****\static\files\temp\1509615179526.docx (系统找不到指定的路径。) at java.io....

java.lang.ClassNotFoundException: org.apache.jsp.index_jsp

一、出现的问题 在使用IntelliJ IDEA 运行JSP页面时报以下错误: HTTP Status 500 - java.lang.ClassNotFoundException: org.apache.jsp.index_jsp ...message java.lang.ClassNotFoundException: org.apache.js

at com.mysql.jdbc.Util.handleNewInstance(Util.java:404)

com.mysql.jdbc.exceptions.jdbc4.MySQLNonTransientConnectionException: Could not create connection to database server. at sun.reflect.NativeConstructorAccessorImpl.newInstance0(Native Method) at sun.re...

invalid comparison: java.util.ArrayList and java.lang.String 异常解决方法

在mybatis的xml中增加一个list操作是,...org.mybatis.spring.MyBatisSystemException: nested exception is org.apache.ibatis.exceptions.PersistenceException: ### Error querying database. Cause: java.lang....

IntelliJ IDEA 创建SpringBoot项目报错: 程序包org.springframework.boot不存在

解决方案: 在pom.xml配置文件中添加依赖 <dependency> <groupId>org.springframework.boot</groupId> <artifactId>spring-boot-starter-aop</artifactId>......

LSTM中tf.nn.dynamic_rnn处理过程详解

在唐宇迪之tensorflow学习笔记项目实战(LSTM情感分析)一文中,链接地址如下https://blog.csdn.net/liushao123456789/article/details/78991581。对于tf.nn.dynamic_rnn处理过程的代码如下,...lstmCell = tf.cont...

解决ubuntu系统 dns覆盖写入127.0.0.53的问题

因为/etc/resolve.conf中存在 nameserver 127.0.0.53回环地址造成循环引用 手动修改无果,每次重启依旧会覆盖 原因 ubuntu17.0之后特有,systemd-resolvd服务会一直覆盖 解决办法 sudo systemctl stop systemd-...

this.class.getProtectionDomain().getCodeSource().getLocation()

this.class.getProtectionDomain().getCodeSource().getLocation()如果直接执行.class文件那么会得到当前class的绝对路径。如果封装在jar包里面执行jar包那么会得到当前jar包的绝对路径。String path = getClass()....

java.sql.Timestamp类的使用

java.sql.Timestamp类的使用  Timestamp 可以精确到小数秒 一般存储的格式:2016-12-18 11:05:36.531  Timestamp 可以获取当前时间,也可以把字符串装换成Timestamp类型 1. 获取当前时间: ...

Could not find parameter map com.itcast.mapper.userinfMapper.map

org.apache.ibatis.exceptions.PersistenceException:  ### Error querying database. Cause: org.apache.ibatis.builder.IncompleteElementException: Could not find parameter map com.itcast.mapper.userin

异常解决 java.io.FileNotFoundException: class path resource [spring/applicationContext_*.xml]

maven创建web工程的时候报...org.springframework.beans.factory.BeanDefinitionStoreException: Could not resolve bean definition resource pattern [classpath:spring/applicationContext-*.xml]; nested exception

Linux 解压tar.gz并安装

$ tar -zxvf redis.tar.gz -C 目标目录 2.去到解压过后的目录下,进到Redis目录,下面有个Makefile: 3.直接在Redis目录下执行: $ make 4.继续在该目录下执行: make install 5.发现权限不够,报错了。先去...

分享以下编译错误:java.util.concurrent.ExecutionException: java.lang.UnsupportedOperationException的...

最近一个项目从eclipse转为了AS项目,修改依赖后第一次运行时碰到如下错误: Error:Execution failed for task ':videoPlayer:...> com.android.build.api.transform.TransformException: com.android.ide.common.

关于启动项目报java.sql.SQLNonTransientConnectionException: CLIENT_PLUGIN_AUTH is required错的问题

Loading class `com.mysql.jdbc.Driver'. This is deprecated. The new driver class is `com.mysql.cj.jdbc.Driver'. The driver is automatically registered via the SPI and manual loading of the driver class...

Linux下报:-bash: ./server.sh: 权限不够

1.错误原因:  这是因为对*.sh文件的读、写、运行权限不足; -bash-4.2$ ./server.sh -bash: ./server.sh: 权限不够 2.解决方案: chmod 777 ./*.sh -bash-4.2$ chmod 777 ./*.sh    ...

maven打包报错:Failed to execute goal org.apache.maven.plugins:maven-surefire-plugin:2.6:test,总结...

将项目进行打包时,先clean、compile都成功,但在...Failed to execute goal org.apache.maven.plugins:maven-surefire-plugin:2.6:test (default-test) on project eSale-service: There are test failures. 翻译...

org.springframework.web.servlet.PageNotFound]-[WARN] No mapping found for HTTP request with URI [/re

[org.springframework.web.servlet.PageNotFound]-[WARN] No mapping found for HTTP request with URI [/rest/page/index] in DispatcherServlet with name ‘taotao-manage’怎么想都想不明白,几经

相关热词 c#小程序 c# 网站检测 c# 两个问号 c#中泛型的重载 c#json添加 c# 图形界面设计 c# 没有注册类 c# 截取最后一个字符串 c# 释放指针 c#可不可以做网页开发