Too few arguments 怎么解决这问题 [问题点数:20分,结帖人qq864384773]

Bbs1
本版专家分:16
结帖率 80.95%
Bbs9
本版专家分:88592
版主
Blank
黄花 2016年8月 PHP大版内专家分月排行榜第二
2016年4月 PHP大版内专家分月排行榜第二
2015年12月 PHP大版内专家分月排行榜第二
2014年5月 PHP大版内专家分月排行榜第二
2013年11月 PHP大版内专家分月排行榜第二
2013年10月 PHP大版内专家分月排行榜第二
2013年9月 PHP大版内专家分月排行榜第二
2013年8月 PHP大版内专家分月排行榜第二
2013年7月 PHP大版内专家分月排行榜第二
2013年6月 PHP大版内专家分月排行榜第二
2013年5月 PHP大版内专家分月排行榜第二
2013年4月 PHP大版内专家分月排行榜第二
2013年3月 PHP大版内专家分月排行榜第二
2013年2月 PHP大版内专家分月排行榜第二
2013年1月 PHP大版内专家分月排行榜第二
2012年12月 PHP大版内专家分月排行榜第二
2012年11月 PHP大版内专家分月排行榜第二
2012年10月 PHP大版内专家分月排行榜第二
2012年9月 PHP大版内专家分月排行榜第二
2012年7月 PHP大版内专家分月排行榜第二
2012年6月 PHP大版内专家分月排行榜第二
2012年5月 PHP大版内专家分月排行榜第二
2011年9月 PHP大版内专家分月排行榜第二
2011年8月 PHP大版内专家分月排行榜第二
2011年7月 PHP大版内专家分月排行榜第二
Blank
蓝花 2017年3月 PHP大版内专家分月排行榜第三
2016年12月 PHP大版内专家分月排行榜第三
2016年11月 PHP大版内专家分月排行榜第三
2014年10月 PHP大版内专家分月排行榜第三
2014年8月 PHP大版内专家分月排行榜第三
2014年3月 PHP大版内专家分月排行榜第三
2014年1月 PHP大版内专家分月排行榜第三
2012年8月 PHP大版内专家分月排行榜第三
2012年2月 PHP大版内专家分月排行榜第三
2012年1月 PHP大版内专家分月排行榜第三
2011年12月 PHP大版内专家分月排行榜第三
2011年11月 PHP大版内专家分月排行榜第三
2011年6月 PHP大版内专家分月排行榜第三
Bbs1
本版专家分:16
too few arguments
改为<em>解决</em>
too few arguments to function 问题
最近我在LINUX写一个图形软件, 用x<em>too</em>lkit . 在调用一个函数时出现上述<em>问题</em>? 请问这是<em>怎么</em>一回事?? 哪些原因可导致它。
caffe安装出现 “error : too few arguments in function call” 的错误
windows10下安装caffe,用的CUDA9.1,在编译libcaffe时出现<em>too</em> <em>few</em> <em>arguments</em> in function call的错误,发现提示出现在D:\caffe\caffe-master\include\caffe\util中的”cudnn.hpp”中的114行,然后我将这行周围代码改成下面就编译成功了 template &amp;lt;typename Dtype&amp;g...
关于C++编译静态模板成员数据出错 Too few template-parameter-lists
Too <em>few</em> template-parameter-lists 《STL源码剖析》 编译出错
gstreamer 0.10编译遇到错误
在linux下编译gstreamer出现一下错误: grammar.tab.c: In function 'priv_gst_parse_yyparse': grammar.tab.c:1819:7: error: <em>too</em> <em>few</em> <em>arguments</em> to function 'priv_gst_parse_yylex'    if (yychar == YYEMPTY)      
有参数block 调用
#import typedef void (^workBlock)(int day); void work(workBlock w, int day) { NSLog(@"起床"); NSLog(@"刷牙"); NSLog(@"去车站"); NSLog(@"坐车"); w(day); // 如果写成 w() 提示错误: Too <em>few</em> <em>arguments</em> to block call,
编译twostreamfusion工程时遇到的问题
编译twostreamfusion工程时遇到的<em>问题</em> 编译环境说明: ubuntu14.0.4 gcc4.8 cuda-8.0 matlab2015b 工程链接为:https://github.com/feichtenhofer/twostreamfusion <em>问题</em>1:nvcc fatal : ‘.rodata’ can not be used when making a sha...
Python程序打包
最近因为做项目需要,需要在windows中安装pyinstaller用于将.py文件生成脱离python平台的可执行程序*.exe文件。安装第一步:安装python2.7第二步:安装pywin32(Python for Windows Extensions)第三步:安装pyinstaller3.2测试安装成功:C:\Users\AA>pyinstaller usage: pyinstaller-sc
caffe cudnnSetConvolution2dDescriptor error: too few arguments in function call
参考https://devtalk.nvidia.com/default/topic/1002826/question-about-cudnnsetconvolution2ddescriptor/ 在cudnn.hpp中查看cudnnSetConvolution2dDescriptor的正确的调用方法:template inline void setConvolu
PHP报错:ArgumentCountError: Too few arguments to function SystempumbAction::index(), 0 passed
升级PHP后 缺少参数或者参数为空或者不存在引起 检查方法参数是否正确
laravel5.5mysql事务报错 Type error: Too few arguments to function
DB::transaction(function () { DB::table('users')-&amp;gt;update(['votes' =&amp;gt; 1]); DB::table('posts')-&amp;gt;delete(); });上面这是laravel5.5官方的方法,但是我不知道为什么我这边会不断报错。后来我就直接改了另外一种事务手动回滚。 DB::beginTransact...
caffe 安装时提示cudnn.hpp(114): too few arguments in function call
问:Try to build Caffe with GPU and MATLAB support. However, when I use build_win.cmd to install, It can’t build and with the error :“D:\caffe-windows\caffe-windows\scripts\build\ALL_BUILD.vcxproj” (def
cuda安装和caffe
cuda安装和caffe
Laravel 查询构造器的使用(一)
使用查询构造器对数据库的 增 - 删 - 改 操作 //使用查询构造器新增数据 public function query1() { $bool = DB::table('student')-&amp;gt;insert( ['name' =&amp;gt; 'mohuani', 'age' =&amp;gt; 19] ); ...
laravel 不能对时间字段进行分组查询month(FROM_UNIXTIME(payment_time) 原因
-
有关编译yaffs2的问题
有关编译yaffs2的<em>问题</em> 我是2009.10.27号下载的yaffs源代码,我没想到会有这么低级的错误,在yaffs2/utils/mkyaffs2image.c中的write_chunk()调用yaffs_PackTags2()时,yaffs_PackTags2()竟然少一个参数。 我們可使用以下的指令去抓取最新的YAFFS的程式碼:
从 PHP5.2 升级到 PHP7.1 遇到的一个函数参数问题
最近在做一个系统的ID管理系统php升级,从php5.2升级到php7.1,经常会遇到一些<em>问题</em>。今天遇到一个小<em>问题</em>,拿出来分享一下。废话少说,上示例代码。 SC.php &amp;lt;?php class SC { static function out($str) { echo 'input str:' . $str; ...
关于无法编译caffe中libcaffe的问题
-
gstreamer 0.10.36 源码编译error
在linux下编译gstreamer出现一下错误: grammar.tab.c: In function 'priv_gst_parse_yyparse': grammar.tab.c:1819:7: error: <em>too</em> <em>few</em> <em>arguments</em> to function 'priv_gst_parse_yylex'    if (yychar == YYEMPTY)       
laravel App\Http\Controllers\Auth\RegisterController 注册用户时候触发了一个没有Listener的是事件
场景:        查看laravel 注册部分源码 发现RegisterController的trait RegistersUsers  在注册账户的触发了一个事件         Illuminate\Auth\Events\Registered       但是这个事件 没有Listener 去处理 解析:     这个事件的Listener是自己扩展的,满足自己的定制化需求下面贴上源码:...
Thinkphp3.2 Too few arguments to function Think\Controller::show()
今天用了TP3.2遇到了这个错 百度也找不到答案 发现是用了高版本的php &gt;7.1 即会报错
too few arguments for call问题
要写一个4 * 4的矩阵,然后分别求出:rn1.对角线元素的和;rn2.副对角线元素的积;rn3.最大的元素;rnrn我写的代码如下,但是while里第一行a[i] = scanf _ s(); 报错,提示rn<em>too</em> <em>few</em> <em>arguments</em> for call,请问是什么<em>问题</em>,应该怎样更正rnrnrn```rn#include rn#include rnrnint main()rnrn int a[16], i, x, y, z;rnrn i = 0;rn while (i < a[i])rn z = a[i];rn rn printf("%d\n%d\n%d\n", x, y, z);rnrn system("pause");rn return 0;rnrn```rnrn
python的argparse 模块测试
argparse是python 内置的用于命令行选项与参数解析的模块 使用一般分为三步, 创建ArgumentParser()对象,调用add_argument() 方法添加参数,调用parse_args()解析添加的参数 其中参数有分为可以参数和必选参数 下面的例子包含了可选参数和必选参数,下面的--sum 属于可选参数 import argparse parser=argparse.Arg...
WIFI移植步骤
Build Instructions: 1> $tar -xvzf DPB_RT2870_Linux_STA_x.x.x.x.tgz go to “./DPB_RT2870_Linux_STA_x.x.x.x” directory.2> In Makefile set the “MODE = STA” in Makefile and chose the TARGET to L
编译linux内核遇到的问题
<em>问题</em>一: 编译linux内核(OK210),多个地方出现这个<em>问题</em>: error: <em>too</em> <em>few</em> <em>arguments</em> to function 'mmc_suspend_host' 网上查了下mmc_suspend_host函数原型: http://blog.chinaunix.net/xmlrpc.php?r=blog/article&uid=28685940&id=3889878
套接字缓冲区的大小
SO_RCVBUF:接受缓冲区大小 SO_SNDBUF: 发送缓冲区大小 操作程序举例: socklen_t optlen; optlen = sizeof(int); /*get SO_RCVBUF*/ int rcvbuflen; if(0 != getsockopt(listenfd,SOL_SOCKET,SO_RCVBUF,&rcvbuflen,&optlen)){
编译错误“Too many arguments to function call....”
运行编译过程中出现错误,并提示“Too many <em>arguments</em> to functions call, expected....”的信息,如图一。 遇到这种情况时,该如何<em>解决</em>呢?<em>解决</em>方法是将属性“Enable Strict Checking of objc_msgSend Calls”的值设置成“No”,即TARGETS——>项目——>Build Settings——>Apple LLVM
Std::map too few template arguments
        在上述的代码中,红色波浪线的部分编译的时候报错: error C2976: 'std::map' : <em>too</em> <em>few</em> template <em>arguments</em>   换成std::map&amp;lt;std::string, std::string&amp;gt;也是一样的错误. <em>怎么</em>回事那? [<em>解决</em>方法] 包含 map就可以了. ...
caffe权值可视化,特征可视化,网络模型可视化
-------------------------------------------------------------------------------- 权值可视化 对训练后的网络权值进行可视化可以判断模型的优劣及是否欠(过)拟合。经过良好训练的网络权值通常表现为美观,光滑;反之则表现为噪声图像,或者图案相关性太高,或者缺乏结构性,或有较多‘死’区域。 -----------
Yii2基类控制器文件分析(yii\base\Controller.php)创建动作执行动作
Yii2基类控制器文件分析(yii\base\Controller.php)创建动作执行动作
dell M4800 安装centos 7系统的无线驱动
https://www.zhihu.com/question/50518514 http://blog.csdn.net/qq_30949367/article/details/50887135 03:00.0 Network controller: Broadcom Corporation BCM4352 802.11ac Wireless Network Adapter (rev 03
使用pycaffe绘制网络图
在编译好pycaffe后,可以使用python文件夹下的draw_net.py绘制神经网络的结构图。 为了正常绘制,需要先安装一些依赖 sudo apt-get install graphviz pip install pydot 试运行 pikachu@pikachu-PC:~/swcontest/caffe/python$ python draw_net.py usage: draw_...
极验与vue的原生js结合
极验验证码和vue的结合
Darknet训练MNIST数据集
1. Darknet默认输入为彩色图片     load_image_augment_paths函数-------&amp;gt;load_image_color函数中,参数固定了通道数为3。     所以cfg文件中的channel通道设定并没有什么用处。     虽然MNIST是灰度图,依然可以设定channels=3,在加载图片过程中会最终修正为实际的图片通道数。   2.  打印报错To...
bug:error:too few arguments to function ‘fopen’
 #define File_Path "cpu_usepercentage_file.txt"
error: too few arguments in function call
最近编译caffe报错,我的cudnn版本(cuDNN :  ver. 7.0.5),然后caffe中cudnn版本太低,出现的错误: CMake Error at cuda_compile_1_generated_bias_layer.cu.o.Release.cmake:279 (message): Error generating file /home/fuxueping/sdb...
caffe 与cudnn版本不匹配 ./include/caffe/util/cudnn.hpp:127:41: error: too few arguments to function
这是因为当前版本的caffe的cudnn实现与系统所安装的cudnn的版本不一致引起的。 <em>解决</em>办法: 1.将./include/caffe/util/cudnn.hpp 换成最新版的caffe里的cudnn的实现,即相应的cudnn.hpp. 将./include/caffe/layers里的,所有以cudnn开头的文件,例如cudnn_conv_layer.hpp。 都替换成最新版的caf...
cudnn.hpp:127:41: error: too few arguments to function ‘cudnnStatus_t cudnnSetPooling2dDescriptor
請注意,本類僅僅是記錄開發過程中遇到對問題,可能會亂貼代碼,亂貼圖,亂貼報錯信息,不保證能解決問題,以及有優美的排版,後面有時間我會重新整理的。編譯caffe-fast-rcnn時的問題,主要原因是caffe版本太低,而我的cuda,cudnn版本太高,升級caffe版本即可。 GitHub上的解決方案,點這裏 下面是抄的GitHub上面的升級caffecd caffe-fast-rcnn gi
IAR编译出错:Error[Pe165]: too few arguments in function call
先找出具体出现的文件,然后把函数逐个注释掉,编译,找出相应出错的函数。该错误是由于调用的参数少了导致的,即使某些参数在都中情况下无效,但也要加上去。例如gpio_init (PORTx portx, u8 n, GPIO_CFG cfg, u8 data),在调用时,当设置成输入上拉时,data参数为0或1都没起作用,但调用是也需要加上:gpio_init(PORTB ,23 , GPI_UP,0
Laravel和Vue项目(2)--API方法调用
11
关于Vue环境安装跑起来时候报错的问题
Vue环境配置好后,运行npm run dev报错,如图: 这是因为webpack的新版本的Bug,<em>解决</em>方法就是卸载新版本,安装老版本: npm remove webpack-dev-server; 再安装老版本的webpak,这样再跑起来的时候就成功了 ...
让你的OpenStack支持多区域(Muilt-Region)特性
背景#### 这几天公司第二个机房开始投入生产,作为新的开发测试环境,也毫不疑问采用的是OpenStack方案。由于OS本身支持Muilt-Region,研究了下,确实方便了很多。避免了有两个管理入口的<em>问题</em>,另外Dashboard支持多区域也方便进行统一的管理。不得不说OS确实很强大。 基础知识#### 我们都知道Region是OpenSta...
priority_queue,以及运算符重载
为了研究priority_queue,我们先写一段错误代码:#include #include using namespace std;struct Node{int key;int value;};int main(){Node nodes[2]={1,0,2,0};priority_queue<> pqLess; /
mongodb 数据导入导出若干问题
使用mongoexport.exe导出数据 , mongoimport.exe 导出数据 //导出 .json文件 D:\<em>too</em>l\mongo\bin\mongoexport --username user --password 123456 --collection test --db memo --out D:\<em>too</em>l\mongo\backup\outputfile\test.j
高分求助 Intelliense : too few arguments in function call
Intelliense : <em>too</em> <em>few</em> <em>arguments</em> in function call ****.h 64(lines) 谁能告诉我什么情况?! 编译的时候没有任何错误,在debug运行的时
caffe小问题大烦恼——安装时提示cudnn.hpp : too few arguments in function call
cudnn版本有<em>问题</em>,应该改用cudnn5.1。
caffe-windows编译中出现的【error: MSB3721】解决办法
(5)编译遇到的<em>问题</em>     【conv_layer.cu】 错误 78 error: <em>too</em> <em>few</em> <em>arguments</em> in function call;     【error: MSB3721】     无法打开输入文件caffelib.lib <em>解决</em>方法: 可以认为错误(2)(3)是由错误(1)引起的。错误(1)是在编译caffelib项目是出现的,定位
WIN10 + cuda9.1 + cudnn7.0.5 + caffe入坑总结回顾
毕业设计入坑表情识别做如下总结1cuda1.1下载cudacuda9.1下载传送门1.2 添加环境变量cuda 安装好后,需检查系统环境变量。若没有,则要手动添加。2 cudnn2.1 下载cudnn由于cudnn下载页面维护,附百度网盘下载地址。cudnn下载传送门(该cundnn对应cuda9.1版本)这里给出一张cudnn与cuda版本匹配的图2.2 部署cudnn下载解压缩后,将文件夹下c...
too few argument in function call解决方案
我是在生成libface的<em>解决</em>方案中遇到的,使用的是cuda8.0 + cudnn7.0,如果你的出错文件也是cudnn.hpp和CUDA 8.0.targets,如下方法应该能<em>解决</em> <em>问题</em>原因是cudnnSetConvolution2dDescriptor()函数缺少最后一个参数(你可以右键转到定义去查看这个函数的声明),然后直接添加缺少的参数,我写的是 CUDNN_DATA_FLOAT,能<em>解决</em>
gsoap问题[too few arguments to function `soap_set_attr']
soapC.c: In function `soap_out_SOAP_ENV__Reason':rnsoapC.c:860: error: <em>too</em> <em>few</em> <em>arguments</em> to function `soap_set_attr'rnrn根据自定义的头文件,用soapcpp2生成相应的代码后,编译程序时总是提示这个错误。rn查了生成的代码,soap_set_attr这个函数的定义如下:rnsoap_set_attr(struct soap *soap, const char *name, const char *value, int flag)rnrn应该是四个参数,但报错的地方,对soap_set_attr的调用是这样子的:rnsoap_set_attr(soap, "xml:lang", soap->lang);rnrn明显少了一个参数,而soapC.c也是soapcpp2生成的,按道理不应该前后不一致。rnrn委实搞不明白为什么,急盼高手赐教。
渗透利器Weevely之奇淫技巧篇
Weevely简介 Weevely是一款python编写的webshell管理工具,作为编写语言使用python的一款工具,它最大的优点就在于跨平台,可以在任何安装过python的系统上使用。本文介绍的不是它最基本的功能,而是在渗透测试过程中使用它的奇淫技巧。 安装运行 Linux:(python2.7版本的Debian/Ubuntu) $sudo apt-get install g++
《Linux命令行与shell脚本编程大全》 第十四章 学习笔记
第十四章:呈现数据 理解输入与输出标准文件描述符文件描述符缩写描述0STDIN标准输入1STDOUT标准输出2STDERR标准错误 1.STDIN代表标准输入。对于终端界面来说,标准输入是键盘使用输入重定向符号(2.STDOUT代表标准输出。对于终端界面来说,标准输出是屏幕3.STDERR代表标准错误输出。默认情况下,STDOUT文件描述符和STDERR文件描述符指向同样的地方,即显示器。重定向S
shell脚本if判断语句报错[: too many arguments的两种原因
shell脚本,if判断语句报错[: <em>too</em> many <em>arguments</em> 我遇到过两种情况: 1、第一中情况就是网上大家说的,字符串变量中可能存在空格,shell解析时将其认为是多个参数,再进行判断时,无法知道该获取哪个值,例如: 脚本ee.sh: strings1="hello world" strings2="hello world" if [ $strings1 = $st
Laravel 查询构造器的使用(三)
查询构造器中的构造函数 //聚合函数 public function query5() { $num = DB::table('student')-&amp;gt;count(); var_dump($num); $max = DB::table('student')-&amp;gt;max('age'); var_d...
PHP7.0,PHP7.1.x新特性
PHP7.1.x新特性风.fox1.可为空(Nullable)类型类型现在允许为空,当启用这个特性时,传入的参数或者函数返回的结果要么是给定的类型,要么是 null 。可以通过在类型前面加上一个问号来使之成为可为空的。function test(?string $name) { var_dump($name); }以上例程会输出:string(5) &quot;tpunt&quot; NULL Uncaught
yaffs2 源码错误 too few arguments to function 'yaffs_flush_file' 2014.08.22
yaffs2 源码错误
十八、Go基础编程:复合类型—结构体
1 结构体类型 有时我们需要将不同类型的数据组合成一个有机的整体,如:一个学生有学号/姓名/性别/年龄/地址等属性。显然单独定义以上变量比较繁琐,数据不便于管理。 结构体是一种聚合的数据类型,它是由一系列具有相同类型或不同类型的数据构成的数据集合。每个数据称为结构体的成员。 2 结构体初始化 2.1 普通变量 type Student struct { id int ...
谈谈C语言中函数声明/定义冲突时的处理(VS2010、VC6)
首先,本文中讨论的例子采用C语言,而非C++语言。 使用示例分析这个<em>问题</em>: 例子1 #include void hello(int a); void hello(int a, int b); void hello(int a) { printf("hello,
waitpid使用实例
/* * Copyright (c) 2006, 山东大学 * All rights reserved. * * 文件名称:waitpid.c * 文件摘要:学习waitpid函数。 * * 当前版本:1.0 * 作 者:刘庆敏 * 完成日期:2006/11/07 */#include stdio.h>#inc
leetcode中第一题twosum问题解答算法的可行性证明
leetcode中第一题twosum<em>问题</em>解答算法的可行性证明一、引入关于leetcode中第一题twosum<em>问题</em>,网上已有不少高人做出过解答,并提出了切实可行的算法实现。我在解答该题时参考了博客http://www.zixue7.com/article-9576-1.html的解答。为让读者更直观地阅读和理解本文,先简要摘录以上博客的内容如下: 题目还原 Two Sum Given an arr
Shell脚本攻略学习笔记十二之mktemp命令
Shell脚本攻略学习笔记十二之mktemp命令 mktemp - create a temporary file or directory Create a temporary file as follows [root@server4 shells]# mktemp /tmp/tmp.MeH1jVsPRi To create a temporary directory, us...
JohnLui/AliyunOSS v1.0 发布,附 Laravel 框架详细使用教程及代码
___ __ _ ____ _____ _____ / | / / (_) __ __ __ __ ____ / __ \ / ___/ / ___/ / /| | / / / / / / / / / / / / / __ \
get_user_pages — 获取用户区进程使用内存的某个页
int get_user_pages (    struct task_struct * tsk,         /////     the task_struct to use for page fault accounting, or NULL if faults are not to be recorded.   一般选择current      struct mm_struct * m
谈谈C语言中函数定义/声明冲突时的处理
首先,本文中讨论的例子采用C语言,而非C++语言。 使用示例分析这个<em>问题</em>: 例子1 [cpp] view plaincopyprint? #include      void hello(int a);  void hello(int a, int b);    void hello(int a)  {      printf("hello, %d\n", a);
IOS中导入OpenCV
1,试过从官网直接下库但是貌似编译的时候一堆错误。 2,后来直接就用Cocapods啦 直接在Podfile中添加pod ‘OpenCV’, ‘~> 3.0.0’。然后在命令行输入Pod install,就好了。3.在pch文件中加入以下定义#ifdef __cplusplus #import #endif4,编译一下工程试试。OK编译完成 ,证明已经成
玩Python遇到的问题一二三及解决办法
最近要频繁的玩Python,在这里总结下遇到的一些<em>问题</em>,持续更新中。 <em>问题</em>一:python 2.7版本<em>解决</em>TypeError: ‘encoding’ is an invalid keyword argument for this function。 用Python2.7来打开一些文件的时候,经常出现以上的所表示的<em>问题</em>,如 data_file = open(&amp;amp;amp;amp;amp;amp;amp;amp;amp;quot;F:\\MyPro\\data...
FastDFS-Nginx扩展模块源码分析 -- mod_fastdfs原理解析
1. 背景 在大多数业务场景中,往往需要为FastDFS存储的文件提供http下载服务,而尽管FastDFS在其storage及tracker都内置了http服务, 但性能表现却不尽如人意; 作者余庆在后来的版本中增加了基于当前主流web服务器的扩展模块(包括nginx/apache),其用意在于利用web服务器直接对本机storage数据文件提供http服务,以提高文件下载的性能。
Linux 底下 文件过多导致 ls 命令出现 arguments too long 的问题
作为一个linux用户/系统管理员, 有些时候你会遇到以下错误提示:  [user@localhost foo]$ mv * ../foo2bash: /bin/mv: Argument list <em>too</em> long “Argument list <em>too</em> long”参数列表过长错误经常发生在用户在一行简单命令中提供了过多的参数而导致,经常在ls *, cp *, rm
hostapd交叉编译及测试脚本
Hostapd的功能就是作为softAP的认证服务器,负责控制管理stations(通常可以认为带无线网卡的PC)的接入和认证。hostapd一般与wpa_supplicant同时提供,这个东西是实现WPA加密认证的。   cp defconfig .config vi .config CFLAGS += -I/home/imx6s/third/libnl-3.2.25/include/
keil mdk 常见警告解析
1,warning Deprecated declaration/函数/ - give arg types 该函数如果没有参数就要在括号里加“void” 例如:函数定义 void TP_GetAdXY() {     int adx,ady;     adx=Read_X();     ady=Read_Y();     //*x=adx;     //*y=ady;
关于bash中的“too many arguments问题
if test -z `cat filename` 当filename为空或者只有一行没有空格的字符串的时候,一切正常,反之,则会报,诸如 : <em>too</em> many <em>arguments</em>,甚至是: binary operator expected之类的错误,参见了一下:http://www.ibm.com/developerworks/cn/linux/shell/bash/bash-2/index...
CRNN安装
本来看中了crnn的end2end性能,结果一安装,我擦泪,坑<em>怎么</em>这么多。记住:CRNN库版本依赖非常严重!非常严重!严重!重!下面是我的安装记录,希望对大家有帮助~~~~~~~~~~~~~~~~~~~~~~~~~~~~~~~~~~~~~~~~~~~~~~~~~~~~~~~~~~~~~~~~~~~~~~~~~~~~~~0、环境要求Ubuntu14 64位gcc版本5.4.0python源码编译的时...
python错误笔记(杂)
1. TypeError:not all <em>arguments</em> converted during string formatting 这个<em>问题</em>一般和格式化有关系,正确的格式应该是: ‘delete from %s %s’ % (table_name, where_condition) 其中格式化中接受元组或者list形式内容,因此也可以是 ‘delete from %s %s’ % [tab
兄弟连go教程(19)数据 -Struct
值类型,赋值和传参会复制全部内容。可⽤用 &quot;_&quot; 定义补位字段,⽀支持指向⾃自⾝身类型的指针成员。type Node struct { _ int id int data *byte next *Node } func main() { n1 := Node{ id: 1, data: nil, } n2 := Node{ id: 2, data: nil, next: &amp;amp;n1, } }...
ESP32 学习笔记(二十三)看门狗
看门狗看门狗概述中断看门狗任务看门狗定时器JTAG 和 看门狗 看门狗 概述 ESP-IDF 支持两种类型的看门狗:中断看门狗定时器和任务看门狗定时器(TWDT)。中断看门狗定时器和 TWDT 都可以使用 make menuconfig 启用,但 TWDT 也可以在运行时启用。中断看门狗负责检测 FreeRTOS 任务切换长时间被阻止的情况。TWDT 负责检测运行的任务在长时间没有让出 CPU 的...
git创建密匙时报错Too many arguments
如题:git创建密匙时报错Too many <em>arguments</em>。 最近换了电脑,所以git需要重新创建密匙,运行命令ssh-keygen -t rsa -C “123456789@qq.com”时报错: Too many <em>arguments</em>. usage: ssh-keygen [-q] [-b bits] [-t dsa | ecdsa | ed25519 | rsa | rsa1]
Laravel5中使用阿里大于(鱼)发送短信验证码
在做用户注册和个人中心的安全管理时,我实现借助第三方短信平台(阿里大于(鱼))在Laravel框架中进行手机验证的设置;阿里大于,是阿里通信旗下优质便捷的云通信服务平台,整合了三大运营商的通信能力,为开发者提供简洁易用的短信/语音API,三网合一通道,按需付费。 安装laravel阿里大于(鱼)服务 composer require iscms/alisms-for-laravel 注册
YOLO源码分析之data.c
[net] batch=64 subdivisions=8 height=416 width=416 channels=3 momentum=0.9 decay=0.0005 angle=0 saturation = 1.5 exposure = 1.5 hue=.1 learning_rate=0.0001 max_batches = 45000 policy=steps steps=100,
crt0.c代码内容解释和编译器构造
下面用红色字体,做部分解释:   1/**//***   2*crt0.c - C runtime initialization routine   3*   4*       Copyright (c) 1989-1997, Microsoft Corporation. All rights reserved.   5*   6*Purpose:   7*       Th
Git创建秘钥时提示:too many arguments解决
①<em>问题</em>:刚刚进入Spring大门!一边着手准备入坑《Spring源码深度解析》,一边准备见识GitHub新世界,结果在准备使用Git时被拦在了创建秘钥报错:Too many <em>arguments</em>这里! Administrator@USER-20180802ED MINGW64 ~ $ ssh-keygen -t rsa-c &quot;XXX@XXX.COM&quot;Too many <em>arguments</em>. usag...
Knime升级到2.22了
不知不觉,距离上次发帖已经过去7个月了,时间真是太快了。 上次刚刚发完Knime升级到2.11的帖子,现在发现Knime在9月30日升级到2.22了。先把官方的变动贴出来,再说下自己的看法。  Changes from v2.1.1 to v2.1.2 Enhancements Enh 2178: New Node: Perl node to be published on /labs Enh 2109: Unpivoting node
python调用dll 备忘录
Python调用dll的方式很多文章都已写到,下面列出几个尝试过程中的错误,仅做一个备忘: 1. WindowsError: [Error 193] %1 不是有效的 Win32 错误原因:使用32位编译的dll无法被64位的python解释器调用。 <em>解决</em>方式:1) 换用32位的python。此法较简单。                   2) 生成64位的dll。自己编写的
C语言中基础的字符与字符串的输入与输出
基础字符与字符串的输入与输出
C语言fopen 错误
#include #include int main(int argc,int *argv[]) { char ch; FILE *fp; long count=0; if(argc!=2) { printf("Usage:%s filename\n",argv[0]); } if((fp=fopen(argv[1]),"r")==NULL) { printf("Can'
挂载jffs2文件系统遇到的问题
使用mount -t jffs2 /dev/mtdblock7 /var/dr_bin/命令时报错 mount报failed: No such device错误<em>解决</em>,可能mount了不支持的文件系统,可以先查看一下系统支持哪些文件系统 cat /proc/filesystems  nodev   sysfs nodev   rootfs nodev   bdev nodev   pro
初步对消息队列RabbitMQ的了解
https://www.bhqb.org/tag/rabbitmq RabbitMQ是流行的开源消息队列系统,用erlang语言开发,完整的实现了AMPQ(高级消息队列协议)。网站: http://www.rabbitmq.com/ erlang网站:http://www.erlang.org/ 中文站:http://www.erlang-cn.com/ 首先,先
YOLOv3使用笔记——darknet分类、计算accuracy
https://pjreddie.com/darknet/train-cifar/ 1.数据集准备 本文以darknet19训练开关门数据集为例 根目录data文件夹下新建一个door文件夹用于存放数据集,标签文件。 新建label.txt,分两类开门与关门 open closed 新建train、test文件夹分别用于存放训练集和测试集 其中图片名格式如下:00001_open....
关于“too few template-parameter-lists”的问题
[code=C/C++]rn//FILE: mystring.h(part of the namespace leonardo_1)rn//CLASS PROVIDED:bag (a container class for a collection of items)rn#ifndef LEONARDO_1_MYSTRING_Hrn#define LEONARDO_1_MYSTRING_Hrn#include //Provide size_trnnamespace leonardo_1rnrn class stringrn rn public:rn string(const char str[]);rn private:rn char *characters;rn std::size_t allocated;rn std::size_t current_length;rn ;rnrn#endifrn[/code]rnrn[code=C/C++]rn#includern#includern#includern#include"mystring.h"rnusing namespace std;rnnamespace leonado_1rnrn string::string(const char str[]="")rn rn current_length=strlen(str);rn allocated=current_length+1;rn characters=new char[allocated];rn strcpy(characters, str);rn rnrn[/code]rn[code=C/C++]rn#includern#includern#include"mystring.h"rnusing namespace std;rnint main()rn string s1();rn string s2("123");rn return 0;rnrn[/code]rn编译器GNU g++rn报错:mystring.cpp:8: error: <em>too</em> <em>few</em> template-parameter-listsrn不太清除这是什么原因造成的,请诸位大侠指导指导。rn
汇编语言中 编译 连接 构建时的一些错误以及错误的修正方法(不断积累中...)
1.    汇编编译时出现如下错误:error A2108: use of register assumed to ERROR。一般错误的原因如       下: 在使用fs寄存器的时候先assume fs:nothing代码中可能存在非英文字符没有写.code声明或者一些属于.code的东西放在了数据段(我写程序的时候就因为这个,真难找啊,越明显越容易忽视) 2.  
memccpy()函数介绍
原型: extern void *memccpy(void *dest, void *src, unsigned char ch, unsigned int count);头文件:#include 功能:由src所指内存区域复制不多于count个字节到dest所指内存区域,如果遇到字符ch则停止复制。说明:返回指向字符ch后的第一个字符的指针,如果src前n个字节中不存在ch则返
laravel打印sql日志
直接打印 use Log; use DB; DB::connection()-&amp;gt;enableQueryLog(); Log::info(DB::getQueryLog()); //print_r($orm-&amp;gt;toSql());print_r($orm-&amp;gt;getBindings());exit; \DB::connection()-&amp;gt;...
php7 新特性 遇见就相当于看见《- -》
PHP7 已经出来1年了,PHP7.1也即将和大家见面,这么多好的特性,好的方法,为什么不使用呢,也希望PHP越来越好。  在这里整理 PHP 5.1 ,PHP5.2,PHP5.3,PHP5.4,PHP5.5,PHP5.6 ,PHP7,PHP7.1 所有新特性,已备大家学习及使用  PHP5.1~PHP5.6 http://blog.csdn.net/fenglailea/article/det...
iOS:在objective-c 使用可变参数
objective-c中已有的一些可变参数方法:
jni 调用找不到GetByteArrayElements的解决方法
你的例子是否是书上/网上抄来的  jbyte   *arr   =   env-> GetByteArrayElements(jarr,   0);  只有C++是才用  在C中的写法应该是  jbyte   *   arr   =   (*env)-> GetByteA
mybatis3+spring+springMVC4整合jar包下载
mybatis3+spring+springMVC4整合jar包,导入即可完美使用 相关下载链接:[url=//download.csdn.net/download/qwe6112071/9467007?utm_source=bbsseo]//download.csdn.net/download/qwe6112071/9467007?utm_source=bbsseo[/url]
VB-----图书管理系统下载
大专的毕业设计,功能优良,仅供参考 大专的毕业设计,功能优良,仅供参考 大专的毕业设计,功能优良,仅供参考 相关下载链接:[url=//download.csdn.net/download/boshao12/2169197?utm_source=bbsseo]//download.csdn.net/download/boshao12/2169197?utm_source=bbsseo[/url]
收音机 对讲机 数字钟原理图下载
一些原理图,入对讲机 收音机 数字钟 希望对大家有用哈 相关下载链接:[url=//download.csdn.net/download/cyy123123/2220218?utm_source=bbsseo]//download.csdn.net/download/cyy123123/2220218?utm_source=bbsseo[/url]
文章热词 设计制作学习 机器学习教程 Objective-C培训 交互设计视频教程 颜色模型
相关热词 mysql关联查询两次本表 native底部 react extjs glyph 图标 java的学习问题及解决 区块链解决
我们是很有底线的