VC下运行exe程序出现appcrash错误,怎么解决~求解!! [问题点数:40分,结帖人xiao_fang_zi]

Bbs1
本版专家分:0
结帖率 50%
Bbs12
本版专家分:381294
Blank
状元 2017年 总版技术专家分年内排行榜第一
Blank
榜眼 2014年 总版技术专家分年内排行榜第二
Blank
探花 2013年 总版技术专家分年内排行榜第三
Blank
进士 2018年总版新获得的技术专家分排名前十
2012年 总版技术专家分年内排行榜第七
Bbs1
本版专家分:0
Bbs1
本版专家分:0
Bbs12
本版专家分:381294
Blank
状元 2017年 总版技术专家分年内排行榜第一
Blank
榜眼 2014年 总版技术专家分年内排行榜第二
Blank
探花 2013年 总版技术专家分年内排行榜第三
Blank
进士 2018年总版新获得的技术专家分排名前十
2012年 总版技术专家分年内排行榜第七
Bbs1
本版专家分:62
这AppCrash怎么解决
[code=C#]rn日志名称: Applicationrn来源: Application Errorrn日期: 2012/10/20 14:38:21rn事件 ID: 1000rn任务类别: (100)rn级别: <em>错误</em>rn关键字: 经典rn用户: 暂缺rn计算机: USER-4SMCSKGQH0rn描述:rn<em>错误</em>应用<em>程序</em>名称: SMSTask.<em>exe</em>,版本: 1.0.0.0,时间戳: 0x507cf1bern<em>错误</em>模块名称: clr.dll,版本: 4.0.30319.1,时间戳: 0x4ba1d9efrn异常代码: 0xc00000fdrn<em>错误</em>偏移量: 0x00355bc5rn<em>错误</em>进程 ID: 0x19f8rn<em>错误</em>应用<em>程序</em>启动时间: 0x01cdae8d66157173rn<em>错误</em>应用<em>程序</em>路径: D:\new\SMSTask.<em>exe</em>rn<em>错误</em>模块路径: C:\Windows\Microsoft.NET\Framework\v4.0.30319\clr.dllrn报告 ID: bd566db3-1a80-11e2-90d6-848f69dccfdbrn事件 Xml:rnrn rn rn 1000rn 2rn 100rn 0x80000000000000rn rn 16857825rn Applicationrn USER-4SMCSKGQH0rn rn rn rn SMSTask.<em>exe</em>rn 1.0.0.0rn 507cf1bern clr.dllrn 4.0.30319.1rn 4ba1d9efrn c00000fdrn 00355bc5rn 19f8rn 01cdae8d66157173rn D:\new\SMSTask.<em>exe</em>rn C:\Windows\Microsoft.NET\Framework\v4.0.30319\clr.dllrn bd566db3-1a80-11e2-90d6-848f69dccfdbrn rnrnrn[/code]
AppCrash的错误
本人在同一个 .net<em>程序</em>下实现了两个功能,定义为1,2 rn实验环境为64位 server 2008 ,结果<em>运行</em>1没问题,<em>运行</em>2时总是会<em>出现</em><em>错误</em>。具体为rnrn问题事件名称: APPCRASHrn应用<em>程序</em>名: ***.<em>exe</em>rn应用<em>程序</em>版本: ***rn应用<em>程序</em>时间戳: ***rnrn这个问题比较纠结,如果按照网上的说和IE插件或者相关插件不正确引用有关系,为什么1总是能用呢?我想知道是不是和我的编译有什么关系rnrn补充:2功能中在下是用来对一张图片格式做修改,引用了C++底层代码。C++需要一个句柄,我是从.net 界面中传进去的。
VC 运行程序的时候,出现0X80000004错误
突然<em>出现</em>的这个问题,按F5<em>运行</em>的时候,有时候就<em>出现</em>这个,有的时候不<em>出现</em>,代码太长,我也不知道哪出的问题,所以没粘上来,就是大概是什么原因导致的这个问题,我做的是DLL+MFC
VC运行程序出现Runtime Error错误,如何解决?
用VC写的应用<em>程序</em>,<em>运行</em>一段时间后,<em>出现</em>Runtime Error<em>错误</em>,如何<em>解决</em>?rn弹出对话框:rn标题栏: Microsoft VC++ Runtime Libraryrn对话框内容: Runtime Error!rn Program:<em>程序</em>路径rn abnormal program terminationrn 确定按钮rn点击确定按钮后,<em>程序</em>终止rn请各位高手帮忙,谢谢了
运行程序出现错误
我点击“开始<em>运行</em>”,就<em>出现</em>一个提示框,内容是“JIT调试失败,<em>出现</em>以下<em>错误</em>:拒绝访问。JIT调试由用户帐户NT AUTHORITY\NETWORK SERVICE 启动。rn这是什么原因呢?
问题事件名称: APPCRASH(解决方法)
摘自:http://blog.163.com/lenk_00/blog/static/17927552620118111951523/ 问题事件名称: APPCRASH(<em>解决</em>方法) 下面分享一下<em>解决</em>win7或者是Vista的一个刺手的问题 APPCRASH(app是<em>程序</em>的意思,crash是坠机的意思。就是<em>程序</em>崩溃了/<em>程序</em>撞车) 我们使用软件的时候有时候会<em>出现</em>这种情况 举个例子
VC6.0使用出现APPCRASH 一直无法解决的问题
http://blog.163.com/wjatnx@yeah/blog/static/12758622820138110530322/很多学习编程的同学都遇到这样的问题,在Windows操作系统下使用Visual C++ 6.0编程时,如果点击菜单中的【打开】或者【添加】,或者按快捷键,都会弹出下图的对话框,<em>出现</em><em>程序</em>崩溃并退出的情况。 VC6.0打开或者添加工程文件崩溃的<em>解决</em>方法 - 艾依河里的
VC++ 故障模块名称: MFC42.DLL 故障模块
-
用VC画图出现错误怎么解决
大家好,我第一次用VC画图,我先创建了一个画笔对话框,可以选择线宽和线型,但是当线宽选择为1,线型选择为点线或是划线的时候,从数据库中取出来的点画出来的曲线总会多出一条?为什么
运行项目出现错误不知道怎么解决
[img=https://img-bbs.csdn.net/upload/201705/26/1495763197_176228.png][/img] 折腾了两天了,ecplise来来回回折腾了8遍了,不知道为什么有这个问题
求助 vc程序出现这些错误怎么解决
我<em>运行</em><em>程序</em>后<em>程序</em><em>出现</em>了.<em>exe</em> 已停止工作,然后报了一下<em>错误</em>rnrnThe thread 0x18E4 has exited with code 0 (0x0).rnDetected memory leaks!rnDumping objects ->rn69 client block at 0x0121E858, subtype 0, 168 bytes long.rna CPrintDialog object at $0121E858, 168 bytes longrnObject dump complete.rnThe thread 0x1E58 has exited with code -1073741819 (0xC0000005).rn
VC++程序运行出现STREX.CPP 681行错误,请问怎么解决
在STREX.CPP中680﹐681﹐682行rn GetBuffer(nMaxLen);rn VERIFY(_vstprintf(m_pchData, lpszFormat, argListSave) <= GetAllocLength()); //出現問題提示行rn ReleaseBuffer();rn此問題出現的原因可能是CString::Format函數﹐但由于Format函數是VC++中的一個自帶t函數﹐所以很難找到解決的方法。rnrn请问<em>怎么</em><em>解决</em>
vc6.0下运行此段程序出现错误怎么解决
//queuetp.cpp--queue template with a nested classrnrnrntemplaternclass QueueTPrnrn private:rn enumQ_SIZE=10;rn //Node is a nested class definitionrn class Nodern rn public:rn Item item;rn Node* next;rn Node(const Item& i):item(i),next(0)rn ;rn Node* front; //pointer to front of Queuern Node* rear; //pointer to rear of Queuern int items; //current number of items in Queuern const int qsize; //maximum number of items in Queuern QueueTP(const QueueTP& q):qsize(0)rn QueueTP& operator=(const QueueTP& q)return* this;rn public:rn QueueTP(int qs=Q_SIZE);rn ~QueueTP();rn bool isempty()constrn rn return items==0;rn rn bool isfull()constrn rn return items==qsize;rn rn int queuecount()constrn rn return items;rn rn bool enqueue(const Item* item); //add item to endrn bool dequeue(Item& item); //remove item from frontrn;rnrn//QueuetP methodsrntemplaternQueueTP::QueueTP(int qs):qsize(qs)rnrn front=rear=0;rn items=0;rnrntemplaternQueueTP::~QueueTP()rnrn Node* temp;rn while(front!=0) //while queue is not yet emptyrn rn front=front->next; //reset pointer to next itemrn delete temp; //delete former frontrn rnrnrn//Add itemto queuerntemplaternbool QueueTP::enqueue(const Item& item)rnrn if(isfull())rn return false;rn Node* add=new Node(item); //create nodern if(add==NULL)rn return false; //quit if none availablern items++;rn if(front==0) //if queue is empty,rn front=add; //place item at frontrn elsern rear->next=add; //else place at rearrn rear=add; //have rear point to new nodern return true;rnrnrn//place front item into item variable and remove from queuerntemplaternbool QueueTP::dequeue(Item& item)rnrn if(front==0)rn return false;rn item=front->item; //set item to first item in queuern items--;rn Node* temp=front; //save location of first itemrn front=front->next; //reset front to next itemrn delete temp; //delete former first itemrn if(items==0)rn rear=0;rn return true;rnrnrnrn<em>错误</em>提示信息:rnerror C2244: 'QueueTP::enqueue' : unable to resolve function overloadrnerror C2954: template definitions cannot nestrnrnrn谢谢
玩LOL时出现错误:问题事件名称: APPCRASH 应用程序名: League of Legends.exe
问题: 今日个玩LOL,等进去玩了大概1分钟左右的时间吧,然后就直接强制性退出,并提示完整<em>错误</em>如下: 问题事件名称: APPCRASH 应用<em>程序</em>名: League of Legends.<em>exe</em> 应用<em>程序</em>版本: 6.18.157.901 应用<em>程序</em>时间戳: 57c8df18 故障模块名称: ntdll.dll 故障模块版本:
用了很久的MFC程序给客户装时APPCRASH!
已经用了很久的<em>程序</em>, 昨天同事给客户去培训的时候,在客户的电脑上,装上之后,可以正常<em>运行</em>。 但是当执行调用弹出一个对话框时,<em>程序</em>CRASH了。 丑出大了! 这<em>程序</em>已经装过几千台电脑都没出个问题。而且又
MFC编写的程序(VS2010),生成程序拿到另外一台电脑上运行,界面总是死机或者是花屏。
-
MFC程序执行时出现错误,求帮忙
问题事件名称: APPCRASH 应用<em>程序</em>名: Test1.<em>exe</em> 应用<em>程序</em>版本: 1.0.0.1 应用<em>程序</em>时间戳: 5205ebc6 故障模块名称: Test1.<em>exe</em> 故障模块版本: 1.0.0.
编译变异无错无警告,运行时遇到APPCRASH
<em>错误</em>信息如下: 问题签名: 问题事件名称: APPCRASH 应用<em>程序</em>名: test.<em>exe</em> 应用<em>程序</em>版本: 0.0.0.0 应用<em>程序</em>时间戳: 55900088 故障模块名称: test.<em>exe</em> 故障
VS2005下运行程序,后台出现这个错误怎么解决
Data Abort: Thread=8673a6f4 Proc=808473e0 'Snake.<em>exe</em>'rnAKY=00001001 PC=00017a38(Snake.<em>exe</em>+0x00007a38) RA=000174d4(Snake.<em>exe</em>+0x000074d4) BVA=1a010ff4 FSR=00000007rnrnrn这是什么意思啊?我不知道问题在哪里啊
APPCRASH 错误 user32.dll
问题签名:rn 问题事件名称: APPCRASHrn 应用<em>程序</em>名: 勤联.<em>exe</em>rn 应用<em>程序</em>版本: 1.0.0.1rn 应用<em>程序</em>时间戳: 5176a38crn 故障模块名称: USER32.dllrn 故障模块版本: 6.1.7601.17514rn 故障模块时间戳: 4ce7ba59rn 异常代码: c0000005rn 异常偏移: 00016200rn OS 版本: 6.1.7601.2.1.0.256.1rn 区域设置 ID: 2052rn 其他信息 1: 0a9ern 其他信息 2: 0a9e372d3b4ad19135b953a78882e789rn 其他信息 3: 0a9ern 其他信息 4: 0a9e372d3b4ad19135b953a78882e789rn
运行程序出现以下问题,怎么解决
Linking...rnZhengJiaoBianHuanDib.obj : error LNK2001: unresolved external symbol "public: __thiscall CDib::CDib(void)" (??0CDib@@QAE@XZ)rnZhengJiaoBianHuanDib.obj : error LNK2001: unresolved external symbol "public: virtual __thiscall CDib::~CDib(void)" (??1CDib@@UAE@XZ)rnZhengJiaoBianHuanDib.obj : error LNK2001: unresolved external symbol "public: unsigned int __thiscall CDib::GetHeight(void)" (?GetHeight@CDib@@QAEIXZ)rnZhengJiaoBianHuanDib.obj : error LNK2001: unresolved external symbol "public: unsigned int __thiscall CDib::GetWidth(void)" (?GetWidth@CDib@@QAEIXZ)rnZhengJiaoBianHuanDib.obj : error LNK2001: unresolved external symbol "public: unsigned char * __thiscall CDib::GetData(void)" (?GetData@CDib@@QAEPAEXZ)rnnafxcwd.lib(thrdcore.obj) : error LNK2001: unresolved external symbol __endthreadexrnnafxcwd.lib(thrdcore.obj) : error LNK2001: unresolved external symbol __beginthreadexrnlibcd.lib(crt0.obj) : error LNK2001: unresolved external symbol _mainrnDebug/ZhengJiaoBianHuanDib.<em>exe</em> : fatal error LNK1120: 8 unresolved externalsrn执行 link.<em>exe</em> 时出错.
IE8 出现 APPCRASH 故障模块名称:StackHash_5531 怎么解决
WIN7的IE8不能访问我们公司的系统,打开IE就崩溃。rn我用火狐的IE TAB就可以正常访问,但火狐的脚本提示没有IE的智能,调试不方便,劳烦各位帮忙<em>解决</em>下。<em>错误</em>信息如下:rnrn问题签名:rn 问题事件名称: APPCRASHrn 应用<em>程序</em>名: iexplore.<em>exe</em>rn 应用<em>程序</em>版本: 8.0.7600.16722rn 应用<em>程序</em>时间戳: 4d0c2f29rn 故障模块名称: StackHash_5531rn 故障模块版本: 6.1.7600.16695rn 故障模块时间戳: 4cc7ab44rn 异常代码: c0000374rn 异常偏移: 000c35e3rn OS 版本: 6.1.7600.2.0.0.256.48rn 区域设置 ID: 2052rn 其他信息 1: 5531rn 其他信息 2: 5531d58efb7a7aef25e7f5d0932e48e4rn 其他信息 3: 472brn 其他信息 4: 472bc07bfe42d1445a072e06cb0cc97c
写的软件win7下出现appcrash错误,大致原因是什么?
自己写了一个下载的软件,在xp下跑是好好的,在win7下跑,有时候会<em>出现</em><em>appcrash</em>的<em>错误</em>。 <em>错误</em>如下 XXX的<em>运行</em><em>程序</em>已停止工作 windows可以联机检查该问题的<em>解决</em>方案 问题签名: 问题事件
Windows下开发程序出现APPCRASH的现象,怎么解决
用Visual studio开发<em>程序</em>,但是<em>运行</em>开发的<em>程序</em>会<em>出现</em>APPCRASH这类问题,<em>怎么</em><em>解决</em>? 千万别说用杀毒软件清理之类的方法了。。。。
一个因全局变量引起的DLL崩溃引发的血案
参考我发的帖子: http://bbs.csdn.net/topics/390737064?page=1#post-397000946 现象是<em>exe</em><em>程序</em>在加载dll的时候崩溃了,莫名其妙的崩溃了。换其它DLL没问题,我又写了个DEMO<em>程序</em>使用这个DLL也是一个现象,用OD加载EXE,用ODDLLLOADER加载DLL,结果也是一样的崩。。搞的我也差点崩溃了。。 加载上微软符号
win7下崩溃,问题事件APPCRASH 故障模块名称:highgui210d.dll
问题签名: 问题事件名称: APPCRASH 应用<em>程序</em>名: GDMonitorVideo.<em>exe</em> 应用<em>程序</em>版本: 0.0.0.0 应用<em>程序</em>时间戳: 4de6fbf9 故障模块名称: highgui210d.dll 故障模块版本: 0.0.0.0 故障模块时间戳: 4bba7c58 异常代码: c0000005 异常偏移: 0009e126
ucrtbased.dll引发的异常
菜鸟新手,最近开始学习c++,网上下载一个<em>程序</em>,编译的时候,<em>出现</em>如下提示: 0x004EFB7C (ucrtbased.dll)处(位于 test.<em>exe</em> 中)引发的异常: 0xC0000005: 读
程序运行出现了这样的错误怎么解决
rn<em>程序</em><em>运行</em>时<em>出现</em>了这样的<em>错误</em>,<em>怎么</em><em>解决</em>?rnGridView“GridView1”激发了未处理的事件“RowDeleting”。 rn我已经有了删除方法,而且结果也使数据删除了,但是<em>程序</em>报这样的错rn
VC6.0 开发的程序 在win7下安装出现 APPCRASH
别人用VC6.0开发的几个控件,因为不想打cab包,所以用installshield12做了个安装<em>程序</em>,使用向导自动注册ocx的,结果在反复安装卸载的时候就<em>出现</em>APPCRASH <em>错误</em>, 网上查了一下,说是要 关闭<em>程序</em>兼容性引擎 和 关闭<em>程序</em>兼容性助手, 也关闭了,但是还是跳出APPCRASH<em>错误</em>, <em>求解</em>?
求救,编译的程序运行出现appcrash
一个师兄用vs2003写的<em>程序</em>,每次开机时第一次能够<em>运行</em>,关闭后就不能使用了[img=C:\Users\Samir\Desktop\捕获.PNG][/img],<em>程序</em>需要开启摄像头,命令行<em>运行</em>,加一个文件参数。求各位大师指教
发布程序出现错误怎么解决
我已经编好了<em>程序</em>,准备发布,但是最后却<em>出现</em>了出错对话框,内容是这样的:unexpexted error number 457 has occurred:this key has already associated with element of this collection
怎么控制EXE程序运行
我想用DDK写一个文件过滤驱动,禁止或允许EXE文件的<em>运行</em>。rn在用户双击EXE文件<em>运行</em>时,会激发很多IRP请求,我想通过截获这些IRP请求,rn控制EXE文件的<em>运行</em>。rn请给个思路,最好有演示代码,谢谢!
Win7,Python打包exe后上报ucrtbase.DLL异常
Win7,X64,Python3.7.0,Pyinstaller-3.3.1 未打包成<em>exe</em>时,直接<em>运行</em>源代码,正常;但打包成<em>exe</em>后,再<em>运行</em>打包后的<em>exe</em>,上报Appcrash<em>错误</em>,排查了未发现缺少
0x0FA23F7D (ucrtbased.dll)处(位于.exe 中)引发的异常: 0xC0000005: 读取位置 0x0000012C 时发生访问冲突。
visual studio中C语言调试遇到的问题。 这个问题是需要检查代码中,  整形数被误操作,以%s的形式打印。应该仔细检查类型<em>错误</em>。
用pyinstaller将python程序生成exe程序。打包成exe文件后,在开发环境计算机运行正常。到其它计算机上:ucrtbase.DLL故障。
用pyinstaller将python<em>程序</em>生成<em>exe</em><em>程序</em>。打包成<em>exe</em>文件后,在开发环境计算机<em>运行</em>正常。将<em>exe</em>文件copy到其它计算机上:故障模块名称:ucrtbase.DLL。具体如下: 问题签名
Visual Studio 2015中ucrtbased.dll丢失
问题描述 今天电脑上装了Visual Studio 2015,检测了一个小demo,没想到编译通过,<em>运行</em>出错。提示“无法启动此<em>程序</em>,因为计算机中丢失ucrtbased.dll。尝试重新安装该<em>程序</em>以<em>解决</em>此问题”。 <em>解决</em>办法一:选择静态编译 第一步,在“<em>解决</em>方案资源管理器”中的项目上右击,选择属性。 第二步:找到<em>运行</em>库,右侧下拉列表内,选择“多线程调试(/MTd)”,然后点击确
使用pandas读取excel
  使用pandas读取excel - Kevin_Hoo的博客 - CSDN博客  https://blog.csdn.net/weixin_38546295/article/details/83537558 API:详解 pandas.read_csv - Sehr Gut - CSDN博客  https://blog.csdn.net/weixin_39175124/article/de...
运行EXE文件时出现错误
我原来的<em>程序</em>在机子上以调试好通过(<em>程序</em>放在D盘),而且已<em>运行</em>了一段时间,但今天我重新做了系统(原来是2000,重做后也是2000),做完系统之后,点EXE文件就<em>运行</em>不了了,提示:Project.<em>exe</em>产生了<em>错误</em>,将被windows系统关闭,请重新启动,rnrn请问这是什么原因?是系统的问题吗?
运行C程序出现错误
我<em>运行</em>C<em>程序</em><em>出现</em>下面<em>错误</em>:rnLoaded 'ntdll.dll', no matching symbolic information found.rnLoaded 'C:\WINDOWS\system32\kernel32.dll', no matching symbolic information found.rnThe thread 0x67C has exited with code -1073741510 (0xC000013A).rnThe thread 0xF4C has exited with code -1073741510 (0xC000013A).rnThe program 'E:\C program\pro\t\Debug\t.<em>exe</em>' has exited with code -1073741510 (0xC000013A).rn请问是什么意思?
程序重启里发生 appcrash 错误怎么处理啊
我有个<em>程序</em>,设定为每小时自动重启一下,我用的重启代码是:rn[code=Delphi(Pascal)]rn application.Terminate;//直接关,或者用close;看情况用rn ShellExecute(Handle,'open',PChar(Application.ExeName),nil,nil,0);rn[/code]rnrn但是<em>程序</em><em>运行</em>,前几次重启是没有问题,在经历4,5次之后就会报错,提示: 问题事件名称: APPCRASHrn服务器系统是windows server 2008rnrn请高手指点一下,谢谢!
程序连编成.exe文件后运行,出现加载错误
<em>错误</em>提示:rn 加载文件<em>错误</em>-记录编号6.form1(或者它的一个成员)正在加载表单或数据环境:循环关系.rn <em>怎么</em>做才难<em>解决</em>它???rn
vc 内存错误怎么解决
调试过程中<em>出现</em>这样的<em>错误</em>rnUnhandled exception in Mby.<em>exe</em> (MFC42D.DLL) :0xC0000005;Access Violation rnrnthis 指针的value显示:Cstatic hWnd=???rnrn这个<em>错误</em><em>怎么</em><em>解决</em>呢?rnrn
VS2013打开软件时提示devenv.exe应用程序错误(0xc0000007b)
-
VS2010 打开后提示 APPCRASH 错误怎么解决
问题签名: 问题事件名称: APPCRASH 应用<em>程序</em>名: devenv.<em>exe</em> 应用<em>程序</em>版本: 10.0.30319.1 应用<em>程序</em>时间戳: 4ba1fab3 故障模块名称: ntdll.dll 故障
devenv.exe 应用程序错误 vs2010
情况是:        VS2010安装完成之后,<em>运行</em>什么的没有任何问题。但是在安装完VA,使用破解文件夹里的VA_X.DLL替换原DLL后,打开VS 2010,<em>出现</em>了应用<em>程序</em><em>错误</em>,然后无论选择“重试”还是“继续”都会自动退出的<em>错误</em>。   尝试过:        网上找了下,发现大多建议是重装VS2010,但我判断我的软件安装应该没有问题,主要应该是VA加载造成的某种<em>错误</em>导致的。
解决pyinstaller 打包后运行exe程序出现的"ModuleNotFindError"
在用pyinstaller打包python<em>程序</em> pyinstaller版本为:3.3.1 python 版本:3.6.1 系统版本:Windows-10-10.0.16299-SP0 我的python<em>程序</em>名为:data_processing_gui.py <em>程序</em>在python环境下正常<em>运行</em>。 打包使用的格式为:pyinstaller -F -p &amp;amp;lt;导入的包路径&amp;amp;gt; mypr...
svchost.exe出现错误怎么解决
本人给同学新做的机器!硬盘重新分区格式化,安装了2000专业版,可是系统<em>运行</em>一段时间就回弹出 s<em>vc</em>host.<em>exe</em><em>出现</em><em>错误</em>,即将被windows关闭!然后确定后,什么都不好使了!就要重新启动!rn请问高手是什么毛病?我同学说原来98系统没这毛病!可是我感觉要是98没问题,2000也不应该有问题呀!是不是她的硬件兼容性有问题?或者是哪个硬件过热不稳定造成的呢?
出现这样的错误怎么解决??????!!
<em>错误</em>信息:“0”字符(十六进制值 0x30)不能以名称作为开头。 行 3,位置 15。rnrnrn---相应代码部分--rnrn[WebMethod]rn public void MSend(string strFrom,string strTo,string strContent)rn rn string xmlUrl=Server.MapPath("Message.xml");rn XmlDocument xmlDoc=GetXmlDoc(xmlUrl);rn XmlNode root=xmlDoc.DocumentElement;rn int id=1;rn if(root.HasChildNodes)rn rn id=Convert.ToInt32(root.LastChild.Attributes["id"].Value)+1; rn rn XmlElement xe=xmlDoc.CreateElement("Message");rn xe.SetAttribute("id",id.ToString());rn root.AppendChild(xe);rn XmlElement xe1=xmlDoc.CreateElement("From");rn xe1.InnerText=strFrom;rn xe.AppendChild(xe1);rn XmlElement xe2=xmlDoc.CreateElement("To");rn xe2.InnerText=strTo;rn xe.AppendChild(xe2);rn XmlElement xe3=xmlDoc.CreateElement("Content");rn xe3.InnerText=strContent;rn xe.AppendChild(xe3);rn xmlDoc.Save(xmlUrl);rn rn
出现这样的错误怎么解决
java.lang.NoSuchFieldError: transliteratorrnrn at com.microsoft.jdbc.sqlserver.tds.TDSRequest.processColMetaData(Unknown Source)rnrn at com.microsoft.jdbc.sqlserver.tds.TDSRPCRequest.processReplyToken(Unknown Source)rnrn at com.microsoft.jdbc.sqlserver.tds.TDSRequest.processReply(Unknown Source)rnrn at com.microsoft.jdbc.sqlserver.tds.TDSCursorRequest.openCursor(Unknown Source)rnrn at com.microsoft.jdbc.sqlserver.SQLServerImplStatement.<em>exe</em>cute(Unknown Source)rnrn at com.microsoft.jdbc.base.BaseStatement.commonExecute(Unknown Source)rnrn at com.microsoft.jdbc.base.BaseStatement.<em>exe</em>cuteQueryInternal(Unknown Source)rnrn at com.microsoft.jdbc.base.BaseStatement.<em>exe</em>cuteQuery(Unknown Source)rnrn at sks.ConnBean.<em>exe</em>cuteQuery(ConnBean.java:48)rnrn at sks.ConnBean.main(ConnBean.java:81)rnrnException in thread "main" rnrn源<em>程序</em>为rnpackage sks;rnimport java.io.PrintStream;rnimport java.sql.*;rnrnrnpublic class ConnBeanrnrnrn public ConnBean()rn rn sDBDrive = "com.microsoft.jdbc.sqlserver.SQLServerDriver";rn sDBSource = "jdbc:microsoft:sqlserver://Administrator;DatabaseName=sks;User=sa";rn conn = null;rn stmt = null;rn rs = null;rn tryrn rn Class.forName(sDBDrive);rn rn catch(ClassNotFoundException classnotfoundexception)rn rn System.err.println("ConnBean():".concat(String.valueOf(String.valueOf(classnotfoundexception.getMessage()))));rn rn tryrn rn conn = DriverManager.getConnection(sDBSource);rn stmt = conn.createStatement(ResultSet.TYPE_SCROLL_INSENSITIVE, ResultSet.CONCUR_READ_ONLY);rn rn catch(SQLException sqlexception)rn rn System.err.println("ConnBean():".concat(String.valueOf(String.valueOf(sqlexception.getMessage()))));rn rn rnrn public ResultSet <em>exe</em>cuteQuery(String s)rn rn rs = null;rn tryrn rn rs = stmt.<em>exe</em>cuteQuery(s);rn rn catch(SQLException sqlexception)rn rn System.err.println("<em>exe</em>cuteQuery:".concat(String.valueOf(String.valueOf(sqlexception.getMessage()))));rn rn return rs;rn rnrn public void <em>exe</em>cuteUpdate(String s)rn rn tryrn rn stmt.<em>exe</em>cuteUpdate(s);rn rn catch(SQLException sqlexception)rn rn System.err.println("<em>exe</em>cuteUpdate:".concat(String.valueOf(String.valueOf(sqlexception.getMessage()))));rn rn rnrn String sDBDrive;rn String sDBSource;rn Connection conn;rn Statement stmt;rn ResultSet rs;rn public static void main(String[] args)throws Exception rn tryrn rn String sql;rn ResultSet rs;rn sql="select * from Department";rn ConnBean conn=new ConnBean();rn rs=conn.<em>exe</em>cuteQuery(sql);rn while(rs.next())rn rn System.out.print(rs.getString(1));rn rn catch(Exception e)rn System.out.print(e.getMessage());rn rn rn
错误怎么解决?老是出现
[img=http://img.my.csdn.net/uploads/201212/17/1355677187_6400.png][/img]
出现“拒绝访问”的错误怎么解决??
我的网页里用到了下面的语句:rnparent.document.all('aa').style.display="none"rn但<em>出现</em><em>错误</em>说是“拒绝访问”,把parent换成top也不行,请问有哪位大虾,能帮忙<em>解决</em>
出现如下错误怎么解决
原码如下:rn--------------------------------------------------------------------------rnrni = 2;rnwhile (Number(i)<50) rnrn动作脚本<em>错误</em>总数:2 报错:2
出现这种错误怎么解决
The server encountered an internal error () that prevented it from fulfilling this request.rnrnexceptionrnrnjava.lang.NullPointerExceptionrn ajaxdashboard.service.StockQuoteService.getStockQuotesFor(StockQuoteService.java:21)rn ajaxdashboard.servlet.DashboardServlet.getStockQuotes(DashboardServlet.java:44)rn ajaxdashboard.servlet.DashboardServlet.processRequest(DashboardServlet.java:24)rn ajaxdashboard.servlet.DashboardServlet.doGet(DashboardServlet.java:62)rn javax.servlet.http.HttpServlet.service(HttpServlet.java:740)rn javax.servlet.http.HttpServlet.service(HttpServlet.java:853)rnrnnote The full stack trace of the root cause is available in the Apache Tomcat/5.5.17 logs.
出现错误,不知怎么解决
private void DataGrid1_EditCommand(object source, System.Web.UI.WebControls.DataGridCommandEventArgs e)rn rn DropDownList ddlSex=(DropDownList)e.FindControl ("DropDownList1");rnrn rnrn rn<em>出现</em><em>错误</em>:c:\inetpub\wwwroot\enterprise\stock.aspx.cs(77): “System.Web.UI.WebControls.DataGridCommandEventArgs”并不包含对“FindControl”的定义rn
出现下种错误怎么解决
调用DLL中的函数,出来对话框rnrnunhandled exception in test.<em>exe</em>(MFC42.dll):0xc0000005 access violation.rnrn本人比较菜,请多多指教!
出现安全错误怎么解决
写了一个提取xml文件的dll控件加入到网页中,在预览htm文件的时候出错rn------------------rn<em>出现</em><em>错误</em>,请求:rnSystem.Security.Permission.FileIOPermission,mscorlib,Version=1.0.5000.0,Cultrue=neutral,rnPublicKeyToken=b77a5c561934e089类型的权限失败rn------------------rn请问<em>怎么</em><em>解决</em>?
Debug下运行EXE错误
<em>vc</em>6环境下 编译 <em>运行</em> 均没问题,<em>程序</em>为简单DOS界面;rn生成的Debug文件夹下的EXE文件不能正确<em>运行</em>:rnDebug Error!rnProgram:.....(<em>程序</em>路径)rnabnormal program terminationrn(please Retry to debug the application )rnrn不知道如何<em>解决</em> 特来求教!rn谢过
打开exe文件的时候出现这个错误怎么解决
打开<em>exe</em>文件的时候<em>出现</em>这个<em>错误</em>,<em>怎么</em><em>解决</em>?[img=https://img-bbs.csdn.net/upload/201611/27/1480256589_656298.png][/img]
运行EXE错误
我用Visual Studio 2008的Windows Form写了一个<em>程序</em>。编译执行都没有问题。rn可是当我把Debug目录下的<em>exe</em>拷贝到其他机器,执行的时候就<em>出现</em>了如下的<em>错误</em>;rn[color=#FF0000]This application has failed to start because the application configuration is incorrect"[/color]rn我按照http://blogs.msdn.com/nikolad/archive/2005/03/18/398720.aspxrn这里的介绍做了,也还不行。rn所以该<em>怎么</em>做呢,才能是的<em>exe</em>可以在没有安装visual studio的及其上<em>运行</em>呢?rn这个跟那个CLR有关系吗?或者那个stdafx.h有关吗?rn谢谢
安装VC错误求解
楼主:请教下,我win7家庭普通版,操作后为什么还是不能用,你说在命令提示符下输入:Msdev /useenv,但我不知道怎样才会<em>出现</em>命令提示符呀?QQ:1239338277.
运行VC写的程序,出现错误...请高手指点...???
在本机<em>运行</em>很正常,BUG和Release都试过了,都<em>出现</em>异常rnrn如下:rnrnthis application has requested the runtime to terminate it in an unusual way.please contact the application's support team for more informationrnrn试了7台电脑,其中有二台电脑<em>出现</em>这样的异常,其它正常...rnrn请问应该如何<em>解决</em>这样的问题,rnrn我用的是VS2008编译的...rnrn请高手指点...谢谢!rn
运行程序出现错误与单步debug程序出现错误不同,如何解决
我现在有一段代码功能如下:打开文件,将文件内容读入缓冲区后通过send()发送给远端的客户机。rnrn编译调试通过后,<em>运行</em><em>程序</em>发现send()函数<em>出现</em><em>错误</em>,SOCKET_ERROR<em>出现</em>。而利用debug单步跟踪却能够正常通过。不知道问题何在?rnrn<em>程序</em>使用单线程。rnrn
Ubuntu下运行程序提示到错误求解
wuroot@wuroot-OptiPlex-760:~$ g++ a.cpp -o arn/tmp/ccxNikKf.o:在函数‘main’中:rna.cpp:(.text+0xa):对‘ACE_Log_Msg::instance()’未定义的引用rna.cpp:(.text+0x22):对‘ACE_Log_Msg::priority_mask(unsigned long, ACE_Log_Msg::MASK_TYPE)’未定义的引用rna.cpp:(.text+0x27):对‘ACE_Log_Msg::last_error_adapter()’未定义的引用rna.cpp:(.text+0x30):对‘ACE_Log_Msg::instance()’未定义的引用rna.cpp:(.text+0x60):对‘ACE_Log_Msg::conditional_set(char const*, int, int, int)’未定义的引用rna.cpp:(.text+0x7c):对‘ACE_Log_Msg::log(ACE_Log_Priority, char const*, ...)’未定义的引用rna.cpp:(.text+0x86):对‘ACE_Log_Msg::last_error_adapter()’未定义的引用rna.cpp:(.text+0x8f):对‘ACE_Log_Msg::instance()’未定义的引用rna.cpp:(.text+0xbf):对‘ACE_Log_Msg::conditional_set(char const*, int, int, int)’未定义的引用rna.cpp:(.text+0xdb):对‘ACE_Log_Msg::log(ACE_Log_Priority, char const*, ...)’未定义的引用rn/tmp/ccxNikKf.o:在函数‘foo()’中:rna.cpp:(.text+0xed):对‘ACE_Log_Msg::last_error_adapter()’未定义的引用rna.cpp:(.text+0xf5):对‘ACE_Log_Msg::instance()’未定义的引用rna.cpp:(.text+0x122):对‘ACE_Log_Msg::conditional_set(char const*, int, int, int)’未定义的引用rna.cpp:(.text+0x13d):对‘ACE_Log_Msg::log(ACE_Log_Priority, char const*, ...)’未定义的引用rncollect2: <em>错误</em>: ld 返回 1rn
出现错误求解
run的时候<em>出现</em>,rnProject xxx.<em>exe</em> raised too many consecutive expection:'single step at 0x02971ee'rnProcess stop.Use step or run to continue.rn是什么引起的?怎样<em>解决</em>?rn望各位大虾指教
创建表出现错误求解
这样创建一张表,为何报出rnServer: Msg 170, Level 15, State 1, Line 10rnLine 10: Incorrect syntax near '('.rn<em>错误</em>。rnrnSET ANSI_NULLS OFFrnGOrnrnSET QUOTED_IDENTIFIER ONrnGOrnrnSET ANSI_PADDING OFFrnGOrnrnCREATE TABLE [dbo].[Datatemp](rn [AA] [smallint] NOT NULL,rn [BB] [char](30) NOT NULL,rn [CC] [char](80) NOT NULL,rn [DD] [char](80) NOT NULL,rn CONSTRAINT [Cons_ Datatemp] PRIMARY KEY CLUSTERED rn(rn [AA] ASCrn)WITH (PAD_INDEX = OFF, STATISTICS_NORECOMPUTE = OFF, IGNORE_DUP_KEY = OFF, ALLOW_ROW_LOCKS = ON, ALLOW_PAGE_LOCKS = ON) ON [PRIMARY]rn) ON [PRIMARY]rnrnGOrnrnSET ANSI_PADDING OFFrnGO
求解程序出现Invalid pointer operation错误
代码在下面,test1和test2其实是完全相同的,循环多次执行时发现会报下面的错,请教这是什么原因?rnrnProject Project1.<em>exe</em> raised exception class EInvalidPointer with message 'Invalid pointer operation'. Process stopped. Use Step or Run to continue.rnrnrnrnunit Unit1;rnrninterfacernrnusesrn Windows, Messages, SysUtils, Variants, Classes, Graphics, Controls, Forms,rn Dialogs, StdCtrls, Buttons;rnrntypern TForm1 = class(TForm)rn Edit2: TEdit;rn btnTest1: TBitBtn;rn ListBox1: TListBox;rn procedure btnTest1Click(Sender: TObject);rn privatern function test1(str:string):string;rn function test2(str:string):string;rn publicrn Public declarations rn end;rnrnvarrn Form1: TForm1;rnrnimplementationrnrn$R *.dfmrnrnrn rnprocedure TForm1.btnTest1Click(Sender: TObject);rnvarrn backvalue : String;rn i : Integer;rnbeginrn for i:=0 to 10 dorn beginrn ListBox1.Items.Add(IntToStr(i));rn test1(Edit2.Text);rn test2(Edit2.Text);rn end;rnrnend;rnrnfunction TForm1.test1(str:string):string;rnvarrn mychar : Array[0..0] of char;rn i,len : Integer;rn substr : String;rnbeginrn Result := '1';rn if (str <> '') thenrn beginrn len := Length(str);rn for i:= 1 to len dorn beginrn substr := Copy(str,i,1);rn StrPCopy(mychar,substr);rn if not(mychar[0] in ['0'..'9'])thenrn beginrn Result := '-1';rn break;rn end;rn end;rn end;rnend;rnfunction TForm1.test2(str:string):string;rnvarrn mychar : Array[0..0] of char;rn i,len : Integer;rn substr : String;rnbeginrn Result := '1';rn if (str <> '') thenrn beginrnrn len := Length(str);rn for i:= 1 to len dorn beginrn substr := Copy(str,i,1);rn StrPCopy(mychar,substr);rn if not(mychar[0] in ['0'..'9',#46])thenrn beginrn Result := '-1';rn break;rn end;rn end;rnrn end;rnend;rnrnrnrnrnrnrnend.
VC运行出现如下错误,如何解决
Compiling...rnTerminal.cpprnTerminalDoc.cpprnTerminalView.cpprnSetupDlg.cpprnG:\Vcstudy\Test\Terminal\SetupDlg.cpp(38) : error C2664: 'DDX_CBIndex' : cannot convert parameter 3 from 'class CString' to 'int &'rn A reference that is not to 'const' cannot be bound to a non-lvaluernG:\Vcstudy\Test\Terminal\SetupDlg.cpp(43) : error C2664: 'DDX_CBIndex' : cannot convert parameter 3 from 'class CString' to 'int &'rn A reference that is not to 'const' cannot be bound to a non-lvaluernG:\Vcstudy\Test\Terminal\SetupDlg.cpp(45) : error C2664: 'DDX_CBIndex' : cannot convert parameter 3 from 'class CString' to 'int &'rn A reference that is not to 'const' cannot be bound to a non-lvaluernGenerating Code...rnError <em>exe</em>cuting cl.<em>exe</em>.rnrnTerminal.<em>exe</em> - 3 error(s), 0 warning(s)
XZ_iOS之运行项目到真机出现错误解决
<em>运行</em>WebDriverAgent工程到手机上,之前一直都是可以的,今天<em>出现</em>下面<em>错误</em>:Code signing is required for product type 'Application' in SDK 'iOS 11.2'.Signing for &quot;IntegrationApp&quot; requires a developement team. Select a developement tea...
解压jboss-portal-2.7.1-bundled.zip,运行出现错误,如何解决
09:53:54,482 ERROR [ServiceObjectFactoryJAXRPC] Cannot create servicernorg.jboss.ws.metadata.wsdl.WSDLException: javax.wsdl.WSDLException: WSDLExceptiornn: faultCode=OTHER_ERROR: Cannot extract schema definition: java.net.ConnectExcernption: Connection timed out: connectrn at org.jboss.ws.tools.wsdl.WSDLDefinitionsFactory.parse(WSDLDefinitionsFrnactory.java:154)rn at org.jboss.ws.metadata.umdm.ServiceMetaData.getWsdlDefinitions(ServicernMetaData.java:295)rn at org.jboss.ws.metadata.builder.jaxrpc.JAXRPCClientMetaDataBuilder.builrndMetaData(JAXRPCClientMetaDataBuilder.java:116)rn at org.jboss.ws.core.jaxrpc.client.ServiceImpl.(ServiceImpl.java:1rn26)rn at org.jboss.ws.core.jaxrpc.client.ServiceObjectFactoryJAXRPC.getObjectIrnnstance(ServiceObjectFactoryJAXRPC.java:156)rn at javax.naming.spi.NamingManager.getObjectInstance(NamingManager.java:3rn04)rn at org.jnp.interfaces.NamingContext.getObjectInstance(NamingContext.javarn:1273)rn at org.jnp.interfaces.NamingContext.getObjectInstanceWrapFailure(NamingCrnontext.java:1290)rn at org.jnp.interfaces.NamingContext.lookup(NamingContext.java:763)rn at org.jnp.interfaces.NamingContext.lookup(NamingContext.java:627)rn at javax.naming.InitialContext.lookup(InitialContext.java:351)rn at org.jboss.portal.wsrp.services.AbstractJNDIServiceFactory.getServiceFrnor(AbstractJNDIServiceFactory.java:152)rn at org.jboss.portal.wsrp.services.AbstractSOAPServiceFactory.getService(rnAbstractSOAPServiceFactory.java:75)rn at org.jboss.portal.wsrp.consumer.EndpointConfigurationInfo.getService(ErnndpointConfigurationInfo.java:395)rn at org.jboss.portal.wsrp.consumer.EndpointConfigurationInfo.getServiceDernscriptionService(EndpointConfigurationInfo.java:370)rn at org.jboss.portal.wsrp.consumer.EndpointConfigurationInfo.refreshServirnces(EndpointConfigurationInfo.java:469)rn at org.jboss.portal.wsrp.consumer.EndpointConfigurationInfo.forceRefreshrn(EndpointConfigurationInfo.java:462)rn at org.jboss.portal.wsrp.consumer.EndpointConfigurationInfo.refresh(EndprnointConfigurationInfo.java:455)rn at org.jboss.portal.wsrp.consumer.ProducerInfo.internalRefresh(ProducerIrnnfo.java:327)rn at org.jboss.portal.wsrp.consumer.ProducerInfo.detailedRefresh(ProducerIrnnfo.java:282)rn at org.jboss.portal.wsrp.consumer.ProducerInfo.refresh(ProducerInfo.javarn:277)rn at org.jboss.portal.wsrp.consumer.ProducerInfo.getPortletMap(ProducerInfrno.java:662)rn at org.jboss.portal.wsrp.consumer.WSRPConsumerImpl.getPortlets(WSRPConsurnmerImpl.java:150)rn at org.jboss.portal.portlet.federation.impl.FederatedPortletInvokerServirnce.getPortlets(FederatedPortletInvokerService.java:89)rn at org.jboss.portal.core.management.PortletDiscoveryService.processPortlrnetDiscovery(PortletDiscoveryService.java:89)rn at sun.reflect.NativeMethodAccessorImpl.invoke0(Native Method)rn at sun.reflect.NativeMethodAccessorImpl.invoke(NativeMethodAccessorImpl.rnjava:39)rn at sun.reflect.DelegatingMethodAccessorImpl.invoke(DelegatingMethodAccesrnsorImpl.java:25)rn at java.lang.reflect.Method.invoke(Method.java:585)rn at org.jboss.mx.interceptor.ReflectedDispatcher.invoke(ReflectedDispatchrner.java:155)rn at org.jboss.mx.server.Invocation.dispatch(Invocation.java:94)rn at org.jboss.mx.interceptor.AbstractInterceptor.invoke(AbstractInterceptrnor.java:133)rn at org.jboss.mx.server.Invocation.invoke(Invocation.java:88)rn at org.jboss.mx.interceptor.ModelMBeanOperationInterceptor.invoke(ModelMrnBeanOperationInterceptor.java:142)rn at org.jboss.mx.server.Invocation.invoke(Invocation.java:88)rn at org.jboss.mx.server.AbstractMBeanInvoker.invoke(AbstractMBeanInvoker.rnjava:264)rn at org.jboss.mx.server.MBeanServerImpl.invoke(MBeanServerImpl.java:659)rn at org.jboss.varia.scheduler.Scheduler$MBeanListener.handleNotification(rnScheduler.java:1346)rn at sun.reflect.GeneratedMethodAccessor4.invoke(Unknown Source)rn at sun.reflect.DelegatingMethodAccessorImpl.invoke(DelegatingMethodAccesrnsorImpl.java:25)rn at java.lang.reflect.Method.invoke(Method.java:585)rn at org.jboss.mx.notification.NotificationListenerProxy.invoke(NotificatirnonListenerProxy.java:153)rn at $Proxy11.handleNotification(Unknown Source)rn at javax.management.NotificationBroadcasterSupport.handleNotification(NorntificationBroadcasterSupport.java:221)rn at javax.management.NotificationBroadcasterSupport.sendNotification(NotirnficationBroadcasterSupport.java:184)rn at javax.management.timer.Timer.sendNotification(Timer.java:1295)rn at javax.management.timer.Timer.notifyAlarmClock(Timer.java:1264)rn at javax.management.timer.TimerAlarmClock.run(Timer.java:1347)rn at java.util.TimerThread.mainLoop(Timer.java:512)rn at java.util.TimerThread.run(Timer.java:462)rnCaused by: javax.wsdl.WSDLException: WSDLException: faultCode=OTHER_ERROR: Cannornt extract schema definition: java.net.ConnectException: Connection timed out: cornnnectrn at org.jboss.ws.tools.wsdl.WSDL11Reader.processTypes(WSDL11Reader.java:3rn94)rn at org.jboss.ws.tools.wsdl.WSDL11Reader.processTypes(WSDL11Reader.java:4rn16)rn at org.jboss.ws.tools.wsdl.WSDL11Reader.processTypes(WSDL11Reader.java:4rn16)rn at org.jboss.ws.tools.wsdl.WSDL11Reader.processDefinition(WSDL11Reader.jrnava:178)rn at org.jboss.ws.tools.wsdl.WSDLDefinitionsFactory.parse(WSDLDefinitionsFrnactory.java:128)rn ... 49 morernCaused by: java.net.ConnectException: Connection timed out: connectrn at java.net.PlainSocketImpl.socketConnect(Native Method)rn at java.net.PlainSocketImpl.doConnect(PlainSocketImpl.java:333)rn at java.net.PlainSocketImpl.connectToAddress(PlainSocketImpl.java:195)rn at java.net.PlainSocketImpl.connect(PlainSocketImpl.java:182)rn at java.net.Socket.connect(Socket.java:516)rn at java.net.Socket.connect(Socket.java:466)rn at sun.net.NetworkClient.doConnect(NetworkClient.java:157)rn at sun.net.www.http.HttpClient.openServer(HttpClient.java:365)rn at sun.net.www.http.HttpClient.openServer(HttpClient.java:477)rn at sun.net.www.http.HttpClient.(HttpClient.java:214)rn at sun.net.www.http.HttpClient.New(HttpClient.java:287)rn at sun.net.www.http.HttpClient.New(HttpClient.java:299)rn at sun.net.www.protocol.http.HttpURLConnection.getNewHttpClient(HttpURLCrnonnection.java:796)rn at sun.net.www.protocol.http.HttpURLConnection.plainConnect(HttpURLConnernction.java:748)rn at sun.net.www.protocol.http.HttpURLConnection.connect(HttpURLConnectionrn.java:673)rn at sun.net.www.protocol.http.HttpURLConnection.getInputStream(HttpURLConrnnection.java:917)rn at java.net.URL.openStream(URL.java:1007)rn at org.jboss.ws.tools.wsdl.WSDL11Reader.handleSchemaImports(WSDL11Readerrn.java:588)rn at org.jboss.ws.tools.wsdl.WSDL11Reader.handleSchemaImports(WSDL11Readerrn.java:589)rn at org.jboss.ws.tools.wsdl.WSDL11Reader.processSchemaInclude(WSDL11Readernr.java:560)rn at org.jboss.ws.tools.wsdl.WSDL11Reader.processTypes(WSDL11Reader.java:3rn85)rn ... 53 morern
程序在其他电脑上运行出现RuntimeLibrary错误如何解决
用vs2008mfc+ogre做的<em>程序</em>rn静态链接rnrn<em>程序</em>在一部分机器上可以<em>运行</em>,在另一部分机器上报Microsoft Visual C++ Runtime Library<em>错误</em>rnrn我把ms<em>vc</em>rt.dll ms<em>vc</em>r90.dll ms<em>vc</em>p90.dll都复制过去了依然不行rn安装了vs 2008 redist 依然不行rnrn<em>求解</em>!
IE运行jsp程序出现这样的错误如何解决
我从网上下了一个jsp做的小系统的源代码,全是jsp的,我把文件夹拷到tomcat 的webapps目录下,想通过IE<em>运行</em>看看效果,可是只<em>出现</em>了首页,点击其他任何超连接都会又这样的问题,数据库我也已经按照作者所给的sql语句在SQL Server2000里创建了呀,这个问题该<em>怎么</em><em>解决</em>?<em>错误</em>如下:rnHTTP Status 500 - rnrn--------------------------------------------------------------------------------rnrntype Exception reportrnrnmessage rnrndescription The server encountered an internal error () that prevented it from fulfilling this request.rnrnexception rnrnjavax.servlet.ServletException: Name jdbc is not bound in this Contextrn org.apache.jasper.runtime.PageContextImpl.doHandlePageException(PageContextImpl.java:825)rn org.apache.jasper.runtime.PageContextImpl.handlePageException(PageContextImpl.java:758)rn org.apache.jsp.employee.createEmployee_jsp._jspService(createEmployee_jsp.java:218)rn org.apache.jasper.runtime.HttpJspBase.service(HttpJspBase.java:94)rn javax.servlet.http.HttpServlet.service(HttpServlet.java:802)rn org.apache.jasper.servlet.JspServletWrapper.service(JspServletWrapper.java:324)rn org.apache.jasper.servlet.JspServlet.serviceJspFile(JspServlet.java:292)rn org.apache.jasper.servlet.JspServlet.service(JspServlet.java:236)rn javax.servlet.http.HttpServlet.service(HttpServlet.java:802)rnrnrnroot cause rnrnjavax.naming.NameNotFoundException: Name jdbc is not bound in this Contextrn org.apache.naming.NamingContext.lookup(NamingContext.java:768)rn org.apache.naming.NamingContext.lookup(NamingContext.java:151)rn com.jspdev.util.DatabaseConn.getConnection(DatabaseConn.java:15)rn com.jspdev.ch17.DepartmentBean.(DepartmentBean.java:13)rn org.apache.jsp.employee.createEmployee_jsp._jspService(createEmployee_jsp.java:105)rn org.apache.jasper.runtime.HttpJspBase.service(HttpJspBase.java:94)rn javax.servlet.http.HttpServlet.service(HttpServlet.java:802)rn org.apache.jasper.servlet.JspServletWrapper.service(JspServletWrapper.java:324)rn org.apache.jasper.servlet.JspServlet.serviceJspFile(JspServlet.java:292)rn org.apache.jasper.servlet.JspServlet.service(JspServlet.java:236)rn javax.servlet.http.HttpServlet.service(HttpServlet.java:802)rnrnrnnote The full stack trace of the root cause is available in the Apache Tomcat/5.0.28 logs.rnrnrn--------------------------------------------------------------------------------rnrnApache Tomcat/5.0.28rn请高手指教!
vc出现如下link错误怎么解决?
LINK : fatal error LNK1104: cannot open file "..\..\Vc98\Lib\Winmm.lib"
各位大虾,vc出现这种连接错误怎么解决
test_queueDlg.obj : error LNK2001: unresolved external symbol "public: bool __thiscall Queue::enterQueue(class Node *)" (?enterQueue@?$Queue@H@@QAE_NPAV?$Node@H@@@Z)rn
新人求助!运行出现这个错误怎么解决
fatal error C1023: “Release\Lane\Lane.pch”: pch 有<em>错误</em>,请尝试重新生成 pchrnrn这个<em>怎么</em>整,求大神
在Hadoop集群上运行WordCount出现下列错误怎么解决??
Java HotSpot(TM) Client VM warning: You have loaded library /home/hadoop/hadoop-2.5.2/lib/native/libhadoop.so.1.0.0 which might have disabled stack guard. The VM will try to fix the stack guard now.rnIt's highly recommended that you fix the library with '<em>exe</em>cstack -c ', or link it with '-z no<em>exe</em>cstack'.rn16/12/15 04:48:08 WARN util.NativeCodeLoader: Unable to load native-hadoop library for your platform... using builtin-java classes where applicablern16/12/15 04:48:09 INFO client.RMProxy: Connecting to ResourceManager at master/192.168.1.147:18040rn16/12/15 04:48:12 INFO input.FileInputFormat: Total input paths to process : 1rn16/12/15 04:48:12 INFO mapreduce.JobSubmitter: number of splits:1rn16/12/15 04:48:12 INFO mapreduce.JobSubmitter: Submitting tokens for job: job_1481804617285_0002rn16/12/15 04:48:13 INFO impl.YarnClientImpl: Submitted application application_1481804617285_0002rn16/12/15 04:48:13 INFO mapreduce.Job: The url to track the job: http://master:18088/proxy/application_1481804617285_0002/rn16/12/15 04:48:13 INFO mapreduce.Job: Running job: job_1481804617285_0002rn16/12/15 04:48:34 INFO mapreduce.Job: Job job_1481804617285_0002 running in uber mode : falsern16/12/15 04:48:34 INFO mapreduce.Job: map 0% reduce 0%rn16/12/15 04:48:36 INFO mapreduce.Job: Task Id : attempt_1481804617285_0002_m_000000_0, Status : FAILEDrnContainer launch failed for container_1481804617285_0002_01_000002 : org.apache.hadoop.yarn.exceptions.YarnException: Unauthorized request to start container. rnThis token is expired. current time is 1481811355417 found 1481806715733rn at sun.reflect.NativeConstructorAccessorImpl.newInstance0(Native Method)rn at sun.reflect.NativeConstructorAccessorImpl.newInstance(NativeConstructorAccessorImpl.java:57)rn at sun.reflect.DelegatingConstructorAccessorImpl.newInstance(DelegatingConstructorAccessorImpl.java:45)rn at java.lang.reflect.Constructor.newInstance(Constructor.java:526)rn at org.apache.hadoop.yarn.api.records.impl.pb.SerializedExceptionPBImpl.instantiateException(SerializedExceptionPBImpl.java:168)rn at org.apache.hadoop.yarn.api.records.impl.pb.SerializedExceptionPBImpl.deSerialize(SerializedExceptionPBImpl.java:106)rn at org.apache.hadoop.mapreduce.v2.app.launcher.ContainerLauncherImpl$Container.launch(ContainerLauncherImpl.java:155)rn at org.apache.hadoop.mapreduce.v2.app.launcher.ContainerLauncherImpl$EventProcessor.run(ContainerLauncherImpl.java:369)rn at java.util.concurrent.ThreadPoolExecutor.runWorker(ThreadPoolExecutor.java:1145)rn at java.util.concurrent.ThreadPoolExecutor$Worker.run(ThreadPoolExecutor.java:615)rn at java.lang.Thread.run(Thread.java:745)rnrn16/12/15 04:48:38 INFO mapreduce.Job: Task Id : attempt_1481804617285_0002_m_000000_1, Status : FAILEDrnContainer launch failed for container_1481804617285_0002_01_000003 : org.apache.hadoop.yarn.exceptions.YarnException: Unauthorized request to start container. rnThis token is expired. current time is 1481811357277 found 1481806717783rn at sun.reflect.NativeConstructorAccessorImpl.newInstance0(Native Method)rn at sun.reflect.NativeConstructorAccessorImpl.newInstance(NativeConstructorAccessorImpl.java:57)rn at sun.reflect.DelegatingConstructorAccessorImpl.newInstance(DelegatingConstructorAccessorImpl.java:45)rn at java.lang.reflect.Constructor.newInstance(Constructor.java:526)rn at org.apache.hadoop.yarn.api.records.impl.pb.SerializedExceptionPBImpl.instantiateException(SerializedExceptionPBImpl.java:168)rn at org.apache.hadoop.yarn.api.records.impl.pb.SerializedExceptionPBImpl.deSerialize(SerializedExceptionPBImpl.java:106)rn at org.apache.hadoop.mapreduce.v2.app.launcher.ContainerLauncherImpl$Container.launch(ContainerLauncherImpl.java:155)rn at org.apache.hadoop.mapreduce.v2.app.launcher.ContainerLauncherImpl$EventProcessor.run(ContainerLauncherImpl.java:369)rn at java.util.concurrent.ThreadPoolExecutor.runWorker(ThreadPoolExecutor.java:1145)rn at java.util.concurrent.ThreadPoolExecutor$Worker.run(ThreadPoolExecutor.java:615)rn at java.lang.Thread.run(Thread.java:745)rnrn16/12/15 04:48:40 INFO mapreduce.Job: Task Id : attempt_1481804617285_0002_m_000000_2, Status : FAILEDrnContainer launch failed for container_1481804617285_0002_01_000004 : org.apache.hadoop.yarn.exceptions.YarnException: Unauthorized request to start container. rnThis token is expired. current time is 1481811359287 found 1481806719811rn at sun.reflect.NativeConstructorAccessorImpl.newInstance0(Native Method)rn at sun.reflect.NativeConstructorAccessorImpl.newInstance(NativeConstructorAccessorImpl.java:57)rn at sun.reflect.DelegatingConstructorAccessorImpl.newInstance(DelegatingConstructorAccessorImpl.java:45)rn at java.lang.reflect.Constructor.newInstance(Constructor.java:526)rn at org.apache.hadoop.yarn.api.records.impl.pb.SerializedExceptionPBImpl.instantiateException(SerializedExceptionPBImpl.java:168)rn at org.apache.hadoop.yarn.api.records.impl.pb.SerializedExceptionPBImpl.deSerialize(SerializedExceptionPBImpl.java:106)rn at org.apache.hadoop.mapreduce.v2.app.launcher.ContainerLauncherImpl$Container.launch(ContainerLauncherImpl.java:155)rn at org.apache.hadoop.mapreduce.v2.app.launcher.ContainerLauncherImpl$EventProcessor.run(ContainerLauncherImpl.java:369)rn at java.util.concurrent.ThreadPoolExecutor.runWorker(ThreadPoolExecutor.java:1145)rn at java.util.concurrent.ThreadPoolExecutor$Worker.run(ThreadPoolExecutor.java:615)rn at java.lang.Thread.run(Thread.java:745)rnrn16/12/15 04:48:44 INFO mapreduce.Job: map 100% reduce 100%rn16/12/15 04:48:44 INFO mapreduce.Job: Job job_1481804617285_0002 failed with state FAILED due to: Task failed task_1481804617285_0002_m_000000rnJob failed as tasks failed. failedMaps:1 failedReduces:0rnrn16/12/15 04:48:44 INFO mapreduce.Job: Counters: 4rn Job Counters rn Other local map tasks=3rn Data-local map tasks=1rn Total time spent by all maps in occupied slots (ms)=0rn Total time spent by all reduces in occupied slots (ms)=0rn
Java swt运行之后出现错误怎么解决呢?
Exception in thread "main" java.lang.UnsatisfiedLinkError: no swt-win32-3236 in java.library.pathrn at java.lang.ClassLoader.loadLibrary(Unknown Source)rn at java.lang.Runtime.loadLibrary0(Unknown Source)rn at java.lang.System.loadLibrary(Unknown Source)rn at org.eclipse.swt.internal.Library.loadLibrary(Library.java:123)rn at org.eclipse.swt.internal.win32.OS.(OS.java:18)rn at org.eclipse.swt.widgets.Display.(Display.java:125)rn at Me.open(Me.java:34)rn at Me.main(Me.java:24)
第一次运行eclipse,出现这样的错误怎么解决?谢谢
[img=https://img-bbs.csdn.net/upload/201711/04/1509763438_376546.png][/img]rn!SESSION 2017-11-04 11:16:44.315 -----------------------------------------------rneclipse.buildId=4.3.2.M20140221-1700rnjava.version=9.0.1rnjava.vendor=Oracle CorporationrnBootLoader constants: OS=win32, ARCH=x86_64, WS=win32, NL=zh_CNrnFramework arguments: -product org.eclipse.epp.package.jee.productrnCommand-line arguments: -os win32 -ws win32 -arch x86_64 -product org.eclipse.epp.package.jee.productrnrn!ENTRY org.eclipse.osgi 4 0 2017-11-04 11:16:45.098rn!MESSAGE Startup errorrn!STACK 1rnjava.lang.RuntimeException: Exception in org.eclipse.osgi.framework.internal.core.SystemBundleActivator.start() of bundle org.eclipse.osgi.rn at org.eclipse.osgi.framework.internal.core.InternalSystemBundle.resume(InternalSystemBundle.java:233)rn at org.eclipse.osgi.framework.internal.core.Framework.launch(Framework.java:656)rn at org.eclipse.core.runtime.adaptor.EclipseStarter.startup(EclipseStarter.java:275)rn at org.eclipse.core.runtime.adaptor.EclipseStarter.run(EclipseStarter.java:177)rn at java.base/jdk.internal.reflect.NativeMethodAccessorImpl.invoke0(Native Method)rn at java.base/jdk.internal.reflect.NativeMethodAccessorImpl.invoke(NativeMethodAccessorImpl.java:62)rn at java.base/jdk.internal.reflect.DelegatingMethodAccessorImpl.invoke(DelegatingMethodAccessorImpl.java:43)rn at java.base/java.lang.reflect.Method.invoke(Method.java:564)rn at org.eclipse.equinox.launcher.Main.invokeFramework(Main.java:636)rn at org.eclipse.equinox.launcher.Main.basicRun(Main.java:591)rn at org.eclipse.equinox.launcher.Main.run(Main.java:1450)rnCaused by: org.osgi.framework.BundleException: Exception in org.eclipse.osgi.framework.internal.core.SystemBundleActivator.start() of bundle org.eclipse.osgi.rn at org.eclipse.osgi.framework.internal.core.BundleContextImpl.startActivator(BundleContextImpl.java:734)rn at org.eclipse.osgi.framework.internal.core.BundleContextImpl.start(BundleContextImpl.java:683)rn at org.eclipse.osgi.framework.internal.core.InternalSystemBundle.resume(InternalSystemBundle.java:225)rn ... 10 morernCaused by: java.lang.IllegalStateException: The System Bundle could not be resolved: Missing Constraint: Bundle-RequiredExecutionEnvironment: J2SE-1.5rn at org.eclipse.osgi.internal.baseadaptor.BaseStorage.checkSystemState(BaseStorage.java:827)rn at org.eclipse.osgi.internal.baseadaptor.BaseStorage.getStateManager(BaseStorage.java:800)rn at org.eclipse.osgi.baseadaptor.BaseAdaptor.getState(BaseAdaptor.java:387)rn at org.eclipse.osgi.internal.baseadaptor.BaseStorage.frameworkStart(BaseStorage.java:923)rn at org.eclipse.osgi.baseadaptor.BaseAdaptor.frameworkStart(BaseAdaptor.java:250)rn at org.eclipse.osgi.framework.internal.core.SystemBundleActivator.start(SystemBundleActivator.java:60)rn at org.eclipse.osgi.framework.internal.core.BundleContextImpl$1.run(BundleContextImpl.java:711)rn at java.base/java.security.AccessController.doPrivileged(Native Method)rn at org.eclipse.osgi.framework.internal.core.BundleContextImpl.startActivator(BundleContextImpl.java:702)rn ... 12 morern
在eclipse中运行JAVA出现错误怎么解决啊??
Activation.main: 警告: sun.rmi.activation.<em>exe</em>cPolicy 系统rn属性未被指定且 ExecPermissions/ExecOptionPermissionsrn均未被授权。随后的激活尝试失败,原因是对rnExecPermission/ExecOptionPermission 的权限检查失败。 有关如何rn配置 rmid 安全性的文档说明,请参阅: rnrnhttp://java.sun.com/j2se/1.4/docs/tooldocs/solaris/rmid.htmlrnhttp://java.sun.com/j2se/1.4/docs/tooldocs/win32/rmid.htmlrn
python Qthread子线程运行结束后出现APPCRASH
[b]问题:python Qthread子线程<em>运行</em>结束后<em>出现</em>APPCRASH[/b][color=#FF0000][/color]rnProblem signature:rn Problem Event Name: APPCRASHrn Application Name: python.<em>exe</em>rn Application Version: 3.6.5150.1013rn Application Timestamp: 5abbbe9ern Fault Module Name: Qt5Core.dllrn Fault Module Version: 5.10.1.0rn Fault Module Timestamp: 5a7c8091rn Exception Code: c0000005rn Exception Offset: 00010e62rn OS Version: 6.1.7601.2.1.0.256.48rn Locale ID: 1033rn Additional Information 1: 0a9ern Additional Information 2: 0a9e372d3b4ad19135b953a78882e789rn Additional Information 3: 0a9ern Additional Information 4: 0a9e372d3b4ad19135b953a78882e789rnrn现象1: <em>程序</em><em>运行</em>后,点击电脑其他软件如浏览器等,前置界面变成浏览器,当子线程处理完成后,会<em>出现</em>APPCRASH问题,如上代码所示。(有时候故障模块会变成[color=#FF0000]Qt5Gui.dll[/color]和[color=#FF0000]StackHash_0a9e[/color])rn[color=#FF0000]现象2: 当<em>程序</em><em>运行</em>后,将其窗口最小化后,子线程处理完后就不会<em>出现</em>崩溃问题了[/color]。(很有趣也很无奈的现象)rnrn所以向各位大拿们请教探讨下这个问题可能的原因是什么???[img=https://forum.csdn.net/PointForum/ui/scripts/csdn/Plugin/001/face/18.gif][/img]
eclipse运行java程序出现错误怎么解决
public class WelcomeToJavarn rnpublic static void main(String args[])rn System.out.println("Welcome to java!");rn rnrnrnrnrn<em>程序</em>在cmd下<em>运行</em>正常,但在Eclipse3.2下<em>出现</em>如下<em>错误</em>:rncould not find the main class,program will exit.(JAva virtual machine laucher窗口)rnrnrnconsle提示:rnjava.lang.NoClassDefFoundError: www/com/WelcomeToJavarnCaused by: java.lang.ClassNotFoundException: www.com.WelcomeToJavarn at java.net.URLClassLoader$1.run(Unknown Source)rn at java.security.AccessController.doPrivileged(Native Method)rn at java.net.URLClassLoader.findClass(Unknown Source)rn at java.lang.ClassLoader.loadClass(Unknown Source)rn at sun.misc.Launcher$AppClassLoader.loadClass(Unknown Source)rn at java.lang.ClassLoader.loadClass(Unknown Source)rn at java.lang.ClassLoader.loadClassInternal(Unknown Source)rn
运行MDnet时出现下面错误怎么解决
转专业研究生小白刚刚开始学习目标识别,在<em>运行</em>VOT2015的冠军MDNet的代码时<em>出现</em>下面问题该<em>怎么</em><em>解决</em>rnrnrunfile('E:/Document/deep learning code/py-MDNet-master/tracking/run_tracker.py', wdir='E:/Document/deep learning code/py-MDNet-master/tracking')rnTraceback (most recent call last):rnrn File "", line 1, in rn runfile('E:/Document/deep learning code/py-MDNet-master/tracking/run_tracker.py', wdir='E:/Document/deep learning code/py-MDNet-master/tracking')rnrn File "E:\Python\Anaconda\lib\site-packages\spyder\utils\site\sitecustomize.py", line 705, in runfilern <em>exe</em>cfile(filename, namespace)rnrn File "E:\Python\Anaconda\lib\site-packages\spyder\utils\site\sitecustomize.py", line 102, in <em>exe</em>cfilern <em>exe</em>c(compile(f.read(), filename, '<em>exe</em>c'), namespace)rnrn File "E:/Document/deep learning code/py-MDNet-master/tracking/run_tracker.py", line 323, in rn assert(args.seq != '' or args.json != '')rnrnAssertionError
form 在运行过程中出现 frm-41000 错误怎么解决
6i 的 form, 在按下 PageDown 或 PageUp 键时,<em>出现</em><em>错误</em> frm-41000,此函数当前不可用。 但在极少数的机器上可以正常使用,太怪了!
运行出现错误Segmentation fault。怎么解决呢?
[code=C/C++]#include rn#include rnrnint main (int argc, char *argv[])rnrn double a=234.567;rn double b=-434.676;rn char *ptr;rn gcvt(a,4,ptr);rn printf("a value=%s\n",ptr);/* <em>出现</em><em>错误</em>Segmentation fault */rn gcvt(b,4,ptr);rn printf("b value=%s\n",ptr);rn return 0;rn[/code]高手指点一下啊!
程序出现死循环,怎么解决
[root@192 CentOS]# rpm -ivh libX11-devel-1.0.3-9.el5.x86_64.rpmrnwarning: libX11-devel-1.0.3-9.el5.x86_64.rpm: Header V3 DSA signature: NOKEY, ke y ID e8562897rnerror: Failed dependencies:rn libXdmcp-devel is needed by libX11-devel-1.0.3-9.el5.x86_64rn xorg-x11-proto-devel >= 7.1-2 is needed by libX11-devel-1.0.3-9.el5.x86_ 64rn[root@192 CentOS]# rpm -ivh libXdmcp-devel-1.0.1-2.1.x86_64.rpmrnwarning: libXdmcp-devel-1.0.1-2.1.x86_64.rpm: Header V3 DSA signature: NOKEY, ke y ID e8562897rnerror: Failed dependencies:rn xorg-x11-proto-devel is needed by libXdmcp-devel-1.0.1-2.1.x86_64rn[root@192 CentOS]# rpm -ivh libXpm-devel-3.5.5-3.x86_64.rpmrnwarning: libXpm-devel-3.5.5-3.x86_64.rpm: Header V3 DSA signature: NOKEY, key ID e8562897rnerror: Failed dependencies:rn libX11-devel is needed by libXpm-devel-3.5.5-3.x86_64rn[root@192 CentOS]# rpm -ivh mesa-libGL-devel-6.5.1-7.7.el5.x86_64.rpmrnwarning: mesa-libGL-devel-6.5.1-7.7.el5.x86_64.rpm: Header V3 DSA signature: NOK EY, key ID e8562897rnerror: Failed dependencies:rn libX11-devel is needed by mesa-libGL-devel-6.5.1-7.7.el5.x86_64rn[root@192 CentOS]# rpm -ivh xorg-x11-proto-devel-7.1-9.el5.centos.x86_64.rpmrnwarning: xorg-x11-proto-devel-7.1-9.el5.centos.x86_64.rpm: Header V3 DSA signatu re: NOKEY, key ID e8562897rnerror: Failed dependencies:rn mesa-libGL-devel is needed by xorg-x11-proto-devel-7.1-9.el5.centos.x86_ 64rn[root@192 CentOS]#rnrn
出现这样的问题怎么解决呢,求解
[err:标签"内容信息列表_普通式(3)"数据源读取错,原因:超时时间已到。在操作完成之前超时时间已过或服务器未响应。] rn异常源、堆栈跟踪等异常信息: 标签:'内容信息列表_普通式(3)' rnrnrn[img=https://img-bbs.csdn.net/upload/201509/08/1441692476_539897.png][/img]rnrn情况一:有的时候正常显示,过段时间就不显示rn情况二:有的是先不显示,过段时间又显示;rn情况三:有的就是一直都不显示rnrn<em>求解</em>
安装出现花屏,怎么解决求解
各位大侠,我在家安装Android for x86,但是创建过程中<em>出现</em>花屏,到底咋办啊?后来没有管它,就没事儿了,这个情况影响不影响正常安装呢?rn[img=http://events.csdn.net/xhy/images/08231410.png][/img]
连接错误: LNK4070 怎么解决?高分求解
高分<em>求解</em>:rnrn我在VC中使用了多个project, 然后修改其中一个MFC扩展动态链接库的默认输出文件名DeviceModel.dll 为:DeviceModel_d.dll。rn编译时,<em>出现</em>以下<em>错误</em>:rnCreating library ..\Output/DeviceModel_d.lib and object ..\Output/DeviceModel_d.exprnrnDeviceModel_d.exp : warning LNK4070: /OUT:DeviceModel.dll directive in .EXP differs from output filename "..\Output/DeviceModel_d.dll"; ignoring directivern
隐形运行EXE程序
ShellExecute( NULL, "open", "calc.<em>exe</em>", NULL,NULL, SW_SHOWNORMAL ); rnHWND hWnd = ::FindWindow( NULL, "计算器" );rn::SendMessage( hWnd, WM_DESTROY, 0, 0 );rnrn用上面的<em>程序</em>打开计算器,然后发送关闭消息,调试的时候是对的,不过一<em>运行</em>就不行,关闭不了计算器窗口
Javascript运行exe程序.
JAVASCRIPT<em>运行</em>EXE<em>程序</em>,给出完成<em>程序</em>的路径就能<em>运行</em>.
请教程序在不同版本的vc运行错误
在vs2010之前的版本上没有<em>错误</em>,在vs2010生成的时候,提示如下的<em>错误</em>:rnrn从“double”转换到“const std::complex::_Ty”,可能丢失数据rnrn请教高手,这个<em>错误</em>应该如何<em>解决</em>?
感染EXE运行程序
感染EXE<em>运行</em><em>程序</em>代码
Eclipse\CheckStyle代码风格配置文件下载
Eclipse\CheckStyle代码风格配置文件 相关下载链接:[url=//download.csdn.net/download/ybygjy/2644324?utm_source=bbsseo]//download.csdn.net/download/ybygjy/2644324?utm_source=bbsseo[/url]
用photoshop制作gif动画下载
photoshop制作gif动画 制作gif动画 制作gif动画的方法 制作动画的方法 相关下载链接:[url=//download.csdn.net/download/lovohuqi/3980183?utm_source=bbsseo]//download.csdn.net/download/lovohuqi/3980183?utm_source=bbsseo[/url]
msp430试验环境简介与使用祥解下载
msp430试验环境简介与使用祥解 相关下载链接:[url=//download.csdn.net/download/u011615496/6197501?utm_source=bbsseo]//download.csdn.net/download/u011615496/6197501?utm_source=bbsseo[/url]
相关热词 c++和c#哪个就业率高 c# 批量动态创建控件 c# 模块和程序集的区别 c# gmap 截图 c# 验证码图片生成类 c# 再次尝试 连接失败 c#开发编写规范 c# 压缩图片好麻烦 c#计算数组中的平均值 c#获取路由参数
我们是很有底线的