编译openWR linux时出现一个xz: error while loading shared libraries错误,请问该如何解决 [问题点数:20分,结帖人shakehand]

一键查看最优答案

确认一键查看最优答案?
本功能为VIP专享,开通VIP获取答案速率将提升10倍哦!
Bbs1
本版专家分:0
结帖率 98.31%
Bbs5
本版专家分:2782
Blank
蓝花 2013年8月 Linux/Unix社区大版内专家分月排行榜第三
2013年7月 Linux/Unix社区大版内专家分月排行榜第三
uwsgi: error while loading shared libraries: libcrypto.so.1.0.0(centos7中出现的问题)
<em>出现</em>的问题: uwsgi: <em>error</em> while <em>loading</em> <em>shared</em> <em>libraries</em>: libcrypto.so.1.0.0: cannot open <em>shared</em> object file: No such file or directory <em>解决</em>1: [kiosk@asimov ~]$ find / -name libssl.so.1.0.0 /home/kiosk/anaco...
解决error while loading shared libraries: libcrypto.so.1.1: cannot open shared object file: No
<em>解决</em>OpenSSL:<em>error</em> while <em>loading</em> <em>shared</em> <em>libraries</em>: libcrypto.so.1.1: cannot open <em>shared</em> object file: No <em>解决</em>OpenSSL:<em>error</em> while <em>loading</em> <em>shared</em> <em>libraries</em>: libcrypto.so.1.1: cannot open <em>shared</em> object fil...
error while loading shared libraries: libssl.so.4问题解决方法
<em>error</em> while <em>loading</em> <em>shared</em> <em>libraries</em>: libssl.so.4问题<em>解决</em>方法 <em>error</em> while <em>loading</em> <em>shared</em> <em>libraries</em>: libssl.so.4问题<em>解决</em>方法 笔者今天欲启动<em>一个</em>lighttpd,报<em>error</em> while <em>loading</em> <em>shared</em> <em>libraries</em>: libssl.so.4的<em>错误</em>,本质原因是缺少o
mysql登录报错:mysql: error while loading shared libraries: libncurses.so.5: cannot open shared object fi...
系统是redhad8,binary方式安装完mysql之后,mysql命令登录不成功,报错:mysql: <em>error</em> while <em>loading</em> <em>shared</em> <em>libraries</em>: libncurses.so.5: cannot open <em>shared</em> object file: No such file or directory。按照百度的方法都不成功,应该和系统版本有关,后来自己想到一...
执行nginx报错,找不到库./sbin/nginx: error while loading shared libraries: libcrypto.so.6: cannot open share
在工作过程中,部署项目安装的nginx执行报错,找不到库../sbin/nginx: <em>error</em> while <em>loading</em> <em>shared</em> <em>libraries</em>: libcrypto.so.6: cannot open <em>shared</em> object file: No such file or directory 由<em>错误</em>提示可以看出缺少libcrypto.so.6 通过命令:ldd $(wh
error while loading shared libraries 错误解决办法总结,
最近安装了装了几次ACE库,装起来会<em>出现</em>很多问题。 其实我发现直接按照ace的帮助文档进行编写。就差不多。 安装完成后,经常会遇到以下问题<em>error</em> while <em>loading</em> <em>shared</em> <em>libraries</em>,就是<em>编译</em>器没有找到相应的lib库文件。   从互联网上找到了一些文章, <em>解决</em>了我的问题:贴一下。 缺少libclntsh.so.11.1 当运行./alibaba_prof.ou
android源码编译报错:prebuilts/misc/linux-x86/bison/bison: 没有这个文件或目录
Android源码<em>编译</em>问题: /bin/bash: prebuilts/misc/<em>linux</em>-x86/bison/bison: 没有那个文件或目录No such file or directory build/core/binary.mk:609: recipe for target 'out/host/<em>linux</em>-x86/obj/EXECUTABLES/aidl_intermedia
ubuntu编译android出现error while loading shared libraries: libstdc++.so.6: cannot open shared objec的解决方法
prebuilts/misc/<em>linux</em>-x86/bison/bison: <em>error</em> while <em>loading</em> <em>shared</em> <em>libraries</em>: libstdc++.so.6: cannot open <em>shared</em> object file: No such file or directory
解决libstdc++.so.6: cannot open shared object file: No such file or directory:问题
使用arm-<em>linux</em>-gcc工具<em>时</em>提示config.log提示 libstdc++.so.6: cannot open <em>shared</em> object file: No such file or directory: 原因在于,ubuntu 18.04 版本 ia32_libs 被废弃了导致没有32位的lib库。 <em>解决</em>方法 sudo apt-get install lib32stdc++6 ...
故障解决error while loading shared libraries: libncurses.so.5
故障<em>解决</em>:<em>error</em> while <em>loading</em> <em>shared</em> <em>libraries</em>: libncurses.so.5 问题的提出 在我准备调试 Linux-0.11 内核的<em>时</em>候,<em>出现</em>了如下故障(真奇怪,以前没有这个问题啊,怎么突然就这样了,555555555……) /rungdb ./gdb: <em>error</em> while <em>loading</em> <em>shared</em> <em>libraries</em>: l...
gdb远程调试arm+linux上的应用程序
对于嵌入式<em>linux</em>应用程序开发调试一般采用gdb+gdbserver的形式。具体步骤罗列如下: 第一步:移植gdbserver到开发板 1)首先查看安装在你<em>linux</em>上的arm-<em>linux</em>-gdb的版本,然后在http://ftp.gnu.org/gnu/gdb/上下载对应的gdb。如果arm-<em>linux</em>-gdb和gdbserver的版本不一致,在连接调试的<em>时</em>候会<em>出现</em>像如下信息 Malfo
错误的原因和解决办法">error while loading shared libraries: xxx.so.x"错误的原因和解决办法
原文地址:<em>error</em> while <em>loading</em> <em>shared</em> <em>libraries</em>: xxx.so.x"<em>错误</em>的原因和<em>解决</em>办法 作者: 一般我们在Linux下执行某些外部程序的<em>时</em>候可能会提示找不到共享库的<em>错误</em>, 比如: tmux: <em>error</em> while <em>loading</em> <em>shared</em> <em>libraries</em>: libevent-1.4.so.2: cannot open <em>shared</em> obj
Linux中编译squash文件系统出错
前几天接触了<em>一个</em>新的SDK,<em>编译</em>的<em>时</em>候发现<em>出现</em>以下<em>错误</em>: ./mksquashfs:<em>error</em> while <em>loading</em> <em>shared</em> <em>libraries</em>: liblzma.so.5: cannot open <em>shared</em> objectfile: No such file or directory 照字面上的意思,很明显是缺少<em>一个</em>库文件liblzma.so.5。但是翻了几遍SDK,也没发
cc1: error while loading shared libraries: libmpc.so.3:
问题是这样的,通过buildroot做了一套工具链,将工具链打包出来放到其他机器上,大部分的<em>编译</em>都可以 但<em>编译</em>内核<em>时</em>报错   CHK     include/<em>linux</em>/version.h   CHK     include/generated/utsrelease.h make[1]: `include/generated/mach-types.h' is up to date.  
如何解决Linux:error while loading shared libraries: libmpc.so.3(不使用root权限)
在<em>linux</em>下安装某些需要其他软件做支撑的软件(如gcc,需要gmp,mpc,mpfr做支持)<em>时</em>,已经下载好了依赖软件,可能会<em>出现</em>       <em>error</em> while <em>loading</em> <em>shared</em> <em>libraries</em>: libmpc.so.3 比如: 一般情况下,可以在所需软件的lib目录里找到此文件 也可以在家目录中用 find -name  xx.so.x找到文件位置(如果有多
error while loading shared libraries: libclntsh.so.11.1 错误
在centos 6.9 中安装 oracle 11g ,切换oracle用户,执行 lsnrctl 、sqlplus 等操作报错:<em>error</em> while <em>loading</em> <em>shared</em> librarie
error while loading shared libraries问题解决
[hiredis]<em>编译</em>后执行自己的c代码<em>出现</em>问题:<em>error</em> while <em>loading</em> <em>shared</em> <em>libraries</em>: libhiredis.so.0.13: cannot open <em>shared</em> object file: No such file or directory 那就表示系统不知道xxx.so 放在哪个目录下。这个<em>时</em>候就要在/etc/ld.so.conf中加入xxx.so所在的目录
Linux中error while loading shared libraries错误解决办法
  默认情况下,<em>编译</em>器只会使用/lib和/usr/lib这两个目录下的库文件,通常通过源码包进行安装<em>时</em>,如果不指定--prefix,会将库安装在/usr/local/lib目录下;当运行程序需要链接动态库<em>时</em>,提示找不到相关的.so库,会报错。也就是说,/usr/local/lib目录不在系统默认的库搜索目录中,需要将目录加进去。   1、首先打开/etc/ld.so.conf文件   2...
uwsgs loading shared libraries: libicui18n.so.58 异常处理
  如果缺少报这个错uwsgi: <em>error</em> while <em>loading</em> <em>shared</em> <em>libraries</em>: libssl.so.1.0.0: cannot open <em>shared</em> object file: No such file or directory 可以看这个文章:https://blog.csdn.net/qq_26105397/article/details/79928222 ...
error while loading shared libraries: xxx.so.x" 错误的原因和解决办法">"error while loading shared libraries: xxx.so.x" 错误的原因和解决办法
一般我们在Linux下执行某些外部程序的<em>时</em>候可能会提示找不到共享库的<em>错误</em>, 比如: tmux: <em>error</em> while <em>loading</em> <em>shared</em> <em>libraries</em>: libevent-1.4.so.2: cannot open <em>shared</em> object file: No such file or directory 原因一般有两个, <em>一个</em>是操作系统里确实没有包含该共享库(l
arm交叉编译工具使用报错
运行报错: liyongjun@liyongjun-VirtualBox:~$ arm-<em>linux</em>-gnueabihf-gcc bash: /home/liyongjun/anosi/gcc-linaro-arm-<em>linux</em>-gnueabihf-4.7-2013.03-20130313_<em>linux</em>/bin/arm-<em>linux</em>-gnueabihf-gcc: 没有那个文件或目录 产生这个问题的原因是...
error while loading shared libraries错误解决
出错如下: 主要<em>错误</em>:<em>error</em> while <em>loading</em> <em>shared</em> <em>libraries</em>: libboost_regex.so.1.51.0: cannot open <em>shared</em> object file: No such file or directory <em>错误</em>过程如下: [root@node07 C++]# ll 总用量 960 -rw-r--r--. 1 root roo
ubantu1604上运行QT5程序出现error while loading shared libraries:......
初学QT,便在ubantu上运行了<em>一个</em>程序,在网上查找了好久未果。今天终于<em>解决</em>。 首先 1.编辑 vi /etc/ld.so.conf  如果是非root权限帐号登录,使用 sudo vi /etc/ld.so.conf  添加上python2.7的lib库地址,如我的/usr/local/lib,保存文件 2.执行 /sbin/ldconfig -v命令,如果是非root权限帐号登录,使用...
gcc 编译错误: libmpc.so.2 error
gcc<em>编译</em>个 .c文件出错 就是这个start.c gcc -I include/ -c -fno-builtin -o kernel/start.o kernel/start.c 这是<em>error</em> l
arm-linux-gnueabihf-g++: error while loading shared libraries: libstdc++.so.6 no such file and ....
有一些老版本的arm-gcc <em>编译</em>程序<em>时</em>经常报错arm-<em>linux</em>-gnueabihf-g++: <em>error</em> while <em>loading</em> <em>shared</em> <em>libraries</em>: libstdc++.so.6  no such file and ....... <em>解决</em>办法: apt-get install lib32z1 lib32ncurses5 apt-get install lib
error while loading shared libraries的解決方法
<em>error</em> while <em>loading</em> <em>shared</em> <em>libraries</em>的解決方法 ...
error while loading shared libraries: libtinfo.so.5
想通过ansible在管理的各数据库服务器执行操作数据库的<em>一个</em>shell脚本,跑脚本的<em>时</em>候发现部分服务器能执行成功,部分服务器失败了,报错信息为<em>error</em> while <em>loading</em> <em>shared</em> <em>libraries</em>: libtinfo.so.5。 经过对比,发现执行失败的服务器为centos5的系统。其实系统已经装过ncurses包了,<em>解决</em>方法也简单,...
liblzma.so.0: cannot open shared object file: No such file or directory问题解决
运行报错:<em>error</em> while <em>loading</em> <em>shared</em> <em>libraries</em>: liblzma.so.0: cannot open <em>shared</em> object file: No such file or directory <em>解决</em>方法: centos 7:yum install <em>xz</em>-compat-libs
error while loading shared libraries解决办法
在启动 mongod的<em>时</em>候遇到  <em>error</em> while <em>loading</em> <em>shared</em> <em>libraries</em>: libnetsnmpagent.so.20: cannot open <em>shared</em> object file: No such file or directory 该<em>error</em> 是因为未装net-snmp 直接连接外网的Linux服务器可直接使用:yum install net-snm
解决error while loading shared libraries: libpython2.7.so.1.0: cannot open shared object file: No su
安装了python2.7,第一次执行<em>时</em>报错: <em>error</em> while <em>loading</em> <em>shared</em> <em>libraries</em>: libpython2.7.so.1.0: cannot open <em>shared</em> object file: No such file or directory <em>解决</em>方法如下: 1.编辑      vi /etc/ld.so.conf  如果是非root权限帐号登录
error while loading shared libraries错误解决办法
<em>error</em> while <em>loading</em> <em>shared</em> <em>libraries</em> <em>错误</em><em>解决</em>办法 在<em>编译</em>yaml-cpp后,并且使用ROS摄像驱动<em>时</em>,<em>出现</em><em>错误</em>:<em>error</em> while <em>loading</em> <em>shared</em> <em>libraries</em>: libyaml-cpp.so.0.5: cannot open <em>shared</em> object file: No such file or directory。 搜索了网上的
error while loading shared libraries: libgmp.so.10 GMP 找不到共享库文件问题
编写了<em>一个</em>使用GMP库的程序,<em>编译</em>可以通过,但是运行总是提示<em>错误</em>: <em>error</em> while <em>loading</em> <em>shared</em> <em>libraries</em>: libgmp.so.10: cannot open <em>shared</em> object file: No such file or directory. 在命令行查找libgmp.so.10 发现库文件存在,于是把该路径加到LD_LIBRARY_PATH
Linux编译候由于链接库出现的各种问题
Linux<em>编译</em><em>时</em>由于库<em>出现</em>的问题 一 动态库与机器位数不符合 报错内容 /usr/bin/ld: skipping incompatible /usr/lib/libcrypto.so when sear
运行编译后的程序报错 error while loading shared libraries: lib*.so: cannot open shared object file: No such f...
运行<em>编译</em>后的程序报错 <em>error</em> while <em>loading</em> <em>shared</em> <em>libraries</em>: lib*.so: cannot open <em>shared</em> object file: No such file or directory   运行<em>编译</em>后的程序报错  <em>error</em> while <em>loading</em> <em>shared</em> <em>libraries</em>: lib*.s...
uwsgi loading shared libraries:libicui18n.so.58 异常处理
背景: 用nginx + uwsgi + flask搭建python应用环境 python使用anaconda3(python 3.6) 依赖包安装完毕,但是执行uwsgi的<em>时</em>候<em>出现</em>如下异常 (py3) [root@localhost ~]# uwsgi uwsgi: <em>error</em> while <em>loading</em> <em>shared</em> <em>libraries</em>: libicui18n.so.58: cann...
安装zeroMQ以及error while loading shared librarie找不多对应so文件的错误解决
从官网下载源码包zeromq-4.2.1.tar.gz,tar解压,进入文件夹 ``` # yum install libtool ``` 要执行./autogen.sh,因此要安装依赖库 ``` # ./autogen.sh  ``` 自动生成安装文件 提示 <em>error</em>: Autoconf version 2.64 or higher is required
ldconfig导致的系统问题
CentOS 6.5 一台服务器上要装一些软件,但是这些
centos7.2中搭建ARM开发环境所需工具初体验
需要用到的工具: <em>编译</em>工具:arm-<em>linux</em>-gcc  链接工具:arm-<em>linux</em>-ld 格式转换工具:arm-<em>linux</em>-objcopy 反汇编器:arm-<em>linux</em>-objdump 文件信息查看:arm-<em>linux</em>-readelf 1. 将arm-<em>linux</em>-gcc的bin目录添加至环境变量,使用命令如下    vi   ~/.bashrc   在.bash
arm-linux-gnueabihf-gcc: error while loading shared libraries: libstdc++.so.6: c
arm-<em>linux</em>-gnueabihf-gcc -o hello hello.c arm-<em>linux</em>-gnueabihf-gcc: <em>error</em> while <em>loading</em> <em>shared</em> librari
error while loading shared libraries: libboost_program_options.so.1.69.0: cannot open shared...
ubuntu16.04 <em>error</em> while <em>loading</em> <em>shared</em> <em>libraries</em>: libboost_filesystem.so.1.69.0: cannot open <em>shared</em> object file: No such file or directory 在Ubuntu16运行某个可执行文件<em>时</em>遇到了上述<em>错误</em>,它找不到上述的共享库,之后遇到类似文件<em>error</em>都可如以下步骤操作 ...
error while loading shared libraries: xxx.so.x" 的原因和解决办法">错误"error while loading shared libraries: xxx.so.x" 的原因和解决办法
找不到共享库<em>错误</em>的原因及<em>解决</em>办法
linux下的.so问题。。。。。。。。。。。
在<em>一个</em>.so中分配了内存,如果这个.so中不带有释放内存的函数,在自己的代码中手动释放的<em>时</em>候会出错吗?
./nginx: error while loading shared libraries: libcrypto.so.1.1: cannot open shared object file: No
在CentOS7下配置Nginx,但是一致都在报错。报错信息为: ./nginx: <em>error</em> while <em>loading</em> <em>shared</em> <em>libraries</em>: libcrypto.so.1.1: cannot open <em>shared</em> object file: No such file or directory 如下图所示: 首先检测原因所在,通过下面的命令行检测: ldd $(whic
Linux下运行dpdk出现error while loading shared libraries : xxxx.so
./tests: <em>error</em> while <em>loading</em> <em>shared</em> <em>libraries</em>: xxx.so.0:cannot open <em>shared</em> object file: No such file or directory <em>出现</em>这类<em>错误</em>表示,系统不知道xxx.so放在哪个目录下,这<em>时</em>候就要在/etc/ld.so.conf中加入xxx.so所在的目录. 一般来说,系统会将很多的so存放在/us...
解决error while loading shared libraries: libXXX.so.X: cannot open shared object file: No such file
<em>解决</em><em>error</em> while <em>loading</em> <em>shared</em> <em>libraries</em>: libXXX.so.X: cannot open <em>shared</em> object file: No such file 分析原因:ld提示找不到库文件,而库文件就在当前目录中。 链接器ld默认的目录是/lib和/usr/lib,如果放在其他路径也可以,需要让ld知道库文件在哪里。 方法1: 编辑/etc/ld.so.con...
error while loading shared libraries错误的原因及解決方法
在<em>linux</em>下运行程序<em>时</em>,发现了<em>error</em> while <em>loading</em> <em>shared</em> <em>libraries</em>这种<em>错误</em>。
解决 uwsgi: error while loading shared libraries: libssl.so.1.0.0:cannot open shared object file:
<em>解决</em> uwsgi: <em>error</em> while <em>loading</em> <em>shared</em> <em>libraries</em>: libssl.so.1.0.0:cannot open <em>shared</em> object file: no such file or directory <em>解决</em>方法: 在Anaconda的安装目录lib下复制 libssl.so.1.0.0 到 /lib64(32位<em>linux</em>到/lib) 下即可,缺哪个复制哪...
error while loading shared libraries解决办法
一般我们在Linux下执行某些外部程序的<em>时</em>候可能会提示找不到共享库的<em>错误</em>, 比如: <em>error</em> while <em>loading</em> <em>shared</em> <em>libraries</em> XXX 原因一般有两个, <em>一个</em>是操作系统里确实没有包含该共享库(lib*.so.*文件)或者共享库版本不对, 遇到这种情况那就去网上下载并安装上即可。 一般这<em>时</em>候只需要apt-get install libxxx-dev或者下载
详解命令-ldconfig
2019独角兽企业重金招聘Python工程师标准&gt;&gt;&gt; ...
error while loading shared libraries: xxx.so.x 错误原因和解决办法
ldconfig命令的用途:默认搜寻目录(/lib和/usr/lib)以及动态库配置文件/etc/ld.so.conf内所列的目录下,搜索出可共享的动态链接库(格式如lib*.so*),进而创建出动态装入程序(ld.so)所需的连接和缓存文件,缓存文件默认为/etc/ld.so.cache,此文件保存已排好序的动态链接库名字列表。 如果共享库文件安装到了/usr/local/lib(很多开源的...
vim: error while loading shared libraries: /lib64/libgpm.so.2: file too short解决过程
在使用vim的<em>时</em>候突然报错: [root@localhost ~]# vim a vim: <em>error</em> while <em>loading</em> <em>shared</em> <em>libraries</em>: /lib64/libgpm.so.2: file too short <em>解决</em>过程如下: 1、先搜索了一下该软件是哪个包提供的 [root@localhost ~]# yum provides *libgpm.so.2 Loaded p...
Centos 7编译Android工程出现 error while loading shared libraries: libz.so.1 的问题
己安装Ccentos 7开发,<em>编译</em>安卓工程的<em>时</em>候<em>出现</em>问题。开发工具<em>出现</em>问题,之前的有部分<em>error</em> =2的问题为忘记了怎么<em>解决</em>的。百度一下应该可以<em>解决</em>。最好是安装之后设置下国内的源,提高下载速度。 下面是某些so包文件缺少导致的问题。给大家参考以下,为从网上复制过来的。原地址在这里,感谢原作者 -bash: /usr/bin/aapt: /lib/ld-Linux.so.2: bad
error while loading shared libraries: /usr/lib/a.so: ELF file OS ABI invalid
我使用的系统是.rhel-client-5.5-x86_64-dvd.iso,64位的,同样的程序在ubuntu 64位下面运行成功,但是在小红帽系统下<em>编译</em>可以成功,运行<em>时</em>提示<em>error</em> while
Centos 7安装OpenSSL 1.1.0f版遇到缺失 libssl.so.1.1问题
Centos 7安装OpenSSL 1.1.0f版遇到缺失 libssl.so.1.1问题的简单有效<em>解决</em>办法。
【Linux】【编译】libmpc.so.3: cannot open shared object file: No such file or directory
交叉<em>编译</em>zlib<em>出现</em>找不到libmpc.so.3问题
Wine cannot find the ncurses library (libncurses.so.5)
环境: Ubuntu18.10 amd-64 wine 4.0.2 国外的网站很多方案是错的, 正确的<em>解决</em>方案是: apt-get install libncurses5:i386
arm-hisiv400-linux-g++: error while loading shared libraries: libstdc++.so.6: cannot open shared obj
有一些老版本的arm-gcc <em>编译</em>程序<em>时</em>经常报错arm-hisiv400-<em>linux</em>-g++: <em>error</em> while <em>loading</em> <em>shared</em> <em>libraries</em>: libstdc++.so.6: cannot open <em>shared</em> obj <em>解决</em>办法: apt-get install lib32z1 lib32ncurses5 apt-get install lib32stdc++6 ...
linux下的centos出现error while loading shared libraries错误
例如serice searchd start开启sphinx<em>时</em>提示:<em>error</em> while <em>loading</em> <em>shared</em> <em>libraries</em>: libmysqlclient.so.20: cannot open <em>shared</em> object file: No such file or directory 看提示肯定是没有找到libmysqlclient.so.20这个共享库文件 如果是64位系统
error while loading shared libraries:libselinux.so.1
<em>错误</em>提示:<em>error</em> while <em>loading</em> <em>shared</em> <em>libraries</em>:libse<em>linux</em>.so.1 <em>解决</em>方法: 1. 添加库/lib/libse<em>linux</em>.so.12.去除应用程序对libse<em>linux</em>.so.1的依赖关系,正在寻找方法。
ubuntu error while loading shared libraries: libQt5Charts.so.5: cannot open shared object file
运行QT程序<em>时</em>缺少库. 参考opencv库 .. 运行<em>时</em>又报错 在ubuntu下eclipse<em>编译</em>opencv程序后,执行报下面到<em>错误</em>: <em>error</em> while <em>loading</em> <em>shared</em> <em>libraries</em>: libopencv_core3.so: cannot open <em>shared</em> object file: No such file or directory <em>解决</em>方法:找到libop...
使用SRVCTL报错:error while loading shared libraries
1.报错如下: [oracle@rac1 ~]$ srvctl add service -d rac -s test -r "rac1" /u01/app/oracle/product/dbhome_1/jdk/jre/bin/java: <em>error</em> while <em>loading</em> <em>shared</em> <em>libraries</em>: libpthread.so.0: cannot open <em>shared</em> ob
error while loading shared libraries: libcrypto.so.1.1: cannot open shared object file: No such file
在<em>linux</em>上安装了eclipse,运行和openssl相关的程序的<em>时</em>候,报错 <em>error</em> while <em>loading</em> <em>shared</em> <em>libraries</em>: libcrypto.so.1.1: cannot open <em>shared</em> object file: No such file or directory。 这个<em>错误</em>的<em>解决</em>方法有很多,要根据具体情况确定。 在eclipse上运行程序报错, ...
centos下ffmpeg报错error while loading shared libraries: libXv.so.1: cannot open shared object file: No
<em>error</em> while <em>loading</em> <em>shared</em> <em>libraries</em>: libXv.so.1: cannot open <em>shared</em> object file: No such file or directory ffmpeg/bin目录下运行 ./ffmpeg -version如有提示文件缺失,系统中需安装这两项 yum install libXv* yum install SDL(
liblinc.so.1: cannot open shared object file: No such file or directory
课本配套程序,我运行<em>时</em> 提示<em>错误</em>缺动态库 <em>error</em> while <em>loading</em> <em>shared</em> <em>libraries</em>: liblinc.so.1: cannot open <em>shared</em> object f
percona 初始化报错error while loading shared libraries: libssl.so.6
第一次玩pecona 就给<em>一个</em>下马威,初始化数据库居然给我报
libcrypto.so.1.0.0: cannot open shared object file: No such file or directory解决方案
因为有些程序用到openssl1.0.0库里面的md5,但是apt-get install openssl1.0.0也不行,到官网找源码<em>编译</em>也失败,一度接近放弃的<em>时</em>候,找到debian上面的openssl的安装包,安装之后发现竟然可以了,下面给出链接和安装命令 下载地址 安装命令 dpkg -i libssl1.0.0_1.0.2l-1-bpo8+1_amd64.deb
openssl: error while loading shared libraries: libssl.so.1.1
系统:centos7安装openssl过程中没有出错启动openssl<em>时</em>,<em>出现</em>openssl: <em>error</em> while <em>loading</em> <em>shared</em> <em>libraries</em>: libssl.so.1.1: cannot open <em>shared</em> object file: No such file or directory网上的<em>解决</em>方法有两种第一种:创建软链接ln -s /usr/local/lib64/...
解决./exam5-5: error while loading shared libraries: libdemo.so: cannot open shared object file:
在使用动态库的<em>时</em>候,已经生成了可执行文件(exam5-5)了,但是输入./exam5-5运行<em>时</em>报错: ./exam5-5: <em>error</em> while <em>loading</em> <em>shared</em> <em>libraries</em>: libdemo.so: cannot open <em>shared</em> object file: No such file or directory 这是因为运行<em>时</em>系统无法找到你的动态库,这<em>时</em>候要配置一下:
libcudart.so.2: cannot open shared object file: No such file or directory
libcudart.so.2: cannot open <em>shared</em> object file: No such file or directory 请教各位高手,这是什么问题 P.S. 我将LD_LI
linux动态链接库---一篇讲尽
一般我们在Linux下执行某些外部程序的<em>时</em>候可能会提示找不到共享库的<em>错误</em>, 比如: tmux: <em>error</em> while <em>loading</em> <em>shared</em> <em>libraries</em>: libevent-1.4.so.2: cannot open <em>shared</em> object file: No such file or directory 原因一般有两个, <em>一个</em>是操作系统里确实没有...
错误:不能发现libcrypto library
<em>编译</em>c文件过程中,调用openssl ‘libcrypto’库<em>时</em>报错,是什么原因? win 64位,gcc 6.2.0 g++ "-LC:\\msys\\1.0\\local\\ssl\\lib" -
linux安装QQ问题
安装<em>linux</em>qq-v1.0.2-beta1.i386.rpm 版本QQ! 执行:rpm -ivh <em>linux</em>qq-v1.0.2-beta1.i386.rpm <em>时</em>,就报 Failed dependen
error while loading shared libraries: /usr/lib64/libc.so.6: invalid ELF header
在安装<em>一个</em>程序的<em>时</em>候提示libc.so.6过旧,但是查看libc.so的版本是最新的,于是尝试使用尝试软链接  ln -s /usr/lib64/libc.so /usr/lib64/libc.so.6 , 悲剧的事情发生了! 几乎所有的<em>linux</em>命令都依赖于libc.so,libc.so.6是<em>一个</em>动态链接库文件,是GNU C Library的<em>一个</em>共享函数库,软链接到不同的版本上才能起作用。 ...
/darknet: error while loading shared libraries: libopencv_highgui.s
sudo /bin/bash -c 'echo "/usr/local/lib" &gt; /etc/ld.so.conf.d/opencv.conf' sudo ldconfig https://github.com/pjreddie/darknet/issues/382
[libev]error while loading shared libraries: libev.so.4
用./configure、make、make install安装完libev后,写<em>一个</em>简单程序server.c,<em>编译</em>,gcc server.c -o server lev。 产生如下<em>错误</em>:<em>error</em> while <em>loading</em> <em>shared</em> <em>libraries</em>: libev.so.4: cannot open <em>shared</em> object file: No such file or directo...
arm-linux-gnueabihf-gcc: error while loading shared libraries: libstdc++.so.6: cannot open shared ob
在使用4.4.3版本的<em>编译</em>器<em>编译</em><em>linux</em>-2.22.6内核<em>时</em><em>出现</em>libstd++6库找不到的问题!!! 通过上网搜索和尝试 原来是自己使用的64位版本的系统 中的libstdc++6与<em>编译</em>器版本中的库文件发生了冲突  <em>编译</em>器中是32位而系统中是64位。 <em>解决</em>办法:sudo apt-get install lib32stdc++6 安装32位lib库
配置web pack loader 报错:Module build failed: Error: The node API for `babel` has been moved to `babel-...
报错如下 Module build failed: Error: The node API for `babel` has been moved to `babel-core`. 在我配置loader 的<em>时</em>候<em>出现</em>如上问题 配置文件部分如下 { test: /\.js/, loader: "babel", } <em>解决</em>方法: 改为 babel-l...
error while loading shared libraries: libcudart.so.8.0: cannot open shared object file: can not open
装好caffe后,第一件事就是先跑跑自带的mnist例子看看能不能跑通。   问题: 结果发现如下问题,问题比较多,但都是<em>一个</em>性质的,<em>解决</em><em>一个</em>其他都一样: ./build/tools/caffe: <em>error</em> while <em>loading</em> <em>shared</em> <em>libraries</em>: libcudart.so.8.0: cannot open <em>shared</em> object file:  can not ...
错误原因">解决error while loading shared libraries: xxx.so.x"类似问题办法和错误原因
<em>解决</em><em>error</em> while <em>loading</em> <em>shared</em> <em>libraries</em>: xxx.so.x"类似问题办法和<em>错误</em>原因 <em>编译</em>Tengine<em>时</em>,执行make命令,<em>出现</em>以下<em>错误</em>: <em>error</em> while <em>loading</em> <em>shared</em> <em>libraries</em>:libtinfo.so.5: cannot open <em>shared</em> object file: No such file or directo
mysql: error while loading shared libraries: libncurses.so.5: cannot open shared object file: No suc
执行命令:mysql -u root -p <em>错误</em>:<em>error</em> while <em>loading</em> <em>shared</em> <em>libraries</em>: libncurses.so.5: cannot open <em>shared</em> object file 分析:缺少 libncurses.so.5 <em>解决</em>方案: yum install  libncurses.so.5 另外<em>一个</em>方案参考博客:<em>解决</em>CentOS缺少共享库:li...
svn启动报错(error while loading shared libraries: libaprutil-1.so.0:cannot open shared object file)
1、报错信息 svnserve: <em>error</em> while <em>loading</em> <em>shared</em> <em>libraries</em>: libaprutil-1.so.0: cannot open <em>shared</em> object file: No such file or directory 2、原因分析:提示在共享库找不到libaprutil-1.so.0这个库,如果不是没有安装apr那就是共享库里没有这个库,我这里...
error while loading shared libraries: libcrypto.so.4: cannot open shared object file: No such file o
<em>错误</em>原因:启动项目<em>时</em>,报错: <em>error</em> while <em>loading</em> <em>shared</em> <em>libraries</em>: libcrypto.so.4: cannot open <em>shared</em> object file: No such file or directory 使用,查询语句查询当前系统中是否存在:libcrypto.so.4 find / -name libcrypto.so.4 如过没有,...
caffe测试mnist出现错误error while loading shared libraries: libcublas.so.9.1
<em>出现</em>这个<em>错误</em>的原因就是程序按照默认共享库路径找不到需要的共享库文件。默认的共享库路径是/lib和/usr/lib,但是当我们安装第三方软件<em>时</em>,库文件是在安装的路径下的。这里需要找到的就是CUDA安装路径下的库文件。 按照下面命令进行操作,将新共享库目录加入到共享库配置文件/etc/ld.so.conf中: sudo su cat /etc/ld.so.conf#首先查看一下文件下本身已有的内...
openwrt 交叉编译出错? 大神帮忙解决
btget.c:228:9: warning: variable 'optquiettmo' set but not used int optquiettmo = 0; ^ /home/ycmedia
./utserver: error while loading shared libraries: libcrypto.so.0.9.8: cannot open shared object file
<em>错误</em>0 不记得了, <em>解决</em>办法,安装32位的库 yum install glibc.i686  <em>错误</em>1 ./utserver: <em>error</em> while <em>loading</em> <em>shared</em> <em>libraries</em>: libssl.so.0.9.8: cannot open <em>shared</em> object file: No such file or directory yum install o
centos7 安装mongo ./mongod: error while loading shared libraries: libnetsnmpmibs.so.31:
入坑两次:第二次几近崩溃,容我吐槽一下,以表明治。。问题是这:NETWORK [thread1] Failed to connect to 127.0.0.1:27017, in(checking socket for <em>error</em> after poll), reason: errno:111 Connection refused ./mongod: <em>error</em> while <em>loading</em> sha...
nginx启动报错:error while loading shared libraries
转载自https://blog.csdn.net/white__cat/article/details/379230871# /usr/local/nginx/sbin/nginx2/usr/local/nginx/sbin/nginx: <em>error</em> while <em>loading</em> <em>shared</em> <em>libraries</em>: libpcre.so.1: cannot open <em>shared</em> object fi...
Nginx启动错误:error while loading shared libraries: libpcre.so.1
1 /usr/local/nginx/sbin/nginx 2 /usr/local/nginx/sbin/nginx: <em>error</em> while <em>loading</em> <em>shared</em> <em>libraries</em>: libpcre.so.1: cannot open <em>shared</em> object file: No such file or directory 从<em>错误</em>提示信息可以得知是因为缺少lib文件导致,进一步查看...
Java学习的正确打开方式
在博主认为,对于入门级学习java的最佳学习方法莫过于视频+博客+书籍+总结,前三者博主将淋漓尽致地挥毫于这篇博客文章中,至于总结在于个人,实际上越到后面你会发现学习的最好方式就是阅读参考官方文档其次就是国内的书籍,博客次之,这又是<em>一个</em>层次了,这里暂<em>时</em>不提后面再谈。博主将为各位入门java保驾护航,各位只管冲鸭!!!上天是公平的,只要不辜负<em>时</em>间,<em>时</em>间自然不会辜负你。 何谓学习?博主所理解的学习,它是<em>一个</em>过程,是<em>一个</em>不断累积、不断沉淀、不断总结、善于传达自己的个人见解以及乐于分享的过程。
无线通信FPGA设计(田耘).part27下载
无线通信FPGA设计(田耘).part无线通信FPGA设计(田耘).part 相关下载链接:[url=//download.csdn.net/download/ssfy709/2783725?utm_source=bbsseo]//download.csdn.net/download/ssfy709/2783725?utm_source=bbsseo[/url]
Squonk42-TL-WR703N-4f6beca,无线wifiWR703N原理图下载
Squonk42-TL-WR703N-4f6beca,无线wifiWR703N原理图 相关下载链接:[url=//download.csdn.net/download/u011511430/7019433?utm_source=bbsseo]//download.csdn.net/download/u011511430/7019433?utm_source=bbsseo[/url]
MS Excel 函数手册下载
Excel 函数手册收集Excel常用函数的语法及技巧,可大大提高使用Excel的效率 相关下载链接:[url=//download.csdn.net/download/hij0125/7821441?utm_source=bbsseo]//download.csdn.net/download/hij0125/7821441?utm_source=bbsseo[/url]
相关热词 c# 输入ip c# 乱码 报表 c#选择结构应用基本算法 c# 收到udp包后回包 c#oracle 头文件 c# 序列化对象 自定义 c# tcp 心跳 c# ice连接服务端 c# md5 解密 c# 文字导航控件
我们是很有底线的