VS2008安装后允许任何程序都报错fatal error LNK1104: cannot open file "?.exe" [问题点数:40分,结帖人cbzjzsb123]

Bbs4
本版专家分:1550
结帖率 98.97%
Bbs9
本版专家分:73203
Blank
红花 2012年10月 C/C++大版内专家分月排行榜第一
Blank
黄花 2014年2月 C/C++大版内专家分月排行榜第二
2013年4月 C/C++大版内专家分月排行榜第二
2013年3月 C/C++大版内专家分月排行榜第二
2012年12月 C/C++大版内专家分月排行榜第二
2012年11月 C/C++大版内专家分月排行榜第二
2012年8月 C/C++大版内专家分月排行榜第二
Blank
蓝花 2014年12月 C/C++大版内专家分月排行榜第三
2014年5月 C/C++大版内专家分月排行榜第三
2014年3月 C/C++大版内专家分月排行榜第三
2013年12月 C/C++大版内专家分月排行榜第三
2013年10月 C/C++大版内专家分月排行榜第三
2013年9月 C/C++大版内专家分月排行榜第三
2013年7月 C/C++大版内专家分月排行榜第三
2013年5月 C/C++大版内专家分月排行榜第三
2013年2月 C/C++大版内专家分月排行榜第三
2013年1月 C/C++大版内专家分月排行榜第三
2012年9月 C/C++大版内专家分月排行榜第三
Bbs4
本版专家分:1550
Bbs5
本版专家分:4586
版主
Bbs4
本版专家分:1550
Bbs4
本版专家分:1550
Bbs4
本版专家分:1550
Bbs5
本版专家分:4406
Bbs5
本版专家分:4586
版主
Bbs4
本版专家分:1550
Bbs12
本版专家分:378825
Blank
状元 2017年 总版技术专家分年内排行榜第一
Blank
榜眼 2014年 总版技术专家分年内排行榜第二
Blank
探花 2013年 总版技术专家分年内排行榜第三
Blank
进士 2018年总版新获得的技术专家分排名前十
2012年 总版技术专家分年内排行榜第七
Bbs12
本版专家分:378825
Blank
状元 2017年 总版技术专家分年内排行榜第一
Blank
榜眼 2014年 总版技术专家分年内排行榜第二
Blank
探花 2013年 总版技术专家分年内排行榜第三
Blank
进士 2018年总版新获得的技术专家分排名前十
2012年 总版技术专家分年内排行榜第七
Bbs6
本版专家分:5748
VS2012编译程序出现fatal error LNK1104: 无法打开文件“kernel32.lib”错误
我的是装了vs2105之后,vs2012就出现各种错误,先是打不开<em>程序</em>,后来在控制面板里面修复<em>程序</em>之后可以打开<em>程序</em>了,但是编译的时候又出现如题的错误,在网上搜了好久,大部分都是关于vs2013的,我来关于我的情况做个记录。n版本:vs2012n系统:win7n解决方法:先在c盘里面搜索kernel32.lib文档,搜到之后保存一下路径,我的路径是:C:\Program Files (x86)\Wi...
Advapi32.lib
保护<em>vs2008</em>还有winkit winsdk 32位与64位 <em>error</em> LNK1104: <em>cannot</em> <em>open</em> <em>file</em> 'advapi32.lib'
关于Windows中生成FFTW的lib文件时报LNK1104错误
1、错误如下图所示:rnrn2、原因分析:摸索半天,发现是Windows系统C盘权限较高所致。由于我把相关的def文件和dll文件(且叫源文件)放在了C盘,而<em>程序</em>lib.<em>exe</em>运行后生成的目标文件默认放在与源文件相同的目录,但是C盘又不<em>允许</em>随便写入文件,所以导致目标文件(libfftw3-3.lib)无法生成,因此出现了<em>error</em> LNK1104。rn3、解决办法:将源文件放到非C盘就行。我放到F
VS2012 配置fftw库遇到的一些问题及解决方法
我按照网上大牛们给的方法进行<em>安装</em>配置FFTW库时,我遇到过如下一些问题,总结于此:rn环境:VS 2012,rnWindows 64位 操作系统rn工具包:下载用着32位的fftwrnrnLINK : <em>fatal</em> <em>error</em> LNK1104: <em>cannot</em> <em>open</em> <em>file</em> 'libfftw3-3.lib'(CMD下)rnrn原因:rnc盘权限高,不能随便写文件。cmd下用命令直接在c:盘用li
mfc42ud.lib和mfc42ud.dll
LINK : <em>fatal</em> <em>error</em> LNK1104: <em>cannot</em> <em>open</em> <em>file</em> \"mfc42ud.lib\"缺少支持Unicode的文件;mfc42ud.lib和mfc42ud.dll 打包
uafxcwd.lib库文件
怎么VC6编译工程的时候老是提示: LINK : <em>fatal</em> <em>error</em> LNK1104: <em>cannot</em> <em>open</em> <em>file</em> "uafxcwd.lib" 用这个库就好了!!!
解决编译pycaffe时候出现缺少Python27_d.lib的解决方案
问题描述rnrn最近在使用caffe调用python接口进行可视化的时候,发现总是出现“no module named caffe”这个问题,经过查询,好像是没有编译pycaffe,然后返回caffe-master/windows找到Caffe.sln。然后找到rnrn对其右键重新生成(E),经过短暂的等待,出现了问题,rn问题描述:缺少Python27_d.lib。rn至于为啥是Python27
UAFXCWD.LIB
VC报如下错误:LINK : <em>fatal</em> <em>error</em> LNK1104: <em>cannot</em> <em>open</em> <em>file</em> "uafxcwd.lib" 将该文件放到源文件同级目录下即可。
MFC42UD.zip
解决LINK : <em>fatal</em> <em>error</em> LNK1104: <em>cannot</em> <em>open</em> <em>file</em> "mfc42ud.lib"把lib放到vc的mfc\lib下,dll放到windows\system32下。
vs2013 error LNK1104: 无法打开文件 ***.exe的错误
vs2013 出现<em>error</em> LNK1104: 无法打开文件 ***.<em>exe</em>的错误,查找原因:rnrn重新清理并生成解决方案,查看那个文件或者那个文件所在的文件夹是否打开或者改名字等等操作占用着这个文件.rn突然出现的原因基本是前一次调试未关闭导致的。
【OpenCV笔记 11】VS2013中运行OpenCV 3.0时常见错误及解决方法
常见案例、错误及解决方法:n案例一:IplImage格式转换成Mat格式  nn//使用Mat的构造函数:nMat::Mat(const IplImage* img, bool copyData=false);n默认情况下copyData为falsenIplImage* srcImg = cvLoadImage("Lena.jpg");n//注意:以下三种效果一致,均为浅拷贝nMa
MFC42UD.rar
LINK : <em>fatal</em> <em>error</em> LNK1104: <em>cannot</em> <em>open</em> <em>file</em> "mfc42ud.lib" 缺少支持Unicode的文件;MFC<em>安装</em>的时候,默认是不<em>安装</em>支持Unicode的相关文件
vs2010:LNK1104无法打开.exe文件错误
vs总是遇到莫名其妙的问题,表示让我哭会n问题:n本来<em>程序</em>运行好好的,再次编译运行出现问题,link阶段显示,无法打开.<em>exe</em>文件!!!n可能原因: 原因n 解决方案 <em>exe</em>文件不存在n 查看项目属性,查看生成文件位置(一般问题不大)n 操作占用n 灭掉重新运行(重新生成解决方案也不行滴)n对于网上说的这两种解决方案,始终没能解决我的问题。<em>程序</em>肯定被占用,但是在任务管理器中没有找到相应的
error LNK1104】【无法打开文件opencv_core345d.lib 解决思路】
问题描述:n本人使用的是visual studio 2017+<em>open</em>CV 3,在做计算机视觉研究的时候,跑的论文代码是从别的大佬那边下载到的,也算是比较早之前的代码,版本用的是<em>open</em>CV 2.4。因此在运行代码的时候,首先<em>报错</em>的就是无法打开文件<em>open</em>cv_core345d.lib。(我已经给项目配置好了<em>open</em>CV的包含目录和库目录和附加依赖项)n代码中库引用参考下图:nn问题在于<em>open</em>C...
高版本IDE编译VS2005工程 无法打开文件“mfc80d.lib”的问题
VS2005的工程在使用VS2012打开之后,编译出现问题。rn提示:rn错误 18 rn<em>error</em> LNK1104: 无法打开文件“mfc80d.lib”rn解决方法,直接忽略掉这个库和它相关的mfcs80d.lib库即可。rnrnrn配置属性->链接器->输入->忽略特定默认库 中添加 mfc80d.lib;mfcs80d.lib 重新编译即可
python27_d.lib
解决<em>fatal</em> <em>error</em> LNK1104: <em>cannot</em> <em>open</em> <em>file</em> 'python27_d.lib'问题 由源码编译过来的文献,版本python2.7,下载后放入到python目录下的Lib文件夹即可
安装mysqldb遇到c1083问题的解决办法
今天帮同事部署Monkey平台的测试环境,部署完成后执行分析日志的脚本时总是<em>报错</em>,后来发现是由于他的电脑上没有<em>安装</em>mysqldb。rn于是<em>安装</em>mysqldb,但是在build的过程中总是<em>报错</em>,<em>报错</em>信息如下:rn _mysql.c(34) : <em>fatal</em> <em>error</em> C1083: Cannot <em>open</em> include <em>file</em>: ‘config-win.h’: No such <em>file</em> or di
Qt5.9.0导入lib库出现LNK1104错误
Qt5.9.0中出现 LNK1104:无法打开文件“xxxx.lib”错误。n检查.pro文件中的lib导入路径都正确,但是怎么构建,都会出现上面的错误。nWindows系统中,建议导入lib库时,统一采用全路径的方式,这样避免出错:nLIBS += $$PWD/3rdparty/lib/dxflib.lib //$$PWD当前工程目录n// 或 nLIBS += D:Myproject/3r...
python37_d.lib文件
解决<em>fatal</em> <em>error</em> LNK1104: <em>cannot</em> <em>open</em> <em>file</em> 'python37_d.lib'问题 由源码编译过来的文献,版本python3.7,下载后放入到python目录下的Lib文件夹即可
关于CUDA报错fatal error LNK1104:无法打开文件 ".\Debug\XXX.obj"的解决方法
关于VS2017 CUDA10<em>报错</em>:<em>fatal</em> <em>error</em> LNK1104:无法打开文件 &quot;.\Debug\XXX.obj&quot;的解决方法n把“右键项目-&amp;gt;属性-&amp;gt;配置属性-&amp;gt;链接器-&amp;gt;输入”里面的附加依赖项替换成ncudart_static.lib;kernel32.lib;user32.lib;gdi32.lib;winspool.lib;comdlg32.lib;adva...
【笔记】C++独立MSVC编译配置(命令行+sublime)
前言rn计组实验需要用到内嵌汇编,但是mingw并不能跑这个东西,需要VS的编译器,即MSVC。rn在配置中碰到哪个文件找不到之类的问题,最好的方法是找你装VS的同学,从他们的VS目录里拷这个文件。rn实际上,只有不想装VS的人才需要这篇教程,否则直接装VS用就可以了。rn参考资料rnC语言编译器CL.<em>exe</em>rnGetDC functionrn原理简介rn类似于mingw的gcc.<em>exe</em>,msvc的编译<em>程序</em>叫做C...
MySQL-python-1.2.3.win-amd64-py2.7.exe
win7 64 <em>安装</em>mysql-python:_mysql.c(42) : <em>fatal</em> <em>error</em> C1083: Cannot <em>open</em> include <em>file</em>: 'config-win.h': No such <em>file</em> or directory
Windows下安装TA-Lib详细步骤及错误解决
介绍windows下,python2.7,python3.5,32位,64位<em>安装</em>TA-Lib的步骤和错误解决方法,附件包含源码、TA-Lib的python包,windows下的编译工具下载,编译方法等。 比如: talib\common.c(240) : <em>fatal</em> <em>error</em> C1083: Cannot <em>open</em> include <em>file</em>: 'ta_libc.h': No such <em>file</em> or directory<em>报错</em>的终极解决。
unistd.h 文件
用于解决<em>安装</em>出现的 <em>fatal</em> <em>error</em> C1083: Cannot <em>open</em> include <em>file</em>: 'unistd.h': No such <em>file</em> or directory 异常问题
CImage类打开和保存jpeg、bmp、gif和png格式图片
利用强大的CImage类打开和保存jpeg、bmp、gif和png格式图片,有VC下的Demo。
win7下安装ta-lib报错解决
在windows 7 x64下<em>安装</em>ta-lib包rnrnrnpython 2.7 x86,32位rnanaconda2 4.0.0-32位(Anaconda2-4.4.0-Windows-x86)rn如果Python,或者anaconda是3.5以上,64位,可以直接:conda install ta-lib或者pip install ta-lib即可。rnrnrn以下主要说明32位python安
vs运行时“LINK : fatal error LNK1104: 无法打开文件“opencv_calib3d300d.lib”无法启动程序...debug\abc.exe,系统找不到指定文件解决方案
在你的系统环境正确的前提下:nn为新建的项目添加<em>open</em>cv3.0运行所包含的文件nn(1)在你的解决方案资源管理器中,【你的项目名称(右键)】----&amp;gt;【属性】nn        点击VC++目录,在【包含目录中】添加如下文件路径: n         ……\<em>open</em>cv\build\include n         ……\<em>open</em>cv\build\include\<em>open</em>cv n   ...
VS编译时遇到LNK1104无法打开.exe解决方法
    今天在调试代码时莫名的遇到了无法打.<em>exe</em>文件的问题,上次调试的进程已经关闭,重启VS后还是这个问题。查询无果后,根据VS提示的路径找到这个.<em>exe</em>文件,尝试删除它,发现它被另一个不相关的进程占用,关闭这个进程后问题解决。...
单纯c++代码运行出错1104无法打开opencv_world320.lib问题
解决方案:nn打开项目的属性,在链接器-&amp;gt;常规中设置nnnn这个路径要填上,并且是完整的路径。nn填完就好了 nn附一个配置链接:https://blog.csdn.net/poem_qianmo/article/details/19809337...
UnicodeMFClib
出现LINK : <em>fatal</em> <em>error</em> LNK1104: <em>cannot</em> <em>open</em> <em>file</em> "mfc42ud.lib" 错误 修改Unicode出现如上述的问题,解决方法:https://blog.csdn.net/can_yi/article/details/7280289
user32.lib
<em>安装</em>vs2013 express版本后,新建一个工程,编译后提示错误:<em>fatal</em> <em>error</em> LNK1104: <em>cannot</em> <em>open</em> <em>file</em> 'user32.lib'。多方寻找,找到了一个user32.lib,供需要的同学下载使用。
opencv_calib3d244d.lib
<em>open</em>cv的<em>open</em>cv_calib3d244d.lib动态链接库文件
Directx dxguid.lib库
只要包含进VC6.0或VS的连接库即可。然后在工具-〉设置-〉连接选项卡上填入“dxguid.lib ddraw.lib"
VS2015尝试编译Caffe,缺失python27.lib,
caffe在GitHub上有很多的版本 n最先尝试的是https://github.com/BVLC/caffe.git n操作步骤参考https://blog.csdn.net/thomaszhaoyc/article/details/68489299nn<em>安装</em>了Anaconda3,因为我先装了py3.5听说前者自带3.6但好像并无大碍 n<em>安装</em>了ninja-1.8.2 n<em>安装</em>了cmake-3.12...
在cmd console中如何利用cl成功编译
接上篇继续说,在成功找到cl命令后,写了一个最简单的<em>程序</em>,可是无法编译成功,会出现以下三种错误:n <em>fatal</em> <em>error</em> C1034: iostream: no include path set n LINK: <em>fatal</em> <em>error</em> LNK1104: <em>cannot</em> <em>open</em> <em>file</em> ‘libcpmt.lib’ n LINK: <em>fatal</em> <em>error</em> LNK1104: <em>cannot</em> ope
msinttypes-r26.zip 下载
解决 python<em>安装</em>: 'stdint.h': No such <em>file</em> or directory <em>报错</em>信息: <em>fatal</em> <em>error</em> C1083: Cannot <em>open</em> in clude <em>file</em>: 'stdint.h': No such <em>file</em> or directory
fatal error C1083: 无法打开包括文件:“stdint.h”: No such file or directory
<em>fatal</em> <em>error</em> C1083: 无法打开包括文件:“stdint.h”: No such <em>file</em> or directory 【错误】<em>fatal</em> <em>error</em> C1083: 无法打开包括文件:“stdint.h”: No such <em>file</em> or directory 【原因】stdint.h是c99标准的头文件,vc不支持,所以肯定会提示“No such <em>file</em> or directory”的。 【解决方案】 1. 去http://download.csdn.net/download/liubing8609/10046490下载“inttypes.h+stdint.h”压缩文件。 2. 解压后把inttypes.h和stdint.h放到vc的include目录就可以了。我<em>安装</em>的是VS2008,<em>安装</em>到的默认位置,因此include的路径就是:C:\Program Files\Microsoft Visual Studio 9.0\VC\include 通过以上方法,成功解决编译错误
安装tesseract-ocr出错的解决策略
第一个错误:tesseract_ocr.cpp:507:34: <em>fatal</em> <em>error</em>: leptonica/allheaders.h: No such <em>file</em> or directoryrn    compilation terminated.rn解决办法:sudo apt install libleptonica-devrn第二个错误:tesseract_ocr.cpp:508:31: fat
五子棋代码
不知道怎么调试了,cpp(7) : <em>fatal</em> <em>error</em> C1083: Cannot <em>open</em> include <em>file</em>: 'stdbool.h': No such <em>file</em> or directory
openSSL在Win7下的编译与安装
一. 下载与<em>安装</em>rn1. 下载<em>open</em>ssl:rnhttp://www.<em>open</em>ssl.org/source/ 下载最新版本的<em>open</em>ssl-1.0.1c.tar.gz 。rn解压到C:\<em>open</em>ssl-1.0.1c,在<em>open</em>ssl-1.0.1c的目录下面,rn会看到有两个文件INSTALL.W32 和INSTALL.W64;rn他们分别是在32位和64位下的<em>安装</em>文档,rnrn2. 下载并<em>安装</em>
CCS v6.0修错集锦
1.”../main.c”, line 1: <em>fatal</em> <em>error</em> #1965: <em>cannot</em> <em>open</em> source <em>file</em> “DSP2833x_Device.h”nn n在导入工程的过程中,出现不能识别头文件,处理步骤如下: n n nnn
exception stdexcept streambuf 头文件
解决 <em>fatal</em> <em>error</em> C1083: Cannot <em>open</em> include <em>file</em>: 'streambuf': No such <em>file</em> or directory 问题
msinttypes--r26.zip
用于解决错误: <em>fatal</em> <em>error</em> C1083: Cannot <em>open</em> include <em>file</em>: 'stdint.h': No such <em>file</em> or directory
安装解压版本的MySQL,安装过程中的常见命令,检查windows系统错误日志的方式来检查MySQL启动错误,关于Fatal error: Can't open and lock privilege
以管理员方式进入cmd命令提示符启动mysql服务的方式: net start mysql 关闭mysql服务的方式: net stop mysql 快速进入服务管理界面 services.msc 进入mysql的方式: mysql -uroot -p密码 删除服务的方式1.进入服务管理界面进入:sc delete 比如删除mysql服务的方式:
exe"">链接器工具错误 LNK1104:无法打开".exe"
今天运行下载的一个<em>程序</em>,出现链接错误LNK1104:无法打开".<em>exe</em>",rn之前这种错误一般是正在运行<em>exe</em>文件,将<em>exe</em>文件关掉就可以了,今天这个不是,rndebug下就没有生成<em>exe</em>文件,后来查看msdn错误帮助:https://msdn.microsoft.com/query/dev14.query?appId=Dev14IDEF1&l=ZH-CN&k=k(LNK1104)&rd=true
编译OpenCV缺少python27_d.lib的解决方法
错误 24rn<em>error</em> LNK1104: 无法打开文件“python27_d.lib” rnC:\OpenCV\VS2013_64\modules\python\LINK <em>open</em>cv_pythonrnrnrn一个妥协的方法是注释掉会使用python27_d.lib部分的代码,替换为使用python27.librnrnrn具体做法如下:rn在OpenCV项目的bindings中的<em>open</em>cv_p
在Python安装MySQLdb模块遇见的问题
<em>安装</em>python2.7的MySQLdb模块时遇见如下问题: n[root@mycat-1 MySQL-python-1.2.3b1]# python setup.py build nrunning build nrunning build_py ncopying MySQLdb/release.py -> build/lib.linux-x86_64-2.7/MySQLdb nrunning bui
LINK1104:无法打开文件“OLDNAMES.LIB”
主开发环境已经切换到VS2010,为了验证成果在VS2005环境的兼容性,建立虚拟机,使用VS2005编译项目,竟然遭遇链接错误,如题。google一下,发现有人牢骚:What the hell is OLDNAMES.LIB,自然也有人([MSFT]组的Jeff Abraham)解答:Can you see if this helps you。摘要如下:This bug has been fix...
安装了g2o后,编译运行 运行 实例程序出现 No such file or directory
<em>安装</em>了g2o后,编译运行 运行 实例<em>程序</em>出现:/home/hong/slambook-master/slambook-master/ch6/g2o_curve_fitting/build/curve_fitting: <em>error</em> while loading shared libraries: libg2o_core.so: <em>cannot</em> <em>open</em> shared object <em>file</em>: No su...
安装pyhs2报错,装不上,添加装sasl依赖也不行
我的python在window平台,hive在服务器上,现在想用python操作hive数据,在Windows平台<em>安装</em>pyhs2,就是装不上,怎么弄?rn>pip install pyhs2rnRequirement already satisfied: pyhs2 in d:\program <em>file</em>s\python\lib\site-packages\pyhs2-0.6.0-py2.7.egg
mfc+opengl离散点绘制曲面
根据不规则离散点,绘制曲面,比较傻瓜的差值方法,追求无限圆滑的曲面请绕行。
fatal error LNK1104: cannot open file 'gdiplus.lib'
rn 我用的软件是 VS2005 里面 Other Languages\Visual C++\Smart Device\MFC Smart Device Application 写移动设备上的AP。rn 现在想用GDI+绘图,但是似乎没有'gdiplus.lib'。rnrn 有哪位高手知道哪里可以下载'gdiplus.lib',或者移动设备AP里怎么用GDI+绘图?谢谢!!!rn
在Python2.7下如何安装TA-lib库
最近在做一个关于股票预测大模型,由于想要用Talib库中的方法,来提取各种金融技术指标,所以就下了这个库。但整个过程可谓是一波三折。花费了大半天才搞定这件事。n下面来给大家分享一下<em>安装</em>的步骤,省的大家再往这个坑里跳。。。n环境介绍:Python2.7+Win10n<em>安装</em>步骤:n1.执行pip install TA-Libn如果以前没有<em>安装</em>过vc,或者编译工具没在path下面,应该会遇到这个
python打包成exe,但执行exe报错,求解。
1、pycharm     pycharm-professional-2018.1.4.<em>exe</em>    已<em>安装</em> 64位的。2、python       python-3.7.0.<em>exe</em>   已<em>安装</em>32位的。3、随便写了一个小<em>程序</em>,RUN没有问题,代码如下:#!/usr/bin/python# -*- coding: utf-8 -*-for i in range(1,5):    for j in ...
VS2017中出现致命错误 RC1015: 无法打开包含文件 'afxres.h' 问题
解决VS 中 出现致命错误 RC1015: 无法打开包含文件 'afxres.h' 问题
缺少sasl.h
sudo apt-get install libsasl2-dev
fatal error LNK1104: cannot open file "*.obj"
<em>fatal</em> <em>error</em> LNK1104: <em>cannot</em> <em>open</em> <em>file</em> "*.obj"rn这个错误怎么解决啊?是什么问题啊?
fatal error LNK1104: cannot open file '.obj'
编译时提示这个错误,是怎么回事?
如何解决win10+VS2017+WDK环境下编译C++程序提示error LNK1104无法打开文件*.lib的问题
昨天在电脑上<em>安装</em>了VS2017+WDK了之后,遇到了一个很匪夷所思的问题:不管是编译<em>任何</em>工程,包括之前所有完全正常的项目,都会提示一个类似的错误:rn1&amp;amp;amp;amp;gt;------ 已启动生成: 项目: MyUSBEnum, 配置: Debug x64 ------rn1&amp;amp;amp;amp;gt;C:\Program Files (x86)\Microsoft Visual Studio\2017\Community\Comm...
lxml安装遇到的问题
今天需要在自己的电脑上<em>安装</em>Python。这倒好说,驾轻就熟,很快就<em>安装</em>完成,并且将Python加到了环境路径中。但是在运行<em>程序</em>的时候发现好多一些package没有,这显然是因为我的Python中没有<em>安装</em>这些包导致的。于是就<em>安装</em>pip,这个也很快就下载并<em>安装</em>成功,但是执行pip的时候竟然说 这不是一个内部命令,奇怪,我之前在公司的电脑里也<em>安装</em>过,并没有遇到这个问题呀。于是上网找资料,原来是这个pip
fatal error LNK1104: cannot open file "TEMPFILE"
出现以下错误是什么原因?rnrnLinking...rnLINK : <em>fatal</em> <em>error</em> LNK1104: <em>cannot</em> <em>open</em> <em>file</em> "TEMPFILE"rnError <em>exe</em>cuting link.<em>exe</em>.
visualstudio2010编译中遇到的bug之fatal error LNK1104无法打开文件
2>C:\Program Files (x86)\MSBuild\Microsoft.Cpp\v4.0\Microsoft.CppBuild.targets(990,5): warning MSB8012: TargetPath(E:\3.5\Server\MainDll\..\bin\MainDll.dll) 与 Linker 的 OutputFile 属性值(E:\3.5\bin\server
解决无法打开包含文件 “jni.h"
rnLINK : <em>fatal</em> <em>error</em> LNK1104: 无法打开文件“libcpmt.lib”rn需要将vc\lib添加到LIB路径下,若要生成32位dll,则添加vc\lib\amd64rn<em>fatal</em> <em>error</em> C1083: 无法打开包括文件:“jni.h”: No such <em>file</em> or directoryrn这里根据第三个网址解决的,将jni.h 和 jni_md.h 拷贝到vc
fatal error LNK1104: cannot open file "libeng.lib"
VC++与MATLAB混合编程遇到问题:<em>fatal</em> <em>error</em> LNK1104: <em>cannot</em> <em>open</em> <em>file</em> "libeng.lib"
fatal error LNK1104: cannot open file "cxcore.lib"
Linking...rnLINK : <em>fatal</em> <em>error</em> LNK1104: <em>cannot</em> <em>open</em> <em>file</em> "cxcore.lib"rnError <em>exe</em>cuting link.<em>exe</em>.rn如题,这个怎么解决,网上差了好多方法都解决不了。
fatal error LNK1104: cannot open file "mfcs42u.lib"
<em>fatal</em> <em>error</em> LNK1104: <em>cannot</em> <em>open</em> <em>file</em> "mfcs42u.lib"rnrnrn是这样的,我生成了一个工程,在设置的时候,改为_UNICODE,UNICODE,这样的话,就出现这样的问题。rn
解决报错LINK : fatal error LNK1000补丁
解决<em>报错</em>LINK : <em>fatal</em> <em>error</em> LNK1000补丁 返回错误:LINK : <em>fatal</em> <em>error</em> LNK1000: Internal <em>error</em> during IncrBuildImage
错误 5 error LNK1104: 无法打开文件“D3dx9.lib”
将 DirectX SDK 中的D3dx9.lib文件复制到VS目录的VC文件夹下的lib文件夹中,或者在右键单击项目 -&amp;gt; 属性 -&amp;gt;  VC++目录,修改“包目录”和“库目录”
解决VS2015安装后stdio.h ucrtd.lib等文件无法识别问题,即include+lib环境变量配置
今天突然想在windows上装个 VS2015 玩玩,结果遇到了如下bug:rnrn<em>安装</em>完 VS2015 后,直接新建项目->win32控制台->运行,结果<em>报错</em>!rnrn"无法打开包括文件: “stdio.h”: No such <em>file</em> or directory”rnrn"<em>lnk1104</em>:无法打开文件rn ucrtd.lib ”rnrn奇了怪了,stdio.h 和 ucrtd.lib 都是 VS
VS2017出现LNK1104 无法打开文件gdi32.lib问题解决方法
今天重装了一遍VS,出现了问题“LNK1104 无法打开文件gdi32.lib”,自己尝试着修复了一下。rnrnrnrn注:本人用的编译工具版本是“Visual Studio Community 2017 15.5.3”rnrnrnrnrnrnrnrnrnrnrn解决方法如下:rn(1)在C盘下搜索gdi32.lib或者kernel32.lib,然后打开文件位置找到相应路径。(切记,红色标记部分一
包含Irvine32.inc报错的问题
注:目前开通个人网站朝思录,之后的博文将在上面更新,CSDN博客会滞后一点nnnn之前学汇编使用了作者提供的Irvine32库,但总是<em>报错</em>如下:nn1>c:\Irvine\SmallWin.inc(11): <em>error</em> A2071: initializer magnitude too large for specified sizen1>c:\Irvine\SmallWin.inc(11): wa
opencv:link1104错误的解决办法
我在练习<em>程序</em>的时候遇到了这个问题,一直无法解决,最后发现这个问题是<em>程序</em>重复运行导致无法连接,并不是你<em>程序</em>写的有问题。这个问题一般发生在调试<em>程序</em>期间,因为我们会不断的重复编译运行,所以导致某个<em>exe</em>文件重运行的可能性大幅增加。 n解决方法其实很简单,如果你知道是哪个<em>exe</em>重复运行那么打开任务管理器,找到这个<em>exe</em>关闭就行了。如果不知道那么就直接重启vs或者重启电脑。
Intel MKL FATAL ERROR: Cannot load mkl_intel_thread.dll 问题处理
加载sklearn库有可能遇到Intel MKL FATAL ERROR: Cannot load mkl_intel_thread.dll 问题,解决卸载掉numpy,scipy,sklearn三个库重新<em>安装</em>,资源的版本为py35,cpu,64位,全程分别为numpy-1.15.4+mkl-cp35-cp35m-win_amd64.whl;scipy-1.2.0-cp35-cp35m-win_amd64.whl;scikit_learn-0.20.2-cp35-cp35m-win_amd64.whl;注意<em>安装</em>时顺序和我列出出名称的顺序一样;<em>安装</em>可直接用pip install *****
error: lnk1104 无法打开文件(工程生成文件)
错误信息如下:nnnn<em>exe</em>为本工程生成文件,出现这种<em>报错</em>:nn1. 检查<em>exe</em>是否被占用nn2. 此生成路径无法找到,可以将生成目录在资源管理器中试着打开,对于截图中的路径是打不开的,因为相对路径“...\...\bin\”给错了,上级目录是两个点而非三个点 ...
mfc42u库(Unicode用)
VC运行时出现LINK: <em>fatal</em> <em>error</em> LNK1104: <em>cannot</em> <em>open</em> <em>file</em> "mfc42u.lib"错误,说明你的VC没有<em>安装</em> Unicode版本,这时可以将文件加到VC对应目录下,就可以运行通过了。
Python安装MySQL安装包 64位 py2.7 [exe文件]
Python<em>安装</em>MySQL文件,EXE文件 MySQL-python-1.2.3.win-amd64-py2.7.<em>exe</em> 在使用pip install mysql总会<em>报错</em>: _mysql.c(42) : <em>fatal</em> <em>error</em> C1083: Cannot <em>open</em> include <em>file</em>: 'config-win.h': No such <em>file</em> or directory 原来还是驱动问题,不管mysql的事。 希望该<em>安装</em>包对你有所帮助~
MFC42UD系列库文件
vc6.0运行一个mfc的例子,却有如下错误, LINK : <em>fatal</em> <em>error</em> LNK1104: <em>cannot</em> <em>open</em> <em>file</em> "mfc42ud.lib" 第一次遇到这种问题,经过本人不断探索发现该<em>程序</em>支持unicode原故, 附解决方法及所有库文件
无法打开mfc120.lib
今天在用VS2013编译OSG的时候<em>报错</em>:无法打开mfc120.lib。仔细查了下资料。n我是这么解决的:n<em>安装</em>Multibyte MFC Library for Visual Studio 2013。下载地址。
USB头文件devioctl.h
包含USB开发需要的头文件devioctl.h cyioctl.h(21) : <em>fatal</em> <em>error</em> C1083: Cannot <em>open</em> include <em>file</em>: 'devioctl.h': No such <em>file</em> or directory
IAR 新版本打开老版本遇到的问题和解决方法 __nounwind和cannot open source file "core_cm3.h"
1.__nounwindnndeclaration is incompatible with &quot;__nounwind __interwork __softfp unsigned int __iar_builtin_STREXB(unsigned char, unsigned char volatile *)nn解决方法:右击工程进入options-&amp;gt;C/C++Compiler-&amp;gt;Pre...
error LNK1104: 无法打开文件 ***.exe的错误
刚刚还好好的,怎么突然就出现这样的错误,rnrn后来分析原因,rnrn第一:查看那个<em>exe</em>文件是否存在,rnrn第二:查看那个文件或者那个文件所在的文件夹是否打开或者改名字等等操作占用着这个文件.   rnrn或者:虽然<em>exe</em>看不到了,但是<em>exe</em>所在目录内,通过shift+右键---开启的cmd 窗口还在开着。rnrn第三:重新清理并生成解决方案rn第二条可能性最大.
PCL制作map遇到的问题
之前<em>安装</em>ros的时候选择了全部<em>安装</em>,所以PCL实际上已经<em>安装</em>了。网上也有很多关于PCL<em>安装</em>的教程nn<em>fatal</em> <em>error</em>: vtksmartpointer.h: no such <em>file</em> or directorynn我使用的是VS code,有时通过include并不能找到特殊位置的头文件。首先我们可以在命令行中使用locate <em>file</em>name 查询文件的位置,然后跳转到这个目录。之后VSco...
error LNK1104: 无法打开文件“***.lib“
以LNK开头的错误号意即错误发生在链接阶段。可能的解决方法如下:附加库目录缺少对应库的路径;附加依赖项缺少对应库;库文件本身有错误这样的错误。
exe">LINK : fatal error LNK1104: cannot open file "Release/*.exe
如题,vc编译生成release版本,总是<em>报错</em>:rnLINK : <em>fatal</em> <em>error</em> LNK1104: <em>cannot</em> <em>open</em> <em>file</em> "Release/*.<em>exe</em>rnrn删除release文件夹也不能删除,提示访问被拒绝。rnrn是什么问题?
exe"">LINK : fatal error LNK1104: cannot open file "Debug/工程.exe"
为什麽出现这种错误呀?rn
python26_d.lib Win7下,使用VS2008安装配置opencv2.0
Win7下,使用VS2008<em>安装</em>配置<em>open</em>cv2.0,编译错误提示:错误 105 <em>fatal</em> <em>error</em> LNK1104: 无法打开文件“python26_d.lib”
exe"">LINK : fatal error LNK1104: cannot open file "?.exe"
今天<em>安装</em>了Microsoft Platform SDK for Windows Server 2003 R2,然后VC2005就离奇地编译不出<em>任何</em>工程了,哪怕是刚新建就马上编译的普通对话框工程。编译<em>任何</em>工程都是这样的错:rnrn1>正在编译...rn1>Command line warning D4002 : ignoring unknown option '/<em>error</em>Report:prompt'rn1>Command line warning D4024 : unrecognized source <em>file</em> type '?', object <em>file</em> assumedrn1>LINK : <em>fatal</em> <em>error</em> LNK1104: <em>cannot</em> <em>open</em> <em>file</em> "?.<em>exe</em>"rnrn已经卸载了又重新装过VS2005了,也重新打过补丁了,但还是这样。请问为什么会这样呢?谢谢!
强连通分量及缩点tarjan算法解析
强连通分量: 简言之 就是找环(每条边只走一次,两两可达) 孤立的一个点也是一个连通分量   使用tarjan算法 在嵌套的多个环中优先得到最大环( 最小环就是每个孤立点)   定义: int Time, DFN[N], Low[N]; DFN[i]表示 遍历到 i 点时是第几次dfs Low[u] 表示 以u点为父节点的 子树 能连接到 [栈中] 最上端的点   int
vc2008动态链接库使用(视频) 显式导入dll下载
vc2008动态链接库使用(视频) 显式导入dll vc2008动态链接库使用(视频) 显式导入dll 相关下载链接:[url=//download.csdn.net/download/maozhiwei11223344/2466737?utm_source=bbsseo]//download.csdn.net/download/maozhiwei11223344/2466737?utm_source=bbsseo[/url]
毕业论文答辩PPT幻灯片及完美技巧.下载
毕业论文答辩PPT幻灯片及完美技巧. 毕业论文答辩PPT幻灯片及完美技 相关下载链接:[url=//download.csdn.net/download/letianwu/2670658?utm_source=bbsseo]//download.csdn.net/download/letianwu/2670658?utm_source=bbsseo[/url]
2010三级网络技术上机南开100题题库word版下载
三级网络技术2010三级网络技术上机南开100题题库word版 相关下载链接:[url=//download.csdn.net/download/ninanaliqian/2704709?utm_source=bbsseo]//download.csdn.net/download/ninanaliqian/2704709?utm_source=bbsseo[/url]
文章热词 机器学习教程 Objective-C培训 交互设计视频教程 颜色模型 设计制作学习
相关热词 mysql关联查询两次本表 native底部 react extjs glyph 图标 file学习 java java的file学习
我们是很有底线的