请问出现"Compilation Error "错误是什么原因? [问题点数:40分,结帖人wggfcusmq]

一键查看最优答案

确认一键查看最优答案?
本功能为VIP专享,开通VIP获取答案速率将提升10倍哦!
Bbs3
本版专家分:931
结帖率 97.46%
Bbs12
本版专家分:415957
版主
Blank
签到新秀 累计签到获取,不积跬步,无以至千里,继续坚持!
Blank
名人 2014年 荣获名人称号
2013年 荣获名人称号
2012年 荣获名人称号
Blank
状元 2013年 总版技术专家分年内排行榜第一
Blank
探花 2014年 总版技术专家分年内排行榜第三
Bbs3
本版专家分:931
Compilation Error
<em>错误</em> 方案一: 如果是在开发状态下编译<em>出现</em><em>Compilation</em> <em>Error</em>的话 (1)清理解决方案 Clean the solution (2)根据所报的<em>错误</em>提示,查找对应的页面划控件是否有重名控件的情况<em>出现</em>,如果有,请将其中一个控件重新命名 (3)关掉IIS服务后重新启动,再对solution重新编译 方案二: 主要是因为C:\Windows\Temp 没有写入的权限...
严重: Compilation error 解决方案
报错: 解决方案: 1、选中当前项目右击,点击properites; 2、修改Java Build PathLibraries 3、
关于Maven项目build时出现No compiler is provided in this environment的处理
近日有同事遇到在编译Maven项目时<em>出现</em> [ERROR] No compiler is provided in this environment. Perhaps you are running on a JRE rather than a JDK? 的问题, 原以为这是个个例, 源于同事粗心, 配置环境出问题造成, 后到百度查看一下, 遇到这个问题的不在少数, 但是对问题的解释没有说到根源,
遇到Compilation Error问题,点开后是这样的?表示看不懂
p.c: In function 'main': p.c:6:17: error: expected expression before '/' token scanf("%d",&n);//T=8
Compilation Error 解决方案汇集
次遇见<em>Compilation</em> <em>Error</em> ,这次可就有办法对付了. 当然,这也算是一个BUG啦来源:http://www.dezai.cn/Blog/article.asp?id=386方案一:如果是在开发状态下编译<em>出现</em><em>Compilation</em> <em>Error</em>的话(1)清理解决方案 Clean the solution(2)根据所报的<em>错误</em>提示,查找对应的页面划
idea 版本报错:Error:java: Compilation failed: internal java compiler error 解决办法
报错信息: 报错<em>原因</em>: 项目中Java版本不一致,可以查看项目中的jdk配置 1、查看项目的jdk(Ctrl+Alt+shift+S) File -&amp;gt;Project Structure-&amp;gt;Project Settings -&amp;gt;Project 2、查看工程的jdk(Ctrl+Alt+shift+S) File -&amp;gt;Project Structure-&amp;gt;Project S...
eclipse中项目运行时报错之 Compilation error解决方法
<em>Compilation</em> error<em>错误</em>的<em>原因</em>所在及解决方法
杭电 1018 ,测试数据正确,为什么老是compilation error,求大牛给看看
In many applications very large integers numbers are required. Some of these applications are using
Problem F-1005
概述:主人公有很多零钱,现在需要买一本书,书的价格已经给出,而需要用手中的零钱凑出可以买这本书的钱,钱必须是正好凑出,然后输出能凑出钱的硬币的最大值和最小值。 思路:求硬币的最小值只需要使用贪心算法处理即可,每次对书的金额进行整除处理,最后相加。求最大值的方式是将现有的硬币的总额减去书所需要的钱,然后计算得出的金额需要花费多少硬币,也就是将计算最小值的方式重复即可,最后用硬币的总数减去上一步得出
Compilation Error 网站编译错误
.Net 4.0 网站挂到外网服务器报错 求解决办法 谢谢了。 Server <em>Error</em> in '/' Application. -----------------------------------
获得编译错误信息失败!求解决方法~
求各位大神看一看我的代码,我在刷题网站提交老是不成功,总显示Getting complication error information failed! #include #inc
Maven Package Compilation Error错误问题解决方
问题描述:搭建 maven工程后,用clean tomcat7:run 启动工程报:No compiler is provided in this environment,Perhaps you are running on a JRE rather a JDK? (工程冒叉请忽略,是由于解决后未更新Maven工程照成的) 问题<em>原因</em>:安装jdk1.7时的时候未按默认位置安装。
maven打包异常!COMPILATION ERROR
maven打包<em>错误</em>!COMPILATION ERROR<em>错误</em>代码:[INFO] [INFO] ———————————— [INFO] Building control-bus-ice 1.2.0-SNAPSHOT [INFO] ———————————— [INFO] [INFO] — maven-resources-plugin:2.4.3:resources (default-resour
Compilation failure Error 程序包xxx不存在,Error 找不到符号
<em>Compilation</em> failure <em>Error</em> 程序包xxx不存在,<em>Error</em> 找不到符号 在Java工程里好几次遇到了这个<em>错误</em>,每次都不记得上一次是怎么解决的,导致都要花费很长时间去处理,另一方面也是对java学习理解和使用的不够熟练。 现在将此问题记录下来...
Error:java: Compilation failed: internal java compiler error 解决办法
https://blog.csdn.net/jdjdndhj/article/details/70256989报错信息: 报错<em>原因</em>: 项目中Java版本不一致,可以查看项目中的jdk配置 1、查看项目的jdk(Ctrl+Alt+shift+S) File -&amp;gt;Project Structure-&amp;gt;Project Settings -&amp;gt;Project 2、查看工程的jdk(Ctrl...
Error:java: Compilation failed: internal java compiler error
set中java complier 设置的问题 ,项目中有人用jdk1.6 有人用jdk1.7 版本不一样 会一起这个<em>错误</em>
IntelliJ IDEA遇到编译失败Compilation failed:internal java compiler error的解决办法
IntelliJ IDEA提示编译失败如下: 解决办法: 1、项目名称处右击,点击&quot;Open Moudle Settings&quot;. 2、点击左边列表“Project”,右边Project SDK选择1.8,Project language level选择“8 - Lambda, type annotations etc.&quot; 3、点击左边列表“Moudles,右边Source下的Language l...
Jenkins构建maven项目失败报错:
ERROR: Failed to parse POMs hudson.util.IOException2: Failed to access https://cds.sun.com/is-bin/INTERSHOP.enfinity/WFS/CDS-CDS_Developer-Site/en_US/-/USD/ViewProductDetail-Start?ProductRef=C:\Jdk1.7 at hudson.tools.JDKInstaller.locateStage1(JDKInstaller.java:352) at hudson.tools.JDKInstaller.locate(JDKInstaller.java:298) at hudson.tools.JDKInstaller.performInstallation(JDKInstaller.java:121) at hudson.tools.InstallerTranslator.getToolHome(InstallerTranslator.java:61) at hudson.tools.ToolLocationNodeProperty.getToolHome(ToolLocationNodeProperty.java:106) at hudson.tools.ToolInstallation.translateFor(ToolInstallation.java:149) at hudson.model.JDK.forNode(JDK.java:111) at hudson.model.AbstractBuild.getEnvironment(AbstractBuild.java:745) at hudson.maven.MavenModuleSetBuild.getEnvironment(MavenModuleSetBuild.java:157) at hudson.maven.MavenModuleSetBuild$RunnerImpl.doRun(MavenModuleSetBuild.java:573) at hudson.model.AbstractBuild$AbstractRunner.run(AbstractBuild.java:423) at hudson.model.Run.run(Run.java:1362) at hudson.maven.MavenModuleSetBuild.run(MavenModuleSetBuild.java:467) at hudson.model.ResourceController.execute(ResourceController.java:88) at hudson.model.Executor.run(Executor.java:145) Caused by: java.net.UnknownHostException: cds.sun.com at sun.reflect.NativeConstructorAccessorImpl.newInstance0(Native Method) at sun.reflect.NativeConstructorAccessorImpl.newInstance(NativeConstructorAccessorImpl.java:57) at sun.reflect.DelegatingConstructorAccessorImpl.newInstance(DelegatingConstructorAccessorImpl.java:45) at java.lang.reflect.Constructor.newInstance(Constructor.java:526) at sun.net.www.protocol.http.HttpURLConnection$6.run(HttpURLConnection.java:1676) at sun.net.www.protocol.http.HttpURLConnection$6.run(HttpURLConnection.java:1674) at java.security.AccessController.doPrivileged(Native Method) at sun.net.www.protocol.http.HttpURLConnection.getChainedException(HttpURLConnection.java:1672) at sun.net.www.protocol.http.HttpURLConnection.getInputStream(HttpURLConnection.java:1245) at sun.net.www.protocol.https.HttpsURLConnectionImpl.getInputStream(HttpsURLConnectionImpl.java:254) at hudson.tools.JDKInstaller.locateStage1(JDKInstaller.java:340) ... 14 more Caused by: java.net.UnknownHostException: cds.sun.com at java.net.AbstractPlainSocketImpl.connect(AbstractPlainSocketImpl.java:178) at java.net.PlainSocketImpl.connect(PlainSocketImpl.java:172) at java.net.SocksSocketImpl.connect(SocksSocketImpl.java:392) at java.net.Socket.connect(Socket.java:579) at sun.security.ssl.SSLSocketImpl.connect(SSLSocketImpl.java:625) at sun.security.ssl.BaseSSLSocketImpl.connect(BaseSSLSocketImpl.java:160) at sun.net.NetworkClient.doConnect(NetworkClient.java:180) at sun.net.www.http.HttpClient.openServer(HttpClient.java:432) at sun.net.www.http.HttpClient.openServer(HttpClient.java:527) at sun.net.www.protocol.https.HttpsClient.(HttpsClient.java:275) at sun.net.www.protocol.https.HttpsClient.New(HttpsClient.java:371) at sun.net.www.protocol.https.AbstractDelegateHttpsURLConnection.getNewHttpClient(AbstractDelegateHttpsURLConnection.java:191) at sun.net.www.protocol.http.HttpURLConnection.plainConnect(HttpURLConnection.java:933) at sun.net.www.protocol.https.AbstractDelegateHttpsURLConnection.connect(AbstractDelegateHttpsURLConnection.java:177) at sun.net.www.protocol.http.HttpURLConnection.getInputStream(HttpURLConnection.java:1301) at sun.net.www.protocol.http.HttpURLConnection.getHeaderField(HttpURLConnection.java:2691) at sun.net.www.protocol.https.HttpsURLConnectionImpl.getHeaderField(HttpsURLConnectionImpl.java:291) at hudson.tools.JDKInstaller.locateStage1(JDKInstaller.java:334) ... 14 more Finished: FAILURE 好像是连不上cds.sun.com的<em>原因</em>, 不理解怎么改
Jenkins报错问题
Jenkins主机在虚拟机上,该节点在Windows上,节点环境都配好了,怀疑是环境变量的问题,请大神们指教
Compilation Error 解决方案汇集
为什么80%的码农都做不了架构师?&gt;&gt;&gt; ...
IDEA Error:java: Compilation failed: internal java comp
jdk版本不一致
Maven 异常 [ERROR] COMPILATION ERROR
    转载:http://blog.csdn.net/leo115/article/details/8187451 Maven工程打包时<em>出现</em> [INFO] <em>Compilation</em> failure; [ERROR] COMPILATION ERROR  问题解决办法 [INFO] Scanning for projects...   [INFO] ---------------...
springboot入门项目打包出错
执行clean package时候报错项目正常运行 [INFO] --- maven-clean-plugin:2.6.1:clean (default-clean) @ demo-test --- [INFO] Deleting E:\EclipseMars\e3-manager\demo-test\target [INFO] [INFO] --- maven-resources-plugin:2.6:resources (default-resources) @ demo-test --- [INFO] Using 'UTF-8' encoding to copy filtered resources. [INFO] Copying 1 resource [INFO] Copying 0 resource [INFO] [INFO] --- maven-compiler-plugin:3.1:compile (default-compile) @ demo-test --- [INFO] Changes detected - recompiling the module! [INFO] Compiling 2 source files to E:\EclipseMars\e3-manager\demo-test\target\classes [INFO] ------------------------------------------------------------- [ERROR] COMPILATION ERROR : [INFO] ------------------------------------------------------------- [ERROR] No compiler is provided in this environment. Perhaps you are running on a JRE rather than a JDK? [INFO] 1 error [INFO] ------------------------------------------------------------- [INFO] ------------------------------------------------------------------------ [INFO] BUILD FAILURE [INFO] ------------------------------------------------------------------------ [INFO] Total time: 16.689 s [INFO] Finished at: 2018-06-30T16:12:47+08:00 [INFO] Final Memory: 20M/112M [INFO] ------------------------------------------------------------------------ [WARNING] The requested profile "pom.xml" could not be activated because it does not exist. [ERROR] Failed to execute goal org.apache.maven.plugins:maven-compiler-plugin:3.1:compile (default-compile) on project demo-test: <em>Compilation</em> failure [ERROR] No compiler is provided in this environment. Perhaps you are running on a JRE rather than a JDK? [ERROR] -> [Help 1] [ERROR] [ERROR] To see the full stack trace of the errors, re-run Maven with the -e switch. [ERROR] Re-run Maven using the -X switch to enable full debug logging. [ERROR] [ERROR] For more information about the errors and possible solutions, please read the following articles: [ERROR] [Help 1] http://cwiki.apache.org/confluence/display/MAVEN/MojoFailureException 百度上说的jre我都试过了,我用的是jdk而且是1.8. Failed to execute goal org.apache.maven.plugins:maven-compiler-plugin:3.1:compile (default-compile) on project demo-test: <em>Compilation</em> failure说找不到3.1 但是我配置这个jar包换个版本却还是报错找不到3.1这个版本。
C#中MVC开发错误,类型异常
“AutoMapper.AutoMapperMappingException”类型的异常在AutoMapper.dll 中发生,但未在用户代码中进行处理”,也可以叫“Missingtype map configuration or unsupported mapping”,反正就是类型不匹配。 ViewModle中都是业务领域的数据,不应该放外键了,放了外键就等于引入另一个类型,所以最后类型都混了。
compilation error 编译错误
No compiler is provided in this environment. perhaps you are running on jre rather a jdk ? cmd可以运行ja
严重: Compilation error org.eclipse.jdt.internal.compiler.classfmt.ClassFormatException
在用maven整合ssh练习时遇到这个异常,内容为:  <em>Compilation</em> error org.eclipse.jdt.internal.compiler.classfmt.ClassFormatException     at org.eclipse.jdt.internal.compiler.classfmt.ClassFileReader.(ClassFileReader.java
IntelliJ IDEA 编译报错:Error:java: Compilation failed: internal java compiler error
IntelliJ IDEA使用教程 (总目录篇) 报错内容: Information:Using javac 1.8.0_73 to compile java sources Information:java: javacTask: 源发行版 1.8 需要目标发行版 1.8 Information:java: <em>Error</em>s occurred while compiling module 'EZS...
IDEA 错误Error:java: Compilation failed: internal java compiler error
IDEA 执行程序时报<em>错误</em> Information:java: javacTask: 源发行版 1.8 需要目标发行版 1.8 Information:java: <em>Error</em>s occurred while compiling module 'ZKClientDemo' Information:javac 1.8.0_161 was used to compile java sources In...
Maven工程打包时出现 [INFO] Compilation failure 问题解决办法
[INFO] Scanning for projects... [INFO] ------------------------------------------------------------------------ [INFO] Building brandCtr Maven Webapp [INFO] task-segment: [package] [INFO] ---------
maven install 时报 COMPILATION ERROR 软件包不存在
[ERROR] COMPILATION ERROR : [INFO] ------------------------------------------------------------- [ERROR] \******\TEST.java:[15,29] 软件包 org.jboss.ws.tools.ant 不存在 [INFO] 2 errors [INFO] ---------...
我在服务器的IIS上浏览网页时,出现这样的错误Compilation Error
我在服务器的IIS上浏览网页时,<em>出现</em><em>错误</em><em>Compilation</em> <em>Error</em>,但是我的服务器上的文件都是编译好了再上传上去的啊,怎么会<em>出现</em>这样的<em>错误</em>呢,请各位高手指点一下,本人现在很急,在线等~~~~~
Compilation failure:错误: 找不到符号
Maven项目编译的时候<em>出现</em>编译<em>错误</em>,某个java类找不到,如下所示: [exec] [ERROR] Failed to execute goal org.apache.maven.plugins:maven-compiler-plugin:2.3.2:compile (default-compile) on project zjlh-amdpds-server: <em>Compilation</em> fa...
Maven项目导入myeclipse2014中出现错误
我的一个Maven项目导入我的开发工具不行,pom.xml文件老是有个红色×号,我也不知道哪里错了,我也不知道要从何说起,求各位大神帮我看看,我改了好久都弄不了,好伤心呐!会<em>出现</em>以下<em>错误</em> Scanni
Compile Error出现原因
1.提交时所用的语言不对,比如c++的程序用c交了(c写的程序用c++提交可以过); 2.程序连编译都不能过,有各种<em>错误</em>。
1007
题目编号:1007 题目大意:给N节绳子,需要分成K段,给定N节绳子每节的长度,求能分得K段最长是多少。 解题思路:这个不是很难,典型的二分查找。首先建立数组存储绳子长度,然后二分开始查找,建立一个判断函数,如果在当前mid条件下,能够达到K条则输出,不能达到继续二                    分循环查找下去。 解题感想:一直Getting complication error i
maven编译问题, 着了魔一样的Compilation failure
被这个问题困扰好几天了, 目前已经处于崩溃状态, 实在是没有办法了,有人能解决这个问题吗, 我真的跪谢了. 环境变量 JAVA_HOME:D:\Program Files\Java\jdk1.7.0_79 ------------------------------------------------------ pom.xml插件配置如下: ...... 1.7 ...... org.apache.maven.plugins maven-compiler-plugin 2.5.1 ${jdk.version} ${jdk.version} true ---------------------------------------------- 报错信息如下: org.apache.maven.lifecycle.LifecycleExecutionException: Failed to execute goal org.apache.maven.plugins:maven-compiler-plugin:2.5.1:compile (default-compile) on project scorpius: <em>Compilation</em> failure at org.apache.maven.lifecycle.internal.MojoExecutor.execute(MojoExecutor.java:212) at org.apache.maven.lifecycle.internal.MojoExecutor.execute(MojoExecutor.java:153) at org.apache.maven.lifecycle.internal.MojoExecutor.execute(MojoExecutor.java:145) at org.apache.maven.lifecycle.internal.LifecycleModuleBuilder.buildProject(LifecycleModuleBuilder.java:84) at org.apache.maven.lifecycle.internal.LifecycleModuleBuilder.buildProject(LifecycleModuleBuilder.java:59) at org.apache.maven.lifecycle.internal.LifecycleStarter.singleThreadedBuild(LifecycleStarter.java:183) at org.apache.maven.lifecycle.internal.LifecycleStarter.execute(LifecycleStarter.java:161) at org.apache.maven.DefaultMaven.doExecute(DefaultMaven.java:318) at org.apache.maven.DefaultMaven.execute(DefaultMaven.java:153) at org.apache.maven.cli.MavenCli.execute(MavenCli.java:555) at org.apache.maven.cli.MavenCli.doMain(MavenCli.java:214) at org.apache.maven.cli.MavenCli.main(MavenCli.java:158) at sun.reflect.NativeMethodAccessorImpl.invoke0(Native Method) at sun.reflect.NativeMethodAccessorImpl.invoke(NativeMethodAccessorImpl.java:57) at sun.reflect.DelegatingMethodAccessorImpl.invoke(DelegatingMethodAccessorImpl.java:43) at java.lang.reflect.Method.invoke(Method.java:606) at org.codehaus.plexus.classworlds.launcher.Launcher.launchEnhanced(Launcher.java:290) at org.codehaus.plexus.classworlds.launcher.Launcher.launch(Launcher.java:230) at org.codehaus.plexus.classworlds.launcher.Launcher.mainWithExitCode(Launcher.java:414) at org.codehaus.plexus.classworlds.launcher.Launcher.main(Launcher.java:357) at org.codehaus.classworlds.Launcher.main(Launcher.java:47) Caused by: org.apache.maven.plugin.<em>Compilation</em>FailureException: <em>Compilation</em> failure at org.apache.maven.plugin.AbstractCompilerMojo.execute(AbstractCompilerMojo.java:729) at org.apache.maven.plugin.CompilerMojo.execute(CompilerMojo.java:128) at org.apache.maven.plugin.DefaultBuildPluginManager.executeMojo(DefaultBuildPluginManager.java:106) at org.apache.maven.lifecycle.internal.MojoExecutor.execute(MojoExecutor.java:208) ... 20 more [ERROR] [ERROR] [ERROR] For more information about the errors and possible solutions, please read the following articles: [ERROR] [Help 1] http://cwiki.apache.org/confluence/display/MAVEN/MojoFailureException
Error:java: Compilation failed: internal java compiler error 报错
报错信息: 找不到错了,这个get一张网上的图 报错<em>原因</em>: 项目中Java版本不一致,可以查看项目中的jdk配置。 解决办法: 1、查看项目的jdk(Ctrl+Alt+shift+S) File -&amp;gt;Project Structure-&amp;gt;Project Settings -&amp;gt;Project 2、查看工程的jdk(Ctrl+Alt+shift+S) F...
关于 ASPX 页面 报 Compilation Error 目录名称无效解决办法
ASPX 页面 报 <em>Compilation</em> <em>Error</em> <em>错误</em>: Could not write to output file "c:\Windows\Microsoft.NET\Framework\v4.0.30319\Temporary ASP.NET Files...dll"目录名称无效 在网上 百度 包括csdn 搜了些,设置权限、 重装IIS,最终皆无果。最后在 stackove...
maven执行compile找不到符号
[INFO] Compiling 13 source files to C:\Users\Administrator\Workspaces\MyEclipse 2017 CI\ojama\target\classes [INFO] ------------------------------------------------------------- [ERROR] COMPILATION ERROR : [INFO] ------------------------------------------------------------- [ERROR] /C:/Users/Administrator/Workspaces/MyEclipse 2017 CI/ojama/src/main/java/com/ojama/business/util/ExcelAdapter.java:[207,53] 找不到符号 符号: 方法 getCellTypeEnum() 位置: 类型为org.apache.poi.xssf.usermodel.XSSFCell的变量 cell [ERROR] /C:/Users/Administrator/Workspaces/MyEclipse 2017 CI/ojama/src/main/java/com/ojama/business/util/ExcelAdapter.java:[235,61] 找不到符号 符号: 方法 getCellTypeEnum() 位置: 类 org.apache.poi.xssf.usermodel.XSSFCell [INFO] 2 errors [INFO] ------------------------------------------------------------- [INFO] ------------------------------------------------------------------------ [INFO] BUILD FAILURE 用update project就好了。但是我要部署在别的电脑上。那台电脑没有IDE pom文件 ``` 4.0.0 com ojama 0.0.1-SNAPSHOT jar ojama http://maven.apache.org org.springframework.boot spring-boot-starter-parent 2.0.3.RELEASE 1.8 UTF-8 org.slf4j slf4j-simple ch.qos.logback logback-classic test org.springframework.boot spring-boot-starter-web org.springframework.boot spring-boot-starter-thymeleaf org.apache.poi poi 3.17 org.apache.poi poi-ooxml 3.11 org.springframework.boot spring-boot-configuration-processor true com.alibaba fastjson 1.2.47 org.springframework.boot spring-boot-maven-plugin ```
Rule Compilation error 问题
<em>请问</em>下我这个问题该怎么解决?。实在看不出来时哪问题了。。问题描述:org.drools.rule.InvalidRulePackage: Rule <em>Compilation</em> error : dataRu
Java IDEA 报错internal java compiler error
环境: Mac 10.10 IDEA版本: 2017.2.6 问题描述: 新建了maven项目,写了一个测试类,main方法运行报错`<em>Error</em>:java: <em>Compilation</em> failed: internal java compiler error` 已尝试的解决办法:在project和module中将JDK版本改成了1.8 且在setting中将Java Complier 改成了1.8 但在选择module的时候显示`nothing to show`故module的地方没有任何选择。继续运行还是报错。 相关图如下: ![图片说明](https://img-ask.csdn.net/upload/201801/13/1515824619_865297.png) ![图片说明](https://img-ask.csdn.net/upload/201801/13/1515824559_607318.png) ![图片说明](https://img-ask.csdn.net/upload/201801/13/1515824570_685295.png)
如何避免恼人的错误"已声明和未使用"
I'm learning Go but I feel it is a bit annoying that when compiling, I should not leave any variable or package unused. This is really quite slowing me down. For example, I just wanted to declare a new package and plan to use it later or just uncomment some command to test. I always get the error and need to go comment all of those uses. Is there any way to avoid this kind of check in Go? 转载于:https://stackoverflow.com/questions/21743841/how-to-avoid-annoying-error-declared-and-not-used
解决 IDEA tomcat启动时的错误:idea Error:java: Compilation failed: internal java compiler
最近使用idea后台开发功能,启动tomcat时报错,具体<em>错误</em>如下: <em>Error</em>:java: <em>Compilation</em> failed: internal java compiler error 百度了一些文章,不过都不管用!!!!!!我的解决方案如下: 在setting--&amp;gt;Build,Execution,Deployment--&amp;gt;Compiler   中找到build proc...
安卓报错显示详细Error:Execution failed for task ':app:compileDebugKotlin'. > Compilation error.
I solved it by Clicking onGradle(on the right side bar) -&gt; Then under:app Then chooseassembleDebug(orassembleYourFlavorif you use flavors) In Picture: 1 &amp; 2: 3&gt; <em>Error</em> ...
专题二 第十二道题
1.题目编号:1015 2.简单题意:你的一个朋友正在做TKP研究,需要你在n*n正方形的封闭棋盘上寻找骑士最少的移动次数,他认为最困难的是解决两个给定的方格之间寻找最少移动次数。给出两个方块a,b,(a-h)表示列,(1-8)表示行,确定从a到b骑士移动的最短路径。 3.解题思路形成过程:又是一个运用广度搜索的题目,在国际象棋的棋盘上,一匹马一共有8个可能跳跃的方向,而且马走日字。。可以定义
Java Web 项目运行报错之——Compilation error.......ClassFormatException
报错提示严重: <em>Compilation</em> error org.eclipse.jdt.internal.compiler.classfmt.ClassFormatException 全部报错信息 严重: <em>Compilation</em> error org.eclipse.jdt.internal.compiler.classfmt.ClassFormatException
代码在线运行网站
综合各代码在线运行 https://c.runoob.com/compile http://www.dooccn.com/  http://code.y444.cn Python反编译 https://tool.lu/pyc/ PHP在线运行 https://c.runoob.com/compile/1 http://www.dooccn.com/php7/  ...
STS 创建SpringMVC maven install时项目出现error COMPILATION ERROR :
<em>出现</em><em>错误</em>: [INFO] Scanning for projects... [INFO] [INFO] ------------------------------------------------------------------------ [
Compile Error产生的可能原因
1. 变量未定义就使用,或定义后使用位置超出了定义的作用域 说明:如b=25但程序并未在使用前定义好b的类型,还应注意变量作用域。 2. 括号不匹配 说明:()、[]、{}一定要有始就得有终 3. 使用非法类型 说明:如__int64在GCC编译器下不识别,你却用它 4. 需少分号 说明:忘了语句以一个分号结束 5.用函数未引头文件 说明:如printf函数在G++中未包含std
compilation error
我在打开web browser得到这个编译<em>错误</em>,很奇怪,两个路径是一样的,请教各位是怎么回事?先谢谢了。 Server <em>Error</em> in '/msaapps/ServiceAwardAdmin' Ap
Maven Package Compilation Error
[ERROR] COMPILATION ERROR : [INFO] ------------------------------------------------------------- [ERROR] No compiler is provided in this environment. Perhaps you are running on a JRE rather than a JDK?
tomcat或maven启动服务error解决办法(一)
最近用maven启动项目突然不行了,报错信息如下: [ERROR] COMPILATION ERROR :  [INFO] ------------------------------------------------------------- [ERROR] No compiler is provided in this environment. Perhaps you are runn
IntelliJ IDEA 编译错误,提示 Compilation failed: internal java compiler error或java compiler failed
IntelliJ IDEA 编译<em>错误</em>,提示 <em>Compilation</em> failed: internal java compiler error或java compiler failed
Compilation failed: internal java compiler error
<em>Error</em>:java: <em>Compilation</em> failed: internal java compiler error 找到setting -java compiler--将版本设置1.7+
配置WebSite的IIS时遇到的问题与解决方法
1: Server <em>Error</em> Internet Information Services 7.5 <em>Error</em> Summary HTTP <em>Error</em> 500.19 - Internal Server <em>Error</em> The requested page cannot be accessed because the related configuration data
急!!! maven编译错误:找不到符号
Scanning for projects... Some problems were encountered while building the effective model for mobi
maven项目src/main/java包compilation error
问题描述: maven项目目录结构如下--》 example_project ---src/main/java A.java ---src/test/java ---usecase/example B.java 假如  src/main/java中的A.java类中存在usecase/example包中的B.java对象 则运行maven clean pa
C++:internal compiler error解决
  编绎文件时,<em>出现</em>这个问题<em>原因</em>一般就是内存不够, 若是在虚拟机上,关掉虚拟机,可直接调节虚拟机内存大小,然后重新启动即可。
tomcat运行时出现警告和error
我电脑里面安装了jdk1.6,tomcat的版本6.0的,之后我在网上下载一个tomcat配置的word文档,一搜索就有的,然后详细的配置了tomcat里面的webapps的目录信息..增加了myap
关于tomcat报错,求大牛支招
信息: Server startup in 658 ms 二月 05, 2015 12:07:11 下午 org.apache.jasper.compiler.JDTCompiler$1 findTy
java.lang.Error: Unresolved compilation problems:
信息: XML validation disabled (. 3714) <em>Error</em> configuring application listener of class com.o3eie.util.
java: Compilation failed: internal java compiler error 解决方法
将项目中的java编译版本设置为1.8即可:
hdu 2159 FATE 解题报告
链接:http://acm.hdu.edu.cn/showproblem.php?pid=2159 Problem Description 最近xhd正在玩一款叫做FATE的游戏,为了得到极品装备,xhd在不停的杀怪做任务。久而久之xhd开始对杀怪产生的厌恶感,但又不得不通过杀怪来升完这最后一级。现在的问题是,xhd升掉最后一级还需n的经验值,xhd还留有m的忍耐度,每杀一个怪xhd会得到...
教你解决问题:Compilation error java.lang.OutOfMemoryError
教你解决问题:<em>Compilation</em> error java.lang.OutOfMemory<em>Error</em>                                       马嘉楠   2008-3-19问题描述:(例子如下)  weblogic.servlet.jsp.<em>Compilation</em>Exception: <em>Compilation</em> of D:/bea/user_p
无法正常编译错误Compilation failed to complete
发现了一个不错的库可以实时查看和修改布局。uetool 于是就加入到了依赖,谁想编译时却<em>出现</em>了<em>错误</em>。 以下是部分<em>错误</em>片段 org.gradle.api.tasks.TaskExecutionException: Execution failed for task ':app:transformDexArchiveWithExternalLibsDexMergerForDebug'. ...
Maven Compilation Error:No compiler is provided...you are running on a JRE rather than a JDK
Maven <em>Compilation</em> <em>Error</em>: [ERROR] COMPILATION ERROR : [INFO] ------------------------------------------------------------- [ERROR] No compiler is provided in this environment. Perhaps you are ru
Maven compilation error : package does not exist jar 程序包不存在
使用 Maven 命令 mvn package 打包时遇到了编译失败的问题。Maven 提示 compilation error : package does not exist jar 程序包不存在。经查,是在项目使用了非 Maven 仓库的 jar 包,即使用了本地 jar 包,导致 Maven 编译时找不到 jar 包。解决办法是配置 pom.xml ,将本地 jar 包的路径添加到其中,使...
myeclipse执行maven install 报错error in opening zip file
[ERROR] Failed to execute goal org.apache.maven.plugins:maven-compiler-plugin:3.1:compile (default-compile) on project buildingProject: <em>Compilation</em> failure: <em>Compilation</em> failure: [ERROR] <em>错误</em>:读取 D:\mave
Intellij 在使用过程中遇到的问题及解决方法
1。编译工程通过,但在启动时却说某些类的语法格式有问题。检查java文件过后却是正确的,类似:<em>Error</em>:(122, 59) java: 未结束的字符串文字。  <em>原因</em>:project或者module的文件编码格式不是utf-8。可在settings中查找file encoding都设置为UTF-8,随后重新编译,问题解决。 2. IntelliJ Idea编译报错:
IntelliJ IDEA编译报错Error:java: Compilation failed: internal java compiler error
网上有人说什么重新加载一下工程,我这里试了根本没卵用 看报错信息, 目标版本,提示说1.7 就在file->settings->Build,Execution,deploment->compiler->java compiler -> 看到Target bytecode version=1.5 版本问题,太低了, 设成1.7.解决 从低往高编译不可以,但从高往低,可以.
动态规划入门到熟悉,看不懂来打我啊
持续更新。。。。。。 2.1斐波那契系列问题 2.2矩阵系列问题 2.3跳跃系列问题 3.1 01背包 3.2 完全背包 3.3多重背包 3.4 一些变形选讲 2.1斐波那契系列问题 在数学上,斐波纳契数列以如下被以递归的方法定义:F(0)=0,F(1)=1, F(n)=F(n-1)+F(n-2)(n&gt;=2,n∈N*)根据定义,前十项为1, 1, 2, 3...
130 个相见恨晚的超实用网站,一次性分享出来
相见恨晚的超实用网站 持续更新中。。。
Java学习的正确打开方式
在博主认为,对于入门级学习java的最佳学习方法莫过于视频+博客+书籍+总结,前三者博主将淋漓尽致地挥毫于这篇博客文章中,至于总结在于个人,实际上越到后面你会发现学习的最好方式就是阅读参考官方文档其次就是国内的书籍,博客次之,这又是一个层次了,这里暂时不提后面再谈。博主将为各位入门java保驾护航,各位只管冲鸭!!!上天是公平的,只要不辜负时间,时间自然不会辜负你。 何谓学习?博主所理解的学习,它是一个过程,是一个不断累积、不断沉淀、不断总结、善于传达自己的个人见解以及乐于分享的过程。
程序员必须掌握的核心算法有哪些?
由于我之前一直强调数据结构以及算法学习的重要性,所以就有一些读者经常问我,数据结构与算法应该要学习到哪个程度呢?,说实话,这个问题我不知道要怎么回答你,主要取决于你想学习到哪些程度,不过针对这个问题,我稍微总结一下我学过的算法知识点,以及我觉得值得学习的算法。这些算法与数据结构的学习大多数是零散的,并没有一本把他们全部覆盖的书籍。下面是我觉得值得学习的一些算法以及数据结构,当然,我也会整理一些看过...
Python——画一棵漂亮的樱花树(不同种樱花+玫瑰+圣诞树喔)
最近翻到一篇知乎,上面有不少用Python(大多是turtle库)绘制的树图,感觉很漂亮,我整理了一下,挑了一些我觉得不错的代码分享给大家(这些我都测试过,确实可以生成) one 樱花树 动态生成樱花 效果图(这个是动态的): 实现代码 import turtle as T import random import time # 画樱花的躯干(60,t) def Tree(branch, ...
大学四年自学走来,这些私藏的实用工具/学习网站我贡献出来了
大学四年,看课本是不可能一直看课本的了,对于学习,特别是自学,善于搜索网上的一些资源来辅助,还是非常有必要的,下面我就把这几年私藏的各种资源,网站贡献出来给你们。主要有:电子书搜索、实用工具、在线视频学习网站、非视频学习网站、软件下载、面试/求职必备网站。 注意:文中提到的所有资源,文末我都给你整理好了,你们只管拿去,如果觉得不错,转发、分享就是最大的支持了。 一、电子书搜索 对于大部分程序员...
为啥国人偏爱Mybatis,而老外喜欢Hibernate/JPA呢?
关于SQL和ORM的争论,永远都不会终止,我也一直在思考这个问题。昨天又跟群里的小伙伴进行了一番讨论,感触还是有一些,于是就有了今天这篇文。 声明:本文不会下关于Mybatis和JPA两个持久层框架哪个更好这样的结论。只是摆事实,讲道理,所以,请各位看官勿喷。 一、事件起因 关于Mybatis和JPA孰优孰劣的问题,争论已经很多年了。一直也没有结论,毕竟每个人的喜好和习惯是大不相同的。我也看...
我在支付宝花了1分钟,查到了女朋友的开房记录!
在大数据时代下,不管你做什么都会留下蛛丝马迹,只要学会把各种软件运用到极致,捉奸简直轻而易举。今天就来给大家分享一下,什么叫大数据抓出轨。据史料证明,马爸爸年轻时曾被...
shell脚本:备份数据库、代码上线
备份MySQL数据库 场景: 一台MySQL服务器,跑着5个数据库,在没有做主从的情况下,需要对这5个库进行备份 需求: 1)每天备份一次,需要备份所有的库 2)把备份数据存放到/data/backup/下 3)备份文件名称格式示例:dbname-2019-11-23.sql 4)需要对1天以前的所有sql文件压缩,格式为gzip 5)本地数据保留1周 6)需要把备份的数据同步到远程备份中心,假如...
聊聊C语言和指针的本质
坐着绿皮车上海到杭州,24块钱,很宽敞,在火车上非正式地聊几句。 很多编程语言都以 “没有指针” 作为自己的优势来宣传,然而,对于C语言,指针却是与生俱来的。 那么,什么是指针,为什么大家都想避开指针。 很简单, 指针就是地址,当一个地址作为一个变量存在时,它就被叫做指针,该变量的类型,自然就是指针类型。 指针的作用就是,给出一个指针,取出该指针指向地址处的值。为了理解本质,我们从计算机模型说起...
为什么你学不过动态规划?告别动态规划,谈谈我的经验
动态规划难吗?说实话,我觉得很难,特别是对于初学者来说,我当时入门动态规划的时候,是看 0-1 背包问题,当时真的是一脸懵逼。后来,我遇到动态规划的题,看的懂答案,但就是自己不会做,不知道怎么下手。就像做递归的题,看的懂答案,但下不了手,关于递归的,我之前也写过一篇套路的文章,如果对递归不大懂的,强烈建议看一看:为什么你学不会递归,告别递归,谈谈我的经验 对于动态规划,春招秋招时好多题都会用到动态...
程序员一般通过什么途径接私活?
二哥,你好,我想知道一般程序猿都如何接私活,我也想接,能告诉我一些方法吗? 上面是一个读者“烦不烦”问我的一个问题。其实不止是“烦不烦”,还有很多读者问过我类似这样的问题。 我接的私活不算多,挣到的钱也没有多少,加起来不到 20W。说实话,这个数目说出来我是有点心虚的,毕竟太少了,大家轻喷。但我想,恰好配得上“一般程序员”这个称号啊。毕竟苍蝇再小也是肉,我也算是有经验的人了。 唾弃接私活、做外...
字节跳动面试官这样问消息队列:分布式事务、重复消费、顺序消费,我整理了一下
你知道的越多,你不知道的越多 点赞再看,养成习惯 GitHub上已经开源 https://github.com/JavaFamily 有一线大厂面试点脑图、个人联系方式和人才交流群,欢迎Star和完善 前言 消息队列在互联网技术存储方面使用如此广泛,几乎所有的后端技术面试官都要在消息队列的使用和原理方面对小伙伴们进行360°的刁难。 作为一个在互联网公司面一次拿一次Offer的面霸...
2020年大前端发展趋势
迅速发展的前端开发,在每⼀年,都为开发者带来了新的关键词。2019 年已步⼊尾声,2020 年前端发展的关键词⼜将有哪些呢?发展的方向又会是什么呢?参考2019年大前端的发展,不出意外,前端依旧会围绕⼩程序、超级APP、跨端开发、前端⼯程化以及新技术运用等几个方面进行展开(可以参考2019年大前端技术趋势深度解读)。 小程序 在⼩程序⽅⾯,今年仍然是⼩程序突⻜猛进的⼀年,各⼤主流的 App 都上线...
如何安装 IntelliJ IDEA 最新版本——详细教程
IntelliJ IDEA 简称 IDEA,被业界公认为最好的 Java 集成开发工具,尤其在智能代码助手、代码自动提示、代码重构、代码版本管理(Git、SVN、Maven)、单元测试、代码分析等方面有着亮眼的发挥。IDEA 产于捷克,开发人员以严谨著称的东欧程序员为主。IDEA 分为社区版和付费版两个版本。 我呢,一直是 Eclipse 的忠实粉丝,差不多十年的老用户了。很早就接触到了 IDEA...
1个月时间整理了2019年上千道Java面试题,近500页文档!
Spring 面试题 1、一般问题 1.1、不同版本的 spring Framework 有哪些主要功能? 1.2、什么是 spring Framework? 1.3、列举 spring Framework 的优点。 1.4、spring Framework 有哪些不同的功能? 1.5、spring Framework 中有多少个模块,它们分别是什么? 1.6、什么是 spring ...
面试还搞不懂redis,快看看这40道面试题(含答案和思维导图)
Redis 面试题 1、什么是 Redis?. 2、Redis 的数据类型? 3、使用 Redis 有哪些好处? 4、Redis 相比 Memcached 有哪些优势? 5、Memcache 与 Redis 的区别都有哪些? 6、Redis 是单进程单线程的? 7、一个字符串类型的值能存储最大容量是多少? 8、Redis 的持久化机制是什么?各自的优缺点? 9、Redis 常见性...
为什么要推荐大家学习字节码?
配套视频: 为什么推荐大家学习Java字节码 https://www.bilibili.com/video/av77600176/ 一、背景 本文主要探讨:为什么要学习 JVM 字节码? 可能很多人会觉得没必要,因为平时开发用不到,而且不学这个也没耽误学习。 但是这里分享一点感悟,即人总是根据自己已经掌握的知识和技能来解决问题的。 这里有个悖论,有时候你觉得有些技术没用恰恰是...
在阿里,40岁的奋斗姿势
在阿里,40岁的奋斗姿势 在阿里,什么样的年纪可以称为老呢?35岁? 在云网络,有这样一群人,他们的平均年龄接近40,却刚刚开辟职业生涯的第二战场。 他们的奋斗姿势是什么样的呢? 洛神赋 “翩若惊鸿,婉若游龙。荣曜秋菊,华茂春松。髣髴兮若轻云之蔽月,飘飖兮若流风之回雪。远而望之,皎若太阳升朝霞;迫而察之,灼若芙蕖出渌波。” 爱洛神,爱阿里云 2018年,阿里云网络产品部门启动洛神2.0升...
【超详细分析】关于三次握手与四次挥手面试官想考我们什么?
在面试中,三次握手和四次挥手可以说是问的最频繁的一个知识点了,我相信大家也都看过很多关于三次握手与四次挥手的文章,今天的这篇文章,重点是围绕着面试,我们应该掌握哪些比较重要的点,哪些是比较被面试官给问到的,我觉得如果你能把我下面列举的一些点都记住、理解,我想就差不多了。 三次握手 当面试官问你为什么需要有三次握手、三次握手的作用、讲讲三次三次握手的时候,我想很多人会这样回答: 首先很多人会先讲下握...
压测学习总结(1)——高并发性能指标:QPS、TPS、RT、吞吐量详解
一、QPS,每秒查询 QPS:Queries Per Second意思是“每秒查询率”,是一台服务器每秒能够相应的查询次数,是对一个特定的查询服务器在规定时间内所处理流量多少的衡量标准。互联网中,作为域名系统服务器的机器的性能经常用每秒查询率来衡量。 二、TPS,每秒事务 TPS:是TransactionsPerSecond的缩写,也就是事务数/秒。它是软件测试结果的测量单位。一个事务是指一...
瑞星升级保姆 For 瑞星2010下载
瑞星升级保姆 For 瑞星2010 可以跳过瑞星的验证进行病毒库升级,支持瑞星2009,2010 相关下载链接:[url=//download.csdn.net/download/yyao64/2872934?utm_source=bbsseo]//download.csdn.net/download/yyao64/2872934?utm_source=bbsseo[/url]
万能XP Ghost镜像制作指南下载
万能XP Ghost镜像制作指南 相关下载链接:[url=//download.csdn.net/download/chenjiren204/5307806?utm_source=bbsseo]//download.csdn.net/download/chenjiren204/5307806?utm_source=bbsseo[/url]
基于统计分类器的入侵检测关键技术的研究下载
通过统计分类器,加强入侵检测能力,进而实现高精度入侵检测。 相关下载链接:[url=//download.csdn.net/download/alwayssun/10252828?utm_source=bbsseo]//download.csdn.net/download/alwayssun/10252828?utm_source=bbsseo[/url]
相关热词 c# id读写器 c#俄罗斯方块源码 c# linq原理 c# 装箱有什么用 c#集合 复制 c# 一个字符串分组 c++和c#哪个就业率高 c# 批量动态创建控件 c# 模块和程序集的区别 c# gmap 截图
我们是很有底线的