关于cmake找不到库文件的问题 [问题点数:40分,结帖人u012410577]

Bbs1
本版专家分:0
结帖率 66.67%
Bbs1
本版专家分:0
Bbs12
本版专家分:381352
Blank
状元 2017年 总版技术专家分年内排行榜第一
Blank
榜眼 2014年 总版技术专家分年内排行榜第二
Blank
探花 2013年 总版技术专家分年内排行榜第三
Blank
进士 2018年总版新获得的技术专家分排名前十
2012年 总版技术专家分年内排行榜第七
Bbs12
本版专家分:381352
Blank
状元 2017年 总版技术专家分年内排行榜第一
Blank
榜眼 2014年 总版技术专家分年内排行榜第二
Blank
探花 2013年 总版技术专家分年内排行榜第三
Blank
进士 2018年总版新获得的技术专家分排名前十
2012年 总版技术专家分年内排行榜第七
Bbs1
本版专家分:0
Bbs12
本版专家分:381352
Blank
状元 2017年 总版技术专家分年内排行榜第一
Blank
榜眼 2014年 总版技术专家分年内排行榜第二
Blank
探花 2013年 总版技术专家分年内排行榜第三
Blank
进士 2018年总版新获得的技术专家分排名前十
2012年 总版技术专家分年内排行榜第七
Bbs1
本版专家分:0
cmake opencv2.4.9的库文件
<em>cmake</em> 编译opencv2.4.9产生的.so和.a<em>库文件</em>,适合移植到arm上,在arm上做图像处理。
找不到库文件
谁用过 specter?老是不能运行,<em>找不到</em>MYSQL的库 可是我明明有这个<em>库文件</em>啊 rn./specter --with-mysql=/usr/local/lib/mysqlrnlog info:rnThu Oct 21 12:08:37 2004 specter: Couldn't load plugin: libmysqlclient.so.12: cannot open shared object file: No such file or directory.rnrn最后14分了 感激啊 rn
库文件找不到
[img=https://img-bbs.csdn.net/upload/201404/11/1397204370_270114.jpg][/img][img=https://img-bbs.csdn.net/upload/201404/11/1397204378_451081.jpg][/img]rn为什么编译的时候提示:cannot find -llibnetd ? thx~
Android studio报错‘CMake '3.10.2' was not found in PATH or by cmake.dir property.‘
调试程序时报错CMake ‘3.10.2’ was not found in PATH or by <em>cmake</em>.dir property. 解决方法:在build.gradle里添加 android{ &nbsp;&nbsp;&nbsp; externalNativeBuild { &nbsp;&nbsp;&nbsp;&nbsp;&nbsp;&nbsp;&nbsp; <em>cmake</em> { &nbsp;&...
Android CMake Error in CMakeLists.txt: is not a full path to an existing ....
最近导入一个旧Android项目 有用到opencv,和 tess-two,由于opencv是用c++写的,编译项目的时候没有报错,但是Build最后会提示我构建失败。 具体如下:
Android Studio NDK 构建工具 CMake初探
CMake 是 Android studio 支持的一种新的NDK构建工具,这篇文章主要是对官方介绍的一个翻译和一些简单的尝试。
module code version and database version not match
1.SELECT * FROM magento23.setup_module where module ='model name', 2. change the versionconsistently and apply what you change.
ctf pwn 个人经验记录
前言记录一下自己在做pwn的过程当中学到的一些东西,以前不知道的东西等等,碰到的坑也会记录在 这里,主要目的是帮助自己记录一下经验。其实每一道题基本上能学到的新东西是有限的,记录下来避免什么时候想不起来。顺序比较乱,基本上根据我做题的顺序定的,比较随意。pwnother place(not from ctf) 多用gdb调试,有思路可以先写出来调试一下看看效果再说 遇见pie考虑写malloc_h
Android 关于.so库文件找不到
在我的程序中使用了两个jar包每个jar包中个使用了一些.so的动态<em>库文件</em>,程序运行在32位机器上没有<em>问题</em>,运行在64位的机器上就会崩溃,说本地方法<em>找不到</em>(UnsatisfiedLinkError: No implementation found for)。查了一下是因为<em>库文件</em>加载失败导致本地方法<em>找不到</em>,<em>库文件</em>加载失败的原因是(.UnsatisfiedLinkError: dalvik.syste
关于proc_common_pkg库文件找不到的解决办法
刚上手VHDL,自己学着写testbench文件,对于别人写的IP核进行验证,但是在写完testbench文件之后,发现了proc_common_pkg文件<em>找不到</em>的错误,由于是时候写博客,所以没有截图;对于新手来说在网上找了好半天才找到相应的解决办法,但是通过某歌找到的。这里把办法分享一下。 首选在打开“new source wizard”对话框,然后选择“VHDL Library”,在file
【求救】关于VBA的找不到库文件~~~~
写了个东西,但很不稳定rn实验室的机上能行,回宿舍自己的机上用就不行了rn就是在mid函数处出<em>问题</em>,说是<em>找不到</em>工程和库rn真是郁闷,后来在mid前加了vba.就行了rn<em>问题</em>1:这是为什么,怎么解决?rnrn加了vba.后,mid函数处是通过了,不过在执行下面这语句又出了新错误rnActiveDocument.Tables(1).Cell(Row:=CInt(DefineForm.str1), Column:=CIntDefineForm.str2)).Shading.BackgroundPatternColor = wdColorLightOrangern信息是rn运行是错误“5941“rn集合所要求的成员不存在rn<em>问题</em>2:这是为什么,怎么解决?rn汗~~~rn感觉vba移植性不好,怎么就老出错呢rn我刚开始学vba,请高手给我指点指点!rnthx!
关于jna库文件找不到的处理方法
1.CLibrary INSTANCE=(CLibrary) Native.loadLibrary(&quot;so绝对路径&quot;,CLibrary.class)   2.查看jna加载路径 System.setProperty(&quot;jna.debug_load&quot;,&quot;true&quot;); 3.设置jna路径 System.setProperty(&quot;jna.library.path&quot;,&quot;so库绝对路径&quot;) 这...
android studio 使用cmake支持C++出现无法sync cmake error的问题
<em>问题</em>错误信息External Native Build Issues Build command failed. Error while executing '/root/Android/Sdk/<em>cmake</em>/3.6.3155560/bin/<em>cmake</em>' with arguments {-H/root/AndroidStudioProjects/AccessQRat/app -B/root/Andro
apt-get The method driver /usr/lib/apt/methods/http could not be found错误解决
sudo apt-get install apt-transport-https
youcompleteme unavailable: no module named "future"解决
<em>问题</em>描述我用aur安装了youcompleteme,然后vim出现:youcompleteme unavailable: no module named future<em>问题</em>原因默认的python是py3,py3没有future,所以安装上future就好了<em>问题</em>解决sudo pip3 install future
[org.apache.struts.action.RequestProcessor]-[ERROR] Invalid path was requested
-
Cmake编译-CMAKE_C_COMPILER-NOTFOUND解决
CMAKE编译DCMTK中遇到的bug记录
cmake中boost库找不到问题
有时候需要用到boost库,在CMAKE中怎么配置都很清楚,但是其中有一个小坑需要注意。 这个坑有点低级,但是有时候人们就是不知道没电是因为插排没插到插座上。 boost库可能我们编译的时候选择了64位或者32位。<em>cmake</em>在生成的时候默认是32位,如果<em>cmake</em>生成选择32位而boost库只提供了64位的库,那么就会报告<em>找不到</em>boost库的错误...
cmake 生成 (动态库、静态库)库文件问题
[img=https://img-bbs.csdn.net/upload/201503/05/1425525750_632396.png][/img],请教各位朋友,我现在有一个工程project ,目录结构如上图,下面有三个目录模块 base、file、util;我现在想把这个工程编译成一个动态库或者静态库;rn我现在的做法是:rn1、每个模块都编译成了一个 静态库 (libbase.a、libfile.a、libutil.a);rn2、然后在project 目录下创建一个模块 test,里面只有一个test.cpp 文件(内容是空的);rn3、然后让test模块去连接(libbase.a、libfile.a、libutil.a);rn现在的<em>问题</em>是 test 模块也编译成了test.a 但是没有连接上其他三个库(libbase.a、libfile.a、libutil.a),请问各位怎么能把工程所有的静态库打包成一个?
androidStudio找不到.so库文件问题
这几天一直在对接不同厂家的POS收银机,各大POS机厂商通常有自己的SDK和.so<em>库文件</em>。 在对接某一款机器的时候,按照开发文档导入jar包,复制.so文件到jniLibs文件夹中,顺便说一句android studio引入.so文件,需要在与java文件夹同级的地方新建一个jniLibs的文件夹,把.so<em>库文件</em>复制到该文件夹中,然后as会来该目录中读取。 本来我以为只要按照这
cmake 找不到opencv路径
win10上 <em>cmake</em>一个包报错<em>找不到</em>.<em>cmake</em>文件 OpenCVConfig.<em>cmake</em> opencv-config.<em>cmake</em> 百度了一下是我安装opencv的时候没有安装在默认路径 而是自己指定了路径(因为公司之前给我的电脑内存小 这种东西我都习惯单独安装在D盘) 找到自己安装的位置 然后加到DOPenCV_DIR后面 输入: <em>cmake</em> -DOpenCV_DIR=“D:\coding...
Imgproc.dll找不到库文件
运行twain扫描图像时、提示Imgproc.dll<em>找不到</em>运行此应用程序的某个<em>库文件</em>。rn我该怎样做?
CMake之CMakeLists.txt编写入门
CMake之CMakeLists.txt编写入门
AndroidStudio之NDK开发CMake CMakeLists.txt编写入门
一、CmakeList的编写和参数详解  在linux 下进行开发很多人选择编写makefile 文件进行项目环境搭建,而makefile 文件依赖关系复杂,工作量很大,搞的人头很大。采用自动化的项目构建工具<em>cmake</em> 可以将程序员从复杂的makefile 文件中解脱出来。<em>cmake</em> 根据内置的规则和语法来自动生成相关的makefile 文件进行编译,同时还支持静态库和动态库的构建,
android studio3.1.3ndk项目创建提示cmake\3.6.4111459\bin\cmake.exe with arguments
Build command failed. Error while executing process D:\android_studio_sdk\<em>cmake</em>\3.6.4111459\bin\cmak
cmake编译问题解决
2 安装<em>cmake</em>软件包 yum install <em>cmake</em> 3 create account of mysql groupadd mysql            useradd -g mysql mysql            autoreconf --force --install libtoolize --automake --force automake --forc
【手把手AI项目】八、MobileNetSSD通过Ncnn前向推理框架在Android端的使用--Cmake编译(目标检测 objection detection)
前言 安装win10+linux-Ubuntu16.04的双系统(超细致) ubuntu16.04+caffe+CUDA10.0+cudnn7.4+opencv2.4.9.1+python2.7 (超超细致) Caffe_ssd安装以及利用VOC2012,VOC2007数据集测试VGG_SSD网络 Caffe实现MobileNetSSD以及各个文件的具体解释,利用自己的数据集dataset训练M...
为什么找不到库文件
在用MySQL connector/C++。rn把lib和include文件夹放在/usr中。rneclipse编译的时候就是说<em>找不到</em>头文件....rn编译选项:g++ -L/usr/lib -o "test" ./test.o -lmysqlcppconnrn出错信息:rn/usr/bin/ld: skipping incompatible /usr/lib/libmysqlcppconn.so when searching for -lmysqlcppconnrn/usr/bin/ld: skipping incompatible /usr/lib/gcc/x86_64-linux-gnu/4.6/../../../../lib/libmysqlcppconn.so when searching for -lmysqlcppconnrn/usr/bin/ld: skipping incompatible /usr/lib/../lib/libmysqlcppconn.so when searching for -lmysqlcppconnrn/usr/bin/ld: skipping incompatible /usr/lib/gcc/x86_64-linux-gnu/4.6/../../../libmysqlcppconn.so when searching for -lmysqlcppconnrn/usr/bin/ld: skipping incompatible /usr/lib/libmysqlcppconn.so when searching for -lmysqlcppconnrn/usr/bin/ld: cannot find -lmysqlcppconnrncollect2: ld 返回 1rnmake: *** [test] 错误 1rnrn难道是版本<em>问题</em>?下载的时候也没有让选版本的呀
解决库文件找不到
在linux安装软件时,经常遇到某个<em>库文件</em><em>找不到</em> 1. 使用 sudo apt-get install 安装 2. 找到该<em>库文件</em>,建立软链接 如, 在安装 matlab时,提示 /lib/libc.so.6 <em>找不到</em> 使用 apt-get 安装不了,这时,该<em>库文件</em>可能已在系统中,只是软件无法定位到 $ locate libc.so.6 /lib...
redis安装——找不到库文件
[root@localhost 4setup]# tar xzf redis-2.2.12.tar.gz [root@localhost 4setup]# cd redis-2.2.12 [root@localhost redis-2.2.12]# make [root@localhost redis-2.2.12]# make install [root@localhost redi
第三方库文件找不到的解决方法
使用pod添加第三方库在使用的时候<em>找不到</em>文件有两种解决方法:1).选择Target -&amp;gt; Build Settings 菜单,找到\”User Header Search Paths\”设置项新增一个值&quot;${SRCROOT}&quot;,并且选择\”Recursive\” ;2).尝试pod Install后,Product -&amp;gt; Clear Build Folder(按住option键)清理一...
找不到自定义类库文件
连编之前,在主窗口中运行正常,连编成 .exe运行时显示错误,<em>找不到</em>类<em>库文件</em>。可执行文件与类<em>库文件</em>放在一个文件夹中,而且.exe 运行错误提示中的路径也正确,但是他偏说<em>找不到</em>,搞了一天半了,不知咋回事?请求列为高手帮忙,先谢谢了
cmake安装遇到问题总结
推荐<em>cmake</em>安装文章点击打开链接以及opencv例子执行。 1、qmake: could not exec '/usr/lib/x86_64-linux-gnu/qt4/bin/qmake': No such file or directory    解决:安装:sudo apt-get install qt-sdk(470M,so heavy)          but some p
ubuntu下cmake常见两个错误的解决
今天在用源码安装mysql的时候遇到下面的两个<em>问题</em> 一、提示“CMAKE_CXX_COMPILER-NOTFOUND ”。 具体形式: Check for working CXX compiler: CMAKE_CXX_COMPILER-NOTFOUND  CMake Error: your CXX compiler: "CMAKE_CXX_COMPILER-NOT
python 3.6.0版本环境变量的设置
-
[torch]安装遇到的问题
最近提特征提的整个tsubame的空间都要满了..今天安torch,http://torch.ch/docs/getting-started.htmlgit clone https://github.com/torch/distro.git ~/torch --recursive cd ~/torch; bash install-deps; ./install.shtsubame没法和外部网络联系,
Warning: Could not find file 。。。to copy.
  老师给了一个完整程序,但是没跑起来,我的做法是,点击跳转,删掉所在行,就可以了  
编译时找不到库文件
我在SCO_SV scosysv 3.2 5.0.5 i386下用到了操作动态库的函数(dlopen/dlsym等),但是编译的时候<em>找不到</em>这些函数对应的库(在linux下在/usr/lib下有个libdl.a),但在sco下会是在哪个a文件中呢?rnrn请高手指点,分数不多,请包涵
交叉编译时,找不到库文件
交叉编译时不能找到-lcppunit,在/usr/local/lib下存在所需<em>库文件</em>的连接。rn请问这种情况如何解决rnmakefile脚本rn[code=Python]rnCC=armv6zk-none-linux-gnueabi-gccrnINC=/mnt/hgfs/VMshareDir/cppunit/cppunit-1.12.1/includernOBJ=test.ornTARGET=cppunit_CROSSrn#all:$(OBJ)rn# $(CC) -I$(INC) -L/usr/local/lib/libcppunit.a $(OBJ) -lcppunit -ldl -o $(TARGET) rn#$(OBJ):test.cpprn# $(CC) -c -I$(INC) test.cpprnall:rn $(CC) -L/usr/local/lib/libcppunit.a -I$(INC) test.cpp -lcppunit -ldl -o $(TARGET)rnclean:rn rm -rf *.o testrn[/code]rn提示错误信息rnarmv6zk-none-linux-gnueabi-gcc -L/usr/local/lib/libcppunit.a -I/mnt/hgfs/VMshareDir/cppunit/cppunit-1.12.1/include test.cpp -lcppunit -ldl -o cppunit_CROSSrn[color=#FF0000]/opt/ubq/devkit/arm/arm11/lib/gcc/armv6zk-none-linux-gnueabi/4.3.2/../../../../armv6zk-none-linux-gnueabi/bin/ld: cannot find -lcppunit[/color]rncollect2: ld returned 1 exit statusrn检查usr/local/ib库内容rn[root@localhost cppunittest]# ls /usr/local/librnlibcppunit-1.12.so.1 libcppunit.a libcppunit.so subsystemrnlibcppunit-1.12.so.1.0.0 libcppunit.la pkgconfigrnrn
QT程序执行时找不到库文件
我的工程文件经make可以生成可执行程序,但用-qws在模拟器上执行的时候就会报出以下错误:rnerror while loading shared libraries: : cannot open shared object file: No such file or directoryrn我检查过我的工程文件中有libJStreams.so.1这个文件,QT的安装路径下也有这个<em>库文件</em>rn我的环境变量是:PATH="usr/local/sbin:/usr/local/bin:/usr/sbin:/usr/bin:/sbin:/bin:/usr/games:/usr/local/Trolltech/QtEmbedded-4.5.2/bin:/usr/local/Trolltech/QtEmbedded-4.5.3/bin"rn而qmake -v 的结果是:rnQMake version 2.01arnUsing Qt version 4.7.0 in /usr/librn这里有点奇怪,但不知道什么原因rn还请大家帮帮忙!非常感谢!rnrn
vfp提示找不到库文件
我用vfp9.0编的程序,编译完成后在我的机器上能正常运行,但在安装6。0的机器上提示不能找到microsor visual forpro 的运行<em>库文件</em>。
LigerUI 库文件找不到
我刚开始学LigerUI的,昨天看了谢略老师博客的LigerUI入门讲解,但发现LigerUI <em>库文件</em>引入不了。那个jquery.js我在本地已经有了,请问LigerUI有没有类似的js包可以下载后在本地调试的?谢谢[img=https://img-bbs.csdn.net/upload/201401/14/1389675913_273931.png][/img]
[ROS]编译orbslam出错,ros路径问题
CMake Error at CMakeLists.txt:2 (include): include could not find load file: /core/rosbuild/rosbuild.<em>cmake</em> CMake Error at CMakeLists.txt:4 (rosbuild_init): Unknown CMake command "rosbuild_init".
win10+vs2015+CMake 3.12.2编译opencv3.4.0源码
1.为何要编译opencv源码?   (1)想查看OpenCV自带的函数的源代码,比如函数cvCreateImage, 点击鼠标右键-&amp;gt;转到定义,只能看到cvCreateImage的一个简单声明,而没有源代码。这是因为opencv将很多函数被加入了函数库,并被编译成了dll,所以只能看到函数申明,没法看到源代码。 (2)为何需要自行编译opencv3.4.0与opencv_contrib...
cmake error at cmakelists-qutecom
某个工具从以下位置返回了错误代码: "正在执行生成后事件 直接在  项目属性  ->生成事件 ->生成后事件 ->命令行  中的内容删掉。 ////////////////////// 我遭到的 lang.h 和 yahoo_profile.c 编译出错,我的处理措施是把无须要的语言剔除非,省时省力。 对于以下这个<em>问题</em>,有个更好的解决方案。 ***我遇到的 lang
Cmake “cmake_make_program is not set” 问题, 求大神帮忙解决一下!
1.配置CMake编译条件时,按照配置教程走的,但是一直报错: Cmake was unable to find a build program corresponding to "MinGW Makefiles", CMAKE_MAKE_PROGRAM" is not set, You probably need to select a different build tool.
Cmake “cmake_make_program is not set” 问题
1.配置CMake编译条件时,按照配置教程走的,但是一直报错: Cmake was unable to find a build program corresponding to "MinGW Makefiles", CMAKE_MAKE_PROGRAM" is not set, You probably need to select a different build tool. 在度娘
关于cmake问题
在《<em>cmake</em>实践》这本书的23页最下面(四, 添加静态库), <em>关于</em>libhello.so消失了的<em>问题</em>。 作者说是因为<em>cmake</em>“会尝试清理掉其他使用这个名字的库”。 解决方案是加入以下指令 SET_TARGET_PROPERTIES(hello PROPERTIES CLEAN_DIRECT_OUTPUT 1) SET_TARGET_PROPERTIES(hello_static PROPERT...
关于CMake的诡异问题!!!
现有一个庞大的工程,自带编译系统可以编译,现在需要使用CMake完成编译库和编译出测试库的可执行文件。库需要编译dll的debug&release和static的debug&release版本。现在库都编译完了,完全没有<em>问题</em>,但是现在我编的测试程序出了<em>问题</em>。rnWin32与Win64位系统下头文件和源文件完全相同,只是编译选项不同,生成库的编译选项如下:rn[color=#FF0000]if( CIP_64BIT )rn set( CMAKE_CXX_FLAGS "/D_MBCS /GS /EHsc /W3 /nologo /c /Wp64 /GR /fp:fast /DCIP_FRAMEWORK_VERSION=0x01050100 /DWIN64")rnelse( CIP_64BIT )rn set( CMAKE_CXX_FLAGS "/D_MBCS /GS /EHsc /W3 /nologo /c /Wp64 /GR /fp:fast /DCIP_FRAMEWORK_VERSION=0x01050100 /DWIN32")rnendif( CIP_64BIT )rnset(CMAKE_CXX_FLAGS_DEBUG "$CMAKE_CXX_FLAGS /D_DEBUG /MDd /RTC1 /Z7 /Od")rnset(CMAKE_CXX_FLAGS_RELEASE "$CMAKE_CXX_FLAGS /DNDEBUG /MD /O2")[/color]rnrn这个库有三个测试程序,如下:rn+--------------+--------------+---------------+---------------+rn| 测试程序 | libAtest | libA-mttest | libA-pltest |rn+--------------+--------------+---------------+---------------+rn| 加入的特殊宏 | 无 | MT_TEST | PL_TEST |rn+--------------+--------------+---------------+---------------+rnlibAtest与其他两个唯一的区别在于编译时分别加入了名为MT_TEST和PL_TEST的宏。使用的语句如下:rn[color=#FF0000]set_source_files_properties( $SRCS_TEST_LIBA PROPERTIES COMPILE_FLAGS "-D_LINK_OTHER_DLL -DCIP_MT_TEST" )[/color]rnrn(说这么复杂,估计看的人都费劲)rnrn<em>问题</em>在于:rnWin32平台下编译出来的测试唯独libA-mttest出了<em>问题</em>(包括四个版本的测试dll&static下debug&release),有两个错误(应该是0 error)。rnWin64平台下是dll&static下的release的libAtest、libA-mttest、libA-pltest都有一个错误。rnrn在工程自带的编译系统下都不存在这些<em>问题</em>。经过互换库的试验后发现<em>问题</em>就出现在测试程序上。此<em>问题</em>不指望能得到准确的解决办法,只希望有<em>cmake</em>经验的前辈能给点建议,指出一些<em>cmake</em>容易出<em>问题</em>的地方。
关于Cmake编译的问题
我在对一个开源的程序用<em>cmake</em>进行编译时出现“error in configuration process project files may be invalid”rn只是什么原因?rn它源代码中有CMakeLists.txt这个文件,我不知道怎么看?是不是有这个文件就一定可以编译出来的啊!!
Cmake下编译出现Boost找不到问题
有一个工程在VS2010中依赖Boost 库,在Windows下编译boost <em>库文件</em>之后,并在VS2010工程中链接Boost<em>库文件</em>,工程可以运行。但是在Windows下安装Cmake后,编译文件时出现boost库的错误。rn[img=https://img-bbs.csdn.net/upload/201605/29/1464528382_561871.png][/img]
cmake编译报错,显示找不到VS
我装的VS015 Win64版,后安装<em>cmake</em>对LZO进行编译,发现<em>cmake</em> 运行后报错如下:nCMake Error at CMakeLists.txt:51 (project):n Generatorn Visual Studio 15 2017 Win64n could not find any instance of Visual Studio.nnConfiguring incomplete, errors occurred!nSee also "E:/<em>cmake</em>\_test/CMakeFiles/CMakeOutput.log“n求大神帮助!
在Linux 中编译程序时,后CMAKE_MAKE_PROGRAM is not set.
我从github 下载了 pcl-for-android, 执行 ./pcl-build-for-android.sh 时报错,如下: Compiling with 4 jobs ... ######
Win7下qt5.3.1+opencv2.4.9编译环境的搭建
 到官网下载qt-opensource-windows-x86-mingw482_opengl-5.3.1.exe文件,执行该文件,选择默认安装即可实现QT的安装(安装在C盘的根目录下),该文件封装好了Qt libraries、Qt Creator,其中Qt Creator为3.1.2版本。   到官网http://opencv.org/downloads.html下
「又要劳烦各位了」 linux 安装mysql问题
linux : ylmf os 11 mysql: 5.0.87 ,5.5.12 ,还又等着下载的几个。。(濒临崩溃) 我按照readme 和install 说明来一步一步操作的。。 机器上没make
CMake Error: CMake was unable to find a build program corresponding to "MinGW Makefiles". CMAKE_MAK
CMake编译OpenCV3.1.0过程中一直出错: CMake Error: CMake was unable to find a build program corresponding to "MinGW Makefiles". CMAKE_MAKE_PROGRAM is not set. You probably need to select a different build tool.
ubuntu系统下ros系统问题的解决方法示例
前言:  这是自己这几个月以来调ros出现的<em>问题</em>,有的<em>问题</em>是花了几天时间来解决。由此记录 注意:如果出现的错误是类似于“ Could not find a packageconfiguration file provided by "xxx_xxx_xxx"”,这说明“xxx_xxx_xxx”这个package未安装,将“xxx_xxx_xxx”复制,然后百度,找到后缀为ROS-Wiki的标题
CMake查找第三方或者自己的库文件
CMake查找<em>库文件</em> 使用<em>cmake</em>指定第三方库或者自己的工具库的相关目录 使用CMake可以方便的进行项目管理。作为初学者在使用过程中遇到了一些<em>问题</em>,做一些纪录。 <em>问题</em>描述 在windows下面做C++开发时,如果需要使用第三方库或者自己编译的工具库的时候,一般都是通过三步进行配置,这种方式在<em>库文件</em>比较少的时候可以通过手动完成配置(当然也可以通过bat脚本枚举库目录下面的文件,一起添加),然后导...
关于库文件的引用问题
今天在看别人的Sample,需要使用一个DLL文件,添加到引用的时候显示“请确保此文件可访问并且是一个有效的程序集或COM组件”,程序可以编译成功,把<em>库文件</em>放到编译好的EXE文件的文件夹里可以运行得到想要的结果,但是直接在VS上调试时就会报错啊。
关于库文件的新手问题
编译器编译后,<em>库文件</em>内是二进制格式。rn那么我们在程序开发中,使用<em>库文件</em>是通过引入其头文件对其中的函数进行声明。rn但声明使用的是标示符。而<em>库文件</em>中的是二进制码。rnrn难道编译器在编译标示符的时候有其固定的二进制码?rn第一次发帖,谢谢各位同仁
CMake找不到opencv库解决办法
一、<em>问题</em>详情 在ubuntu中使用CMake编译链接opencv库的程序时FIND_PACKAGE(OpenCV REQUIRED)报错,<em>找不到</em>opencv,信息如下: Found OpenCV Windows Pack but it has no binaries compatible with your configuration. You should manually p
关于lkf和库文件问题
用stm8 做flash烧写,在工程设置里,把自动使用的lkf改成stm8s208,之后,在主函数(用flash例子程序)里,在调用库函数就出现错误:1 symbol _GPIO_ReadInputData not defined (Debug\main.o )rn这个怎么回事?解决方法。rnrn另外,flash ram rom eeprom 什么关系,谁包含谁??rn
cmake" in CMAKE_MODULE_PATH">Ubuntu14.04 :By not providing "FindEigen3.cmake" in CMAKE_MODULE_PATH
Ubuntu14.04 :By not providing “FindEigen3.<em>cmake</em>” in CMAKE_MODULE_PATH&&By not providing “FindEigen3.今天下载了hector_slam的源码想要跑一下,结果编译不能通过,并且一直出现如下错误,烦得一逼。研究了一会儿,解决了,方法如下: 这是错误提示:CMake Warning at hector_co
环境配置的坑(一)Cmake :: Could not find a package configuration file provided by "xxx"
可能是放置文件<em>问题</em>。 不是说你路径配置错了,可能就算是路径是对的,但是你放到了系统文件夹里(Program Files 和 Program Files (x86))。 然后当你用Cmake编译时候就会报错。我以配置opencv为例: 一开始我将opencv放入Program Files 中: set(OpenCV_DIR C:/Program Files/opencv-3.40/buil...
CMake Error at ../cmake/catkinConfig.cmake:83(find_package):Could not find a package configuration..
零、<em>问题</em>描述 使用ROS时,需要编译别人的功能包,但编译时会出现各种错误,如下的缺少功能包的<em>问题</em>: CMake Error at /opt/ros/kinetic/share/catkin/<em>cmake</em>/catkinConfig.<em>cmake</em>:83 (find_package): Could not find a package configuration file provided by “slam...
ROS工作空间编译的时候出现类似于Could_not_find_a_package_configuration_file _provided _by该如何解决
一、前言 最近电脑又出现了类似于Could not find a package configuration file provided by之类的<em>问题</em>,以往都是直接百度,然后根据别人给的答案直接复制粘贴,但是有时候不一定完全有效,别人给你的是鱼,但是你得学会捕鱼的技术才行,所以俗话说的好,授之以鱼不如授之以渔,不仅要知其然还得知其所以然。 二、“鱼”的方法 也就是我最开始的方法,我最近刚刚把RO...
使用cmake find_package找不到opencv
对<em>cmake</em>的使用不是很熟悉,遇到这个<em>问题</em>为自己简单记录一下。错误如下:CMake Error at CMakeLists.txt:39 (find_package):  By not providing &quot;FindOpenCV.<em>cmake</em>&quot; in CMAKE_MODULE_PATH this project has  asked CMake to find a package configura...
关于库文件问题
前一阵子,在我的程序中用到一个第三方控件,后来发现不太好使,rn就删掉了,可是在link时报错误,说是不能打开第三方控件的<em>库文件</em>,rn可是我在项目内的所有文件中以及project的options中都<em>找不到</em>引用rn该<em>库文件</em>的说明,不得以,只有将该<em>库文件</em>复制到程序的文件夹下,才rn通得过。不过心里总是不爽,不知各位可曾碰到这样的<em>问题</em>,请帮忙rn解决一下。
一个关于库文件问题
我从书中敲入代码后,编译时经常出错,理由是某个<em>库文件</em>没有加入。rn我该如何知道,该加入什么样的<em>库文件</em>。rn可不可以把所有的<em>库文件</em>都加入。rn或对件一本<em>关于</em><em>库文件</em>的书(可以下载)
CMake 构建一个库文件,并进行调用
      一、建立libfile和binfile两个文件夹。其中libfile为<em>库文件</em>,放编译的<em>库文件</em>。binfile文件放可执行程序和文件。 二、libfile文件夹结构如下:                1、build为编译文件夹,lib为源代码文件夹。各个文件夹下面都有一个CMakeLists.txt文件。       主工程目录下(libfile/)的CMakeLists...
关于DirectX库文件问题
最近编译网上下来的源代码(非工程文件),经常出现“无法解析的外部符号”这种错误,尽管我吧d3d9.lib加到工程里面,有一些函数还是不能识别。比如D3dxMatrixRotationX();我查了directx的帮助文件,里面没有每个函数所依赖的<em>库文件</em>。郁闷死!那位大侠能大致介绍一下DirectX的每个<em>库文件</em>都与那种函数有关系吗?最好能把我提到的那个函数依赖的<em>库文件</em>告诉一下。不胜感激!
python3.4安装dlib提示cmake配置出错
is not a full path and was not found in the PATH. To use the NMake generator with Visual C++, <em>cmake</em>
解决Unknown CMake command "QT5_WRAP_UI"类似错误
这种类似的<em>问题</em>LZ前前后后碰到了好几次,这里贴出其中一种,其他也都是类似的解决方法。CMake Error at src/Ui/CMakeLists.txt:15 (FIND_PACKAGE): Could not find module FindQT5.<em>cmake</em> or a configuration file for package QT5. Adjust CMAKE_MO
Unknown CMake command "add_clang_library".
-
问题)">解决错误Unknown CMake command "QT4_WRAP_CPP"(CMAKE对应Qt在Linux/Windows兼容问题
情景:         WINDOWS下的Qt工程,使用<em>cmake</em>构建无误,移植Linux时的错误。ru
OPENCV + CMAKE3.11=VS2015编译错误Unknown CMake command "ocv_download"
虽然之前编译过opencv2.4.9但是这次想用一下opencv3.0.0但是编译的时候一直出现Unknown CMake command &quot;ocv_download&quot;.在网上找了很多方法都没能成功,最后发现是opencv_contrib版本的<em>问题</em>,opencv版本未3.0.0那么opencv_contrib的版本也应该是3.0.0但是直接在Github上下载的是最新版,如下图,选对版本就行了。...
关于库文件缺少的问题
redhat7.2下如果安装net-snmprn我在安装时总是提示有<em>库文件</em><em>找不到</em>rn可我把相关的<em>库文件</em>copy到/usr/lib目录中后rn还是提示<em>找不到</em><em>库文件</em>rn请高手指点rn等待ing
Android studio关于Cmake的使用(第三章·引用第三方库文件
  目录 <em>关于</em>引用so库的方式 1 引用代JNI接口的so文件 1.1 生成一个包含jni接口的so 1.2 使用包含jni接口的so 2 引用纯净的通用so 2.1 构建支持C/C++的工程。 2.3 配置CmakeList.txt信息。 2.4 配置gradle 2.5 验收 2.6 调用 3. 交流与链接 <em>关于</em>引用so库的方式   1 引用代JNI接口的so文件...
Android studio关于Cmake的使用(第二章·编译库文件
作为一个Android开发,最近在工作中需要频繁的与底层交互,就避免不了与.c/.cpp/so/.a打交道。通过不停的学习,总算摸出来了点门道,跟大家交流交流,也把自己踩过的坑列出来,避免后人上当。 目录 一丶工程以及文件夹的创建。 二 丶配置文件编写。 1.配置子Cmake文件。 2.配置Project级CmakeList.txt文件 3.配置module级build.gradle文...
关于Cmake
GCC, make和Cmake的关系: https://www.zhihu.com/question/36609459 Cmake的学习资料: https://mubu.com/doc/t1VDCEn4O0 https://blog.csdn.net/dbzhang800/article/details/6314073(实例解说) https://blog.csdn.net/kai_zone/ar...
关于CMake
安装信息里有这么一段东西 要如何处理?rn本人菜鸟 哪位大侠教下 谢谢了! rnrnYou may need to set -DCMAKE_BUILD_TYPE=debug to build in debug mode.rnThe following build switches you may need to adjust (default is TRUE)rn-DWITH_LIBNOTIFY=TRUErn-DWITH_GSTREAMER=TRUErn-DWITH_LIBXSS=TRUErn-DWITH_NETWORKMANAGER=TRUE
Unknown CMake command "qt5_add_resources".
各位大侠,用CMake生成一个qt项目的vc工程,出现 Unknown CMake command "qt5_add_resources"的错误。我用的CMake 3.5.1。CMakeLists.t
LLVM : Unknown CMake command "add_llvm_loadable_module".
编写LLVM Pass的文档:http://llvm.org/docs/WritingAnLLVMPass.html 1.写Makefile # Makefile for hello pass # Path to top level of LLVM hierarchy LEVEL = ../../.. # Name of the library to build LIBRARYNAME =
as进行NDK开发出现异常:unable to get the cmake version located xxx.处理
1.出现异常:unable to get the <em>cmake</em> version located xxx. 新建完成之后,提示一个没有找到<em>cmake</em>版本的异常:unable to get the <em>cmake</em> version located xxx. 解决方法:到Setting中,下载CMake,默认下载的是最新版本的CMake 2.现在CMake成功之后提示异常:Error:Error o...
NDK开发 从入门到放弃(七:Android Studio 2.2 CMAKE 高效NDK开发)
前言之前,每次需要边写C++代码的时候,我的内心都是拒绝的。 1. 它没有代码提示!!!这意味着我们必须自己手动敲出所有的代码,对于一个新手来说,要一个字母都不错且大小写也要正确,甚至要记得住所有的jni函数等,真是太折磨人了…平时写java代码的时候都是写几个字母会出来一大堆提示然后选择的,这样还有一个好处就是很多时候我们不知道有那些函数,但是我们可以通过obj.,然后就可以看到它有哪些方法函数
解决生成opencv源码时出现的:could not find cmake module file
具体得到源码的sln根据这个博客来的:http://blog.csdn.net/poem_qianmo/article/details/21974023 我的是vs2012以及使用opencv2.48版本,电脑win8.1 64位。 再根据上诉博客的过程中出现在CMake的Configure中一直出现could not find <em>cmake</em> module file,开始脑壳变大,在网上寻找了很
关于cmake
比较好的几个网站: http://sewm.pku.edu.cn/src/paradise/reference/CMake%20Practice.pdf
PHP运行外部程序找不到共享库文件问题
我在一个php文件中要运行一个外部程序aaa. php代码如下(test.php):rnrnrn在linux控制台下执行它:rn>php test.phprnrn没有任何<em>问题</em>。但是当我在web上执行时:rnhttp://my URL/test.phprn却遇到<em>问题</em>,我查看error_log, 里面说我有一个<em>库文件</em><em>找不到</em>(libcov.so.0),但是我那个<em>库文件</em>确实在我的系统目录里面:rnlibcov.so: /usr/local/lib/libcov.so /usr/local/lib/libcov.so.0rnrn我不知道这是怎么回事,我即使把那个文件拷贝到当前脚本目录也不行。 哪位大侠给提示一下如何解决啊? 谢谢了!rnrn
安装sysbench遇到找不到库文件问题
export LD_LIBRARY_PATH=/usr/mysql/lib./configure --prefix=/usr/local/sysbench --with-mysql-includes=/data/eh/mysql/include/ \ --with-mysql-libs=/data/eh/mysql/lib/ --with-mysql=/data/eh/mysql
解决Linux下找不到.so库文件问题
最近在运行某个程序时,报错: error while loading shared libraries: libXXX.so.2.8: cannot open shared object file: No such file or directory 经过查找,在程序自带的 lib 目录下发现了这个包。所以只需要把这个lib目录配置到系统寻找.so文件的路径即可。 具体方法 打开/etc/ld....
解决xx.so 库文件找不到方法
find / -name xxx.so 比如 root@localhost application]# find / -name libpcre.so /usr/lib64/libpcre.soecho “/usr/lib64” >> /etc/ld.so.conf 写到ld.so.conf 文件里 ldconfig 执行生效
c语言源代码程序下载
一些比较经典的c源代码程序,非常适合初学者参考学习 相关下载链接:[url=//download.csdn.net/download/fuxianchao2009/3608236?utm_source=bbsseo]//download.csdn.net/download/fuxianchao2009/3608236?utm_source=bbsseo[/url]
FastCAM自动编程套料软件5.10下载
自动套料编程软件 相关下载链接:[url=//download.csdn.net/download/userzhs/4847991?utm_source=bbsseo]//download.csdn.net/download/userzhs/4847991?utm_source=bbsseo[/url]
爱思刷机助手下载
爱思iphone刷机助手,,,可平刷可降级,不错的选择 相关下载链接:[url=//download.csdn.net/download/sinat_20611673/7890795?utm_source=bbsseo]//download.csdn.net/download/sinat_20611673/7890795?utm_source=bbsseo[/url]
相关热词 c#检测非法字符 c#双屏截图 c#中怎么关闭线程 c# 显示服务器上的图片 api嵌入窗口 c# c# 控制网页 c# encrypt c#微信网页版登录 c# login 居中 c# 考试软件
我们是很有底线的