error MSB3073 代码为 3 [问题点数:20分,结帖人wshcdr]

Bbs1
本版专家分:0
结帖率 66.67%
error MSB3073: :VCEnd”已退出,代码为 3
C:\Program Files (x86)\MSBuild\Microsoft.Cpp\v4.0\V120\Microsoft.CppCommon.targets(127,5): <em>error</em> MSB3073: 命令“copy"E:\TianTianLeGame\proj.win32\Debug.win32\libbox2d_2013.lib" "libbox2d.lib"  rnC:\Program Files (x86)\MSBuild\Microsoft.Cpp\v4.0\V120\Microsoft.CppCommon.targets(127,5): <em>error</em> MSB3073: copy "E:\TianTianLeGame\proj.win32\Debug.win32\libSpine_2013.lib" "libSpine.lib"  rn>C:\Program Files (x86)\MSBuild\Microsoft.Cpp\v4.0\V120\Microsoft.CppCommon.targets(127,5): <em>error</em> MSB3073: copy"E:\TianTianLeGame\proj.win32\Debug.win32\libcocos2d_2013.lib" "libcocos2d.lib"  rnC:\Program Files (x86)\MSBuild\Microsoft.Cpp\v4.0\V120\Microsoft.CppCommon.targets(127,5): <em>error</em> MSB3073:copy "E:\TianTianLeGame\proj.win32\Debug.win32\libluacocos2d_2013.lib" "libluacocos2d.lib"rnC:\Program Files (x86)\MSBuild\Microsoft.Cpp\v4.0\V120\Microsoft.CppCommon.targets(127,5): <em>error</em>MSB3073: :VCEnd”已退出,<em>代码</em>为 3。[/b]
error MSB3073的解决方案
1>C:\Program Files (x86)\MSBuild\Microsoft.Cpp\v4.0\V110\Microsoft.CppCommon.targets(134,5): <em>error</em> MSB3073: 命令“xcopy /E /F "C:/Users/mr/Desktop/mpsdk_progen/mpsdk_progen/sample.PC/mpviewer/resources/*
error MSB3073 错误解决办法
如果编译出现这个错误估计是版本不太不同造成的, 双击错误来到错误的地方 删除让你错误的那行, 编译没必要搞那么复杂
error MSB3073 VCEnd 已退出,代码为1
错误 1 <em>error</em> MSB3073: 命令“cd ..nregsvcs /u "Web\bin\PetShop.BLL.dll"ngacutil /u SQLServer\bin\Release\PetShop.SQLServerDAL.dllngacutil /u Oracle\bin\Release\PetShop.OracleDAL.dllngacutil /u Utility\bin\Release\PetShop.Utility.dllnn:VCEnd”已退出,<em>代码</em>为 1。 uildnnnn
编译ogre源码的时候出错 error MSB3073
编译ogre源码的时候出错 ``` 错误 86 <em>error</em> MSB3073: 命令“"C:\Program Files\CMake 2.8\bin\cmake.exe" -E make_directory E:/ogre_src_v1-7-2/VS2008/lib/Debug if <em>error</em>level 1 goto VCReportError :VCEnd”已退出,<em>代码</em>为 1。
MSB3073错误
VS版本 2015[img=https://img-bbs.csdn.net/upload/201806/12/1528767737_606703.png][/img]
error MSB3073: :VCEnd" exited with code 1
最近在用vc++做图象处理,需要用到矩阵的运算,有些像矩阵的cholesky分解的算法opencv无法提供,于是尝试安装gsl函数库,我使用的是vs2010,下载了gsl1.14函数库,按照说明编译gsldefs.vcxproj和gslhdrs。vcxproj时,gsldefs.vcxproj编译失败,提示错误为:rnrn1> Incorrect working directory: H:\gsl-1.14\build.vc10rn1> C:\Program Files\MSBuild\Microsoft.Cpp\v4.0\Microsoft.CppCommon.targets(113,5): <em>error</em> MSB3073: The command ""H:\gsl-1.14\build.vc10\gsldefs\Debug\gsldefs.exe"rn1> C:\Program Files\MSBuild\Microsoft.Cpp\v4.0\Microsoft.CppCommon.targets(113,5): <em>error</em> MSB3073: :VCEnd" exited with code 1.rn========== Build: 0 succeeded, 1 failed, 0 up-to-date, 0 skipped ==========rn rn我在网上查了一下,说是路径的问题,但是都没有提供具体的修改方式,所以希望高手们能帮助小弟一下,谢谢!!
vs2013遇到 MSB3073错误
[img=https://img-bbs.csdn.net/upload/201604/22/1461288820_202565.jpg][/img]rnwindows 7rnVS2013rn安装[url=https://github.com/Microsoft/caffe]mcrosoft-caffe[/url]遇到这个问题,请问是什么原因?
error MSB6006: “cmd.exe”已退出,代码为 3。
这两天调程序遇到一个奇怪的问题。 C:\Program Files (x86)\MSBuild\Microsoft.Cpp\v4.0\Microsoft.CppCommon.targets(171,5): <em>error</em> MSB6006 cmd.exe 已退出,<em>代码</em>为3。 百思不得解,看过了很多方法,都不奏效,无意中看到Stackoverflow的一个回答: 于是我编辑了.vcpro
error MSB6006: “cmd.exe”已退出,代码为 3。
出现错误:错误 1 <em>error</em> MSB6006: “cmd.exe”已退出,<em>代码</em>为 3。 151 C:\Program Files\MSBuild\Microsoft.Cpp\v4.0\Microsoft.CppCommon.targets 6 ZERO_CHECK 原因
error MSB600: “cmd.exe”已退出 代码为3
<em>error</em> MSB600: “cmd.exe”已退出 <em>代码</em>为3 被此问题折腾了半天...... 工程是拷贝的别人的,修改部分<em>代码</em>后,重新生成报错,把修改的部分改回来同样不能运行...... 在修改<em>代码</em>重新生成之前,可以通过编译,能够运行。 原因是当前机器与之前机器cmake的路径不匹配 在当前机器重新cmake解决问题!
error MSB6006: “cmd.exe”已退出,代码为 3
1>------ 已启动生成: 项目: DualSPHysics, 配置: Release x64 ------ 1>生成启动时间为 2015/7/29 15:14:25。 1>InitializeBuildStatus: 1>  正在对“Intermediate\DualSPHysics_Release_x64\DualSPHysics.unsuccessfulbuild”执行 Touch
error MSB6006 cmd.exe 已退出 代码为3
各路大神:小弟遇到一个问题 ,QT4.8.2 + VS2010 编译 出现上了如题错误。rn打开详细问题时:rn1、报系统找不到指定的路径(MOC \Bin\mox.exe xxx\xxx\xxx\xxx\xxx.h),但是原<em>代码</em>中没有那些文件,这是什么情况?rn2、是不是.h.lib文件路径配置有问题,小弟我已经把该配置都配置了,还是出现上述问题rn3、C:\Program Files (x86)\MSBuild\Microsoft.Cpp\v4.0\Microsoft.CppCommon.targets(151,5): <em>error</em> MSB6006 cmd.exe 以退出,<em>代码</em>为3
error MSB6006: “cmd.exe”已退出,代码为3
“cmd.exe”已退出,<em>代码</em>为9009,多为路径问题,解决方法可参考这里(链接) “cmd.exe”已退出,<em>代码</em>为1,多为moc_文件冲突,解决方法可参考这里(链接) “cmd.exe”已退出,<em>代码</em>为1,如果发生在QT+VS开发环境下的工程编译,解决方法:项目右键->Convert Project to QMake Generated Project,然后重新编译即可:
error MSB3073 这是什么错误呀?大家快来帮忙!
SMSClientService -> E:\ServiceMeSMS Project\ServiceMeSMS\SMSClientService\bin\Debug\SMSClientService.exerncopy E:\ServiceMeSMS Project\ServiceMeSMS\SMSClientService\\SMSClientServiceconfigure.ini E:\ServiceMeSMS Project\ServiceMeSMS\SMSClientService\bin\Debug\\SMSClientServiceconfigure.inirn系统找不到指定的文件。rnC:\WINDOWS\Microsoft.NET\Framework\v2.0.50727\Microsoft.Common.targets(3109,13): <em>error</em> MSB3073: 命令“copy E:\ServiceMeSMS Project\ServiceMeSMS\SMSClientService\\SMSClientServiceconfigure.ini E:\ServiceMeSMS Project\ServiceMeSMS\SMSClientService\bin\Debug\\SMSClientServiceconfigure.ini”已退出,返回值为 1。rn已完成生成项目“SMSClientService.csproj”-- 失败。
vs 工程 错误 error MSB3073: 命令 原因之一
有时,会突然间好好的工程就一堆下图的错误: 其中一个原因是调试或运行后,程序进程并没有关闭,可在资源管理器中看到,于是dll被占用,自然不能被编译出的dll替换。 手动结束进程后再编译就没问题 了,所以问题就在于程序关闭后为什么进程还没结束。
新人求助!编译gdcm时error MSB3073: 命令“setlocal
我在用vs2010编译gdcm(类似于vtk)的时候,生成INSTALL的时候提示<em>error</em> MSB3073: 命令“setlocalrn求助!设置管理员权限运行没有用。。。怎么办
VS 编译出错:MSB3073
今天在VS上修改工程遇到了MSB3070 错误,总的来说没有其他原因,就是在Project -> Properties -> Build Event -> prebuild/postbuild 中 command line 写错了,切记再三check 你所写的命令正确性, 包括语法,命令参数和 文件名文件路径的正确性。 如果不确定,可以在当前工程目录下,切记是当前工程的目录下执行用cmd执行你的命
VS2013 分支映射编译不通过,提示信息有差异,error MSB3073 VCEnd已退出,代码为4,LINK 1104无法打开文件
一个大型项目,新建的分支在别人的电脑上已经编译通过,在本机映射后编译总是不通过。&amp;gt;&amp;gt;===当时具体操作如下===&amp;lt;&amp;lt;1. 打开解决方案会提示:“解决方案有关某些项目的源<em>代码</em>管理信息与项目文件中的信息似乎有差异。要解决此差异,需要签出项目文件并更新他们。。。”(如下图)。点击“确定”后,提示签出一个xx.vcxproj文件。这个文件不是我写的,点了“取消”。2. 打开解决方案...
VS2015种 MSB3073和LNK1104的解决办法
1、MSB3073 :错误列表一般显示:一个mikedir命令和copy命令出错,严格找一下这个路径,也许是路径名字一个字幕的大小写问题。其次:Build Events-&amp;gt;Post Build Events。这个地方要求运行一个cmd脚本,脚本里就写了一些拷贝命令,把一些文件从a路径拷贝到b路径,而其中一个命令里,路径b并不存在,所以拷贝失败,导致报了这个错误。2、LNK1104: 显示打不...
VS2013+CMake+编译时遇到的问题 MSB3073
bulid INSTALL工程时,发生如下错误: <em>error</em> MSB3073: The command "setlocal E:\cmake3.0.0\CMake\bin\cmake.exe -DBUILD_TYPE=Debug -P cmake_install.cmake if %<em>error</em>level% neq 0 goto :cmEnd :cmEnd endlocal & call
load error 3
我用的是win xp sp2 经常会在开机的时间出现 rn“windows xp could not start because of an <em>error</em> in the software rnplease report this problem as: rnloader <em>error</em> 3 rnplease contact your support person to rerson to report this problem”rnrn请问个位大侠如何解决?
jadclipse 错误 error=3
/*jadclipse*/rnrn/*rn DECOMPILATION REPORTrnrn Decompiled from: E:\Workspace\trainer\trainer\lib\grizzly-all-2.0.0.jarrn Total time: 16 msrn Jad reported messages/<em>error</em>s:rn Exit status: 0rn Caught exceptions:rnjava.io.IOException: CreateProcess: "C:\Program Files\Java\jdk1.6.0_02\bin\jad.exe" -p -t4 -lradix10 -radix10 TCPNIOTransport.class <em>error</em>=3rn at java.lang.ProcessImpl.create(Native Method)rn at java.lang.ProcessImpl.(Unknown Source)rn at java.lang.ProcessImpl.start(Unknown Source)rn at java.lang.ProcessBuilder.start(Unknown Source)rn at java.lang.Runtime.exec(Unknown Source)rn at net.sf.jadclipse.JadDecompiler.decompile(JadDecompiler.java:160)rn at net.sf.jadclipse.JadDecompiler.decompileFromArchive(JadDecompiler.java:217)rn at net.sf.jadclipse.JadclipseSourceMapper.findSource(JadclipseSourceMapper.java:150)rn at net.sf.jadclipse.JadclipseSourceMapper.findSource(JadclipseSourceMapper.java:83)rn at net.sf.jadclipse.JadclipseClassFileEditor.doOpenBuffer(JadclipseClassFileEditor.java:87)rn at net.sf.jadclipse.JadclipseClassFileEditor.doSetInput(JadclipseClassFileEditor.java:45)rn at net.sf.jadclipse.JadclipseActionBarContributor.setActiveEditor(JadclipseActionBarContributor.java:87)rn at org.eclipse.ui.internal.EditorActionBars.partChanged(EditorActionBars.java:335)rn at org.eclipse.ui.internal.WorkbenchPage$3.run(WorkbenchPage.java:629)rn at org.eclipse.core.runtime.SafeRunner.run(SafeRunner.java:37)rn at org.eclipse.core.runtime.Platform.run(Platform.java:857)rn at org.eclipse.ui.internal.WorkbenchPage.activatePart(WorkbenchPage.java:618)rn at org.eclipse.ui.internal.WorkbenchPage.setActivePart(WorkbenchPage.java:3398)rn at org.eclipse.ui.internal.WorkbenchPage.activate(WorkbenchPage.java:611)rn at org.eclipse.ui.internal.WorkbenchPage.busyOpenEditorBatched(WorkbenchPage.java:2748)rn at org.eclipse.ui.internal.WorkbenchPage.busyOpenEditor(WorkbenchPage.java:2651)rn at org.eclipse.ui.internal.WorkbenchPage.access$13(WorkbenchPage.java:2643)rn at org.eclipse.ui.internal.WorkbenchPage$10.run(WorkbenchPage.java:2595)rn at org.eclipse.swt.custom.BusyIndicator.showWhile(BusyIndicator.java:67)rn at org.eclipse.ui.internal.WorkbenchPage.openEditor(WorkbenchPage.java:2590)rn at org.eclipse.ui.internal.WorkbenchPage.openEditor(WorkbenchPage.java:2574)rn at org.eclipse.ui.internal.WorkbenchPage.openEditor(WorkbenchPage.java:2565)rn at org.eclipse.jdt.internal.ui.javaeditor.EditorUtility.openInEditor(EditorUtility.java:299)rn at org.eclipse.jdt.internal.ui.javaeditor.EditorUtility.openInEditor(EditorUtility.java:173)rn at org.eclipse.jdt.ui.actions.OpenAction.run(OpenAction.java:194)rn at org.eclipse.jdt.ui.actions.OpenAction.run(OpenAction.java:152)rn at org.eclipse.jdt.ui.actions.SelectionDispatchAction.dispatchRun(SelectionDispatchAction.java:272)rn at org.eclipse.jdt.ui.actions.SelectionDispatchAction.run(SelectionDispatchAction.java:244)rn at org.eclipse.jdt.internal.ui.javaeditor.JavaElementHyperlink.open(JavaElementHyperlink.java:56)rn at org.eclipse.jface.text.hyperlink.HyperlinkManager.mouseUp(HyperlinkManager.java:429)rn at org.eclipse.swt.widgets.TypedListener.handleEvent(TypedListener.java:206)rn at org.eclipse.swt.widgets.EventTable.sendEvent(EventTable.java:66)rn at org.eclipse.swt.widgets.Widget.sendEvent(Widget.java:938)rn at org.eclipse.swt.widgets.Display.runDeferredEvents(Display.java:3682)rn at org.eclipse.swt.widgets.Display.readAndDispatch(Display.java:3293)rn at org.eclipse.ui.internal.Workbench.runEventLoop(Workbench.java:2389)rn at org.eclipse.ui.internal.Workbench.runUI(Workbench.java:2353)rn at org.eclipse.ui.internal.Workbench.access$4(Workbench.java:2219)rn at org.eclipse.ui.internal.Workbench$4.run(Workbench.java:466)rn at org.eclipse.core.databinding.observable.Realm.runWithDefault(Realm.java:289)rn at org.eclipse.ui.internal.Workbench.createAndRunWorkbench(Workbench.java:461)rn at org.eclipse.ui.PlatformUI.createAndRunWorkbench(PlatformUI.java:149)rn at org.eclipse.ui.internal.ide.application.IDEApplication.start(IDEApplication.java:106)rn at org.eclipse.equinox.internal.app.EclipseAppHandle.run(EclipseAppHandle.java:169)rn at org.eclipse.core.runtime.internal.adaptor.EclipseAppLauncher.runApplication(EclipseAppLauncher.java:106)rn at org.eclipse.core.runtime.internal.adaptor.EclipseAppLauncher.start(EclipseAppLauncher.java:76)rn at org.eclipse.core.runtime.adaptor.EclipseStarter.run(EclipseStarter.java:363)rn at org.eclipse.core.runtime.adaptor.EclipseStarter.run(EclipseStarter.java:176)rn at sun.reflect.NativeMethodAccessorImpl.invoke0(Native Method)rn at sun.reflect.NativeMethodAccessorImpl.invoke(Unknown Source)rn at sun.reflect.DelegatingMethodAccessorImpl.invoke(Unknown Source)rn at java.lang.reflect.Method.invoke(Unknown Source)rn at org.eclipse.equinox.launcher.Main.invokeFramework(Main.java:508)rn at org.eclipse.equinox.launcher.Main.basicRun(Main.java:447)rn at org.eclipse.equinox.launcher.Main.run(Main.java:1173)rn at org.eclipse.equinox.launcher.Main.main(Main.java:1148)rnrnrn*/ 小弟没分。。 球球好心人救救我。。 - -
数据结构代码3数据结构代码3数据结构代码3数据结构代码3数据结构代码3
数据结构<em>代码</em>3数据结构<em>代码</em>3数据结构<em>代码</em>3数据结构<em>代码</em>3数据结构<em>代码</em>3
“cmd.exe”已退出,代码为 3。
C:\Program Files\MSBuild\Microsoft.Cpp\v4.0\Microsoft.CppCommon.targets(151,5): <em>error</em> MSB6006: “cmd.exe”已退出,<em>代码</em>为 3。
“cmd.exe”已退出,代码为 3
[b][/b][size=14px][/size]不太了解 是不是 库没有包含进去的意思啊 求指点!
MSB6006 “cmd.exe”已退出,代码为 3
rn错误 MSB6006 “cmd.exe”已退出,<em>代码</em>为 3。 i18n C:\Program Files (x86)\MSBuild\Microsoft.Cpp\v4.0\V140\Microsoft.CppCommon.targets 171 rn
为何用 “ON ERROR GOTO "不能catch Error
你好!rn 现有该问题如下:rn 我在程序中用“ON ERROR GOTO” 语句去抓住错误信息,第一次,错误被抓住rn 了,然后我让程序继续,在同样的错误(号码:438)时,程序自己跳出MSGBOX框rn (END、DEBUG、HELP),而没有被抓住。rn 十分感谢!rnrnrnrnrnrnrn rn
安卓报错Error type 3
错误: 项目运行的时候报错。 原因是因为在AndroidManifest.xml文件中标签只能有一个。 犯这个错误的只要两种情况一就是新手什么都不懂,复制多了。还有一种就是太马虎,还是复制多了。 我就是新手,最后还是请别人帮我看出来的。特别是在网上搜解决办法的时候,跟我的其实不一样,但是报错是一样的,以至于一直解决不了,所以特意发了这个帮助新手。 我的是这样的: 把如同所示的那
Error type 3错误异常解决
今天笔者在这里也是遇到一个很奇怪的问题,之前一直用的公司的测试机,华为系列的手机,在进行调试的时候是没问题的,因为笔者最近也是换了一部新的乐视手机,所以就想试着调试看看,结果报了这个错误。几经周折,也是终于得到了解决。解决方案1:我们可以看到他的提示大概意思是说,找不到我们的主activity,于是下意识的就去AndroidManifest.xml文件中寻找这个activity,可是他确实是存在的,
编程自己常见error(3)
继续上一篇进行总结。 编程自己常见<em>error</em>(3) 11、关于split()函数 在学习的过程中遇到split()函数,也就是通过指定分隔符对字符串进行切片,分隔。 分割的时候:分隔符,默认为所有的空字符,包括空格(space)、换行(\n)、制表符(\t)等。 当我们指定分隔数量时候,就会按照数量来。我自己大致总结了几种关于这个函数的用法: 示例1 简单分隔 a = &quot;nihao \nner...
VS2015 编译QT项目出现error MSB6006: “cmd.exe”已退出,代码为 3。
利用vs2015和qt5.7,在编译例子时发生如下错误: C:\Program Files (x86)\MSBuild\Microsoft.Cpp\v4.0\V110\Microsoft.CppCommon.targets(172,5): <em>error</em> MSB6006: “cmd.exe”已退出,<em>代码</em>为 3。 图片如下: 解决办法如下: 右键点击项目,选择“Convert pro
visual studio 编译问题:error MSB6006: “CL.exe”已退出,代码为 3。
visual studio 编译问题:<em>error</em> MSB6006: “CL.exe”已退出,<em>代码</em>为 3。rnrn主要是我在头文件.h放了一个61MBytes的数组,导致整个.h文件大小达到260MBytes。rn原本这个数组的数据是从电脑硬盘读入程序的,现在想脱离电脑端读取,唯一可以想到的是将64701556 Bytes的数据放入头文件,大家不知道有没有其他办法?Thank you.rnrn[img=https://img-bbs.csdn.net/upload/201703/22/1490145044_547397.jpg][/img]
测试error代码
toolbar测试<em>代码</em>,提供进行测试使用
代码error,为什么
int i;rnconst int ci = 3;rnint *ip;rnip=&i;rn[color=#FF0000]ip=&ci; ------ //<em>error</em>[/color]rnconst int *cip;rncip= &i; //rn
cocos2d-win32打不开怎么办啊 错误MSB3073
我用的win7 vs2015 cocos 2dx 3.15 但是打不开cocos2dwin32 怎么办 好伤心啊 求大神解答!!! [img=https://forum.csdn.net/PointForum/ui/scripts/csdn/Plugin/001/face/5.gif][/img][img=https://img-bbs.csdn.net/upload/201706/12/1497209705_674311.png][/img][img=https://img-bbs.csdn.net/upload/201706/12/1497209723_911821.png][/img][img=https://img-bbs.csdn.net/upload/201706/12/1497209734_442146.png][/img][img=https://img-bbs.csdn.net/upload/201706/12/1497209745_18817.png][/img]
游戏报错代码,error
游戏的报错,<em>error</em>,以一款游戏作为参考
这段代码syntax error?
dw_1.function trigger ddlb_from _tab("absence_type","a_type,a_name","","","","ddlb_a") rnrn说明: rn1.ddlb_from _tab(....) rn在数据窗口中新增记录,指定数据列获得输入焦点后,自动弹出DownListBox,其中的DataValue/Show Value均从数据库中获得(函数最后一个参数是指定数据列中downlistbox的名称,类型是dropdownlistbox) rn2.包含此数据窗口的窗口有一个"Add"命令按钮,我把此段<em>代码</em>放在其clicked事件中 rn3.存盘时,提示"syntax <em>error</em>" rn
代码一直error
我刚学习用VC编程,新建了一个对话框的工程。rn然后什么都没做,就把我以前写的一个类文件.h跟.cpp文件添加到工程。rn编译一直无法通过,报change.cpp(110) : fatal <em>error</em> C1010: unexpected end of file while looking for precompiled header directivern执行 cl.exe 时出错.rnrn到底怎么回事啊?rnrn#include rn#include rn#include rnrnusing namespace std; rnrnclass changernrnpublic:rn change();rn void cha_list(unsigned int amount,string str);rnrnrnprivate:rn unsigned int day;rn unsigned int hour;rn unsigned int seconds;rn rn;rnrnrn错误一直指向我的头文件末尾,我头文件爱你没问题啊,以前还单独编译通过的,那位大哥解释帮我分析下。rn
代码3
#include&amp;lt;stdio.h&amp;gt; //static int j; //void fun1(void) //{ // static int i = 0; // i++; // printf(&quot;i=%d&quot;, i); // //} // //void fun2(void) //{ // j = 0; // j++; // printf(&quot;j=%d&quot;, j); // pri...
spark 日志级别设置为ERROR
想只显示ERROR日志。 方式1 <em>代码</em>里设置 val sc = new SparkContext(conf) sc.setLogLevel("ERROR") 这个启动时,仍然会有月一些其他日志. 方式2 log4j.properties文件设置 1.新建一个resource目录,在文件夹上右击,mark as reources root。 2.新建一个log4j.properties...
错误 1 error MSB6006: “cmd.exe”已退出,代码为 2。
最近在运行一个VS2013+CUDA8.0+Qt5.9小项目时遇到一些问题,前一篇博客安装了CUDA8.0后,运行项目发现还是出了几个问题。主要是以下两个: ①CUDA版本不对,加载项目才发现在这个文件夹下C:\Program Files (x86)\MSBuild\Microsoft.Cpp\v4.0\V120\BuildCustomizations找不到CUDA7.5的一个文件。根据错误提示...
error MSB6006: “cmd.exe”已退出,代码为 1
在win7 64位专业版下,写了了一个服务,每次build的时候都会出现标题中的错误,有没有哪位大神帮忙解释下为什么呀。输出如下:rnrn1>------ 已启动生成: 项目: AsclImage, 配置: Debug Win32 ------rn1> Generating Message Cataloguern1> Microsoft (R) Message Compiler Version 1.12.7600rn1> Copyright (c) Microsoft Corporation. All rights reserved.rn1> rn1> usage:rn1> MC [-?aAbcdnouUv] [-m ] [-h ] [-e ] [-r ] [-x ]rn1> [-w ] [-W ] [-z ] rn1> [-km | -um | -cs ] [-mof] [-p ] [-P ]rn1> [] []rn1> rn1> -? - displays this messagern1> -a - input file is ANSI (default).rn1> -A - messages in .BIN file should be ANSI.rn1> -b - .BIN filename should have .mc filename included for uniqueness.rn1> -c - sets the Customer bit in all of the message Ids.rn1> -d - FACILTY and SEVERITY values in header file in decimal.rn1> Sets message values in header to decimal initially.rn1> -e - Specify the extension for the header file (1-3 chars)rn1> -h - gives the path of where to create the C include filern1> Default is .\rn1> -m - generate a warning if the size of any message exceedsrn1> characters.rn1> -n - terminates all strings with null's in the message tables.rn1> -o - generate OLE2 header file (use HRESULT definition instead ofrn1> status code definition)rn1> -r - gives the path of where to create the RC include filern1> and the binary message resource files it includes.rn1> Default is .\rn1> rn1> -s - generate binary resource per providerrn1> generate summary global resource MCGenResource.BINrn1> rn1> -t - validate against baseline resourcern1> rn1> -u - input file is Unicode.rn1> -U - messages in .BIN file should be Unicode (default).rn1> -v - gives verbose output.rn1> -W - specifies path to winmeta.xml file.rn1> -w - specifies path to eventman.xsd file.rn1> -x - gives the path of where to create the .dbg C includern1> file that maps message Ids to their symbolic name.rn1> This option can only be used with message text file.rn1> -z - gives the base name of the generated files.rn1> Default is basename of input file.rn1> - gives the name of manifest file to compilern1> - gives the name of a message file to compilern1> rn1> Code Generation Optionsrn1> ----------------------- rn1> -km - generate Kernel Mode logging macrosrn1> -um - generate User Mode logging macrosrn1> -cs - generate C# (managed) logging classrn1> based on FX3.5 Eventing classrn1> -css - generate static C# (managed) logging classrn1> based on FX3.5 Eventing classrn1> rn1> -co - add callout macro to invoke user code at loggin.rn1> not availalbe for c#, and ignored.rn1> -mof - generate downlevel support for all function/macros generated.rn1> MOF file will be generated from the manifest. rn1> MOF file will be placed in the location specified by rn1> the "-h" switch.rn1> -p - defines the macro name prefix applied to rn1> each generated logging macro. rn1> Default is "EventWrite"rn1> -P - defines the text at the start of each event rn1> symbol name to remove before forming the macro names. rn1> Default is NULL.rn1> rn1> Note: Switches 'w' and 'W' are not required and will be removed in future.rn1> Note: At most one .mc and/or one .man file can be processed in one invocation.rn1> Note: Generated files have the Archive bit cleared.rn1>C:\Program Files (x86)\MSBuild\Microsoft.Cpp\v4.0\Microsoft.CppCommon.targets(151,5): <em>error</em> MSB6006: “cmd.exe”已退出,<em>代码</em>为 1。rn========== 生成: 成功 0 个,失败 1 个,最新 0 个,跳过 0 个 ==========
Error MSB6006: “mt.exe”已退出,代码为 31
当在VS.NET中运行C++所编译的项目时,错误列表中出现  :Error MSB6006: “mt.exe”已退出,<em>代码</em>为 31   解决方法: project options -> linker -> manifest -> Generate Manifest-> NO. 项目->属性->链接器->清单文件->生成清单  改为 “否” 点击总项目如图
解决error MSB6006: “CL.exe”已退出,代码为 -1073741515。
我的VS2012出现莫名其妙的问题。 到C:\Program Files (x86)\Microsoft Visual Studio 11.0\VC\bin目录下找到的cl.exe; 发现cl.exe打开会报错; 结果是缺少msobj110.dll、mspdb110、mspdbcore.dll及mspdbsrv.exe这几个文件; 将C:\Program Files (x86)\Micro...
error MSB6006: “rc.exe”已退出,代码为 1
程序编译通过了,但是运行弹出,<em>error</em> MSB6006: “rc.exe”已退出,<em>代码</em>为 1,这这是什么问题,怎么解决啊,求指教
error MSB6006: “cmd.exe”已退出,代码为1
“cmd.exe”已退出,<em>代码</em>为9009多为路径问题,解决方法可参考这里(链接) 如果是“cmd.exe”已退出,<em>代码</em>为1,解决方法如下: 点开项目目录Generated Files,可以看到moc_文件,将moc文件对应的.h头文件移除(注意是移除不是删除),再添加进来,会重新自动生成对应moc文件,如果Generated Files下没有moc文件,那么可以把.h头文件全部移除再添
出现“error MSB6006: “CL.exe”已退出,代码为 2。”
使用环境为vs2019,突然报上述错误,开始查找了环境变量、修改bin中文件等操作,最终没什么用,最后发现<em>代码</em>中有个函数没写返回值,修改后编译成功了,犯了低级错误。 以此警醒。 ...
代码为5">VS2010 error MSB6006:"CL.exe"已退出,代码为5
我的电脑是WIN7,32位,VS2010 总是出现这个错误,C:\Program Files (x86)\MSBuild\Microsoft.Cpp\v4.0\Platforms\Win32\Microsoft.Cpp.Win32.Targets(147,5): <em>error</em> MSB6006: “CL.exe”已退出,<em>代码</em>为 5。多次重装软件,用几天就又这样了,重装过系统,依然没什么用。这是个什么问题,该怎么解决呢?求大神们指教。rn
VS2010 编译出错 error MSB6006: “CL.exe”已退出,代码为 -1073740777
2>生成启动时间为 2012-11-26 15:44:48。rn2>InitializeBuildStatus:rn2> 正在对“Debug.win32\PalaceClient.unsuccessfulbuild”执行 Touch 任务。rn2>cl : 命令行 warning D9014: 值“325”对于“/wd”无效;假定为“4999”rn2> PalaceHeader.cpprn2>C:\Program Files\MSBuild\Microsoft.Cpp\v4.0\Platforms\Win32\Microsoft.Cpp.Win32.Targets(57,5): <em>error</em> MSB6006: “CL.exe”已退出,<em>代码</em>为 -1073740777。rn2>rn2>生成失败。rn2>rn2>已用时间 00:00:10.39rn========== 生成: 成功 1 个,失败 1 个,最新 0 个,跳过 0 个 ==========rnrn网上试了很多种方法都无法解决,今天早上一来就出现了,也不知道是什么状况,求助
error msb6006 CL.exe已退出,代码为5
我新装的系统,项目没问题,是win10iot 下载的想编译一下,就提示这个,怎么也过不去,没开杀毒软件。网上查的也不管用。求助一下大神。rnrn[img=https://img-bbs.csdn.net/upload/201703/10/1489125554_879780.png][/img]rnrn
【VS2012编译错误】error MSB6006: “CL.exe”已退出,代码为 -1073741515。
在别人的电脑上的VS2012可以正常运行。。但我编译的时候rn1>------ 已启动生成: 项目: CSA, 配置: Debug Win32 ------rn1>生成启动时间为 2014/9/8 10:29:34。rn1>InitializeBuildStatus:rn1> 正在创建“Debug\CSA.unsuccessfulbuild”,因为已指定“AlwaysCreate”。rn1>C:\Program Files\MSBuild\Microsoft.Cpp\v4.0\V110\Microsoft.CppCommon.targets(249,5): <em>error</em> MSB6006: “CL.exe”已退出,<em>代码</em>为 -1073741515。rn1>rn1>生成失败。rn1>rn1>已用时间 00:00:01.42rn========== 生成: 成功 0 个,失败 1 个,最新 0 个,跳过 0 个 ==========rnrn求问各位大神。。
error MSB30073:命令....:VCEnd 已退出,代码为4
参考了这个帖子的解决方法http://bbs.csdn.net/topics/390859930 问题大概为找不到CmLib.lib文件,在别的文件夹中找到该文件,放到指定的位置 其中..\Lib\代表的是Cmlib.lib所在文件夹的上一个文件夹中的Lib文件,即为与x64同级别的文件夹Lib 切记!!!路径中不许出现中文以及非法符号!!(包括空格) eg:saliency
error MSB6006: “link.exe”已退出,代码为 1104。
在安装VS的文件目录下的Common7/IDE下复制以下几个文件: msobj100.dll mspdb100.dll mspdbcore.dll mspdbsrv.exe 然后在VS的安装目录下找到VC/bin,将上面的这几个文件复制在这个目录下,项目--清理解决方案,然后再重新生成解决方案,问题就解决了。
error MSB6006: “cmd.exe”已退出,代码为 -1。
1>------ 已启动生成: 项目: draw, 配置: Debug x64 ------rn1>生成启动时间为 2011/11/16 13:30:34。rn1>CustomBuild:rn1> Performing Custom Build Toolsrn1> nvcc fatal : No input files specified; use option --help for more informationrn1>C:\Program Files (x86)\MSBuild\Microsoft.Cpp\v4.0\Microsoft.CppCommon.targets(151,5): <em>error</em> MSB6006: “cmd.exe”已退出,<em>代码</em>为 -1。rn1>rn1>生成失败。rn1>rn1>已用时间 00:00:00.03rn========== 生成: 成功 0 个,失败 1 个,最新 0 个,跳过 0 个 ==========rnrnwin7 64位 + vc2010 + toolkit 3.2 + sdk4, 编译的时候出现错误rnrn用vc2005编译就没有问题。 怎么回事啊
为什么的代码出现“ There‘s an error in your program:invalid syntax”
为什么的<em>代码</em>出现“ There‘s an <em>error</em> in your program:invalid syntax”rn啥也不说,上<em>代码</em>:rn[color=#00CCFF]# -*- coding: utf-8 -*-rnimport socketrnimport rernimport osrnimport createtable #调用另外一个py文件。rnrna=socket.socket(socket.AF_INET,socket.SOCK_STREAM)rna.bind(("127.0.0.1",8888))rna.listen(10)rnwhile(1):rn cs,ca=a.accept()rn cs.settimeout(120) #设置超时rn msg=cs.recv(1024)rnrnif msg== '1':rn connection.send('welcome to server!')rn print carn print msgrnrncreatetable.createtable()rnclass find_friend(name varchar(128),age int(4)):rn try:rn conn = MySQLdb.connect(host='localhost',user='root',passwd='1',db='test')rn except Exception, e:rn print ern sys.exit() rn def find_name(VARCHAR name):rn find_condition_name=namern sql = "select * from person where name = s% "rn cursor.execute(sql,(find_condition_name))rn def find_age(INT age):rn find_condition_age=agern sql = "select * from person where age = s% "rn cursor.execute(sql,(find_condition_age))rnrnrntry:rn find_friend:find_age(msg)rn result= cursor.execute(sql,(find_condition_age))rn#服务器调用send,并采用字符串形式向客户发送信息。send方法返回已发送的字符个数。rn cs.send(result)rn f.close()rnexcept(Exception) :rn#服务器调用send,并采用字符串形式向客户发送信息。send方法返回已发送的字符个数。rn cs.send("\n\n\ncan not find data"+"\n");rn#传输结束,服务器调用socket的close方法关闭连接。rncs.close()[/color]rnrnrn在python GUI 中运行,总是报错“There‘s an <em>error</em> in your program:invalid syntax”rn好像之前说是少写一个括号之类,但是也没有发现此类错误啊。。。
新建一个ATL工程,编译出错,错误error MSB3073,请各位指教一下,谢谢
rnrn1> Description: 执行注册rn1>C:\Program Files\MSBuild\Microsoft.Cpp\v4.0\Microsoft.CppCommon.targets(113,5): <em>error</em> MSB3073: 命令“"D:\Work\ATL Project\TestOLEDB\Debug\TestOLEDB.exe" /RegServerrn1>C:\Program Files\MSBuild\Microsoft.Cpp\v4.0\Microsoft.CppCommon.targets(113,5): <em>error</em> MSB3073: :VCEnd”已退出,<em>代码</em>为 -2147319780。rnrn有说是编译器的问题,可是不知道怎么设置,环境是Visual Studio 2010 的C++,高手指点一下~~~
error MSB6006: “rc.exe”已退出,代码为 5
在使用VS for linux 时,有时候出现 rc.exe <em>代码</em>为5的错误。 添加环境变量无效。 清理工程无效最终解决办法 *删除工程目录中 .rc 的资源文件 *清理工程 *重新生成。问题解决,但尚未再次验证。
error MSB6006: “cmd.exe”已退出,代码为 1 错误解决方案
最近在用Qt5编写界面,内嵌OSG三维渲染引擎的一个工程,但老是出现“<em>error</em> MSB6006: “cmd.exe”已退出,<em>代码</em>为 1”这个错误,后来经过查找资料找到了解决方法,现陈列如下:方案1:在对含有 Q_OBJECT 标签的头文件以及.cpp文件进行编辑后,在运行前对工程进行重新生成,然后再运行,错误就没了。方案2:“移除”而不是“删除”含有Q_OBJECT标签的头文件,这时“Gener...
error MSB6006: “rc.exe”已退出,代码为 1,Unicode编码
生成字符集已经设置为Unicode, 资源输入的是越南语,但在rc文件中显示为乱码,所以生成的文件也为乱码。 然后我直接在rc文件中对应位置输入越南语,保存rc文件时选择编码为 Unicode(UTF-8 带签名) <em>代码</em>页65001 然后生成,这时候报错: <em>error</em> MSB6006: “rc.exe”已退出,<em>代码</em>为 1 找了很久,最后发现保存.rc文件时的编码选择错误, ...
error MSB6006: “cmd.exe”已退出,代码为 9009
vs2015 打开之前的一个项目 (项目最开始是2008的) 升级完解决方案后出现了一堆错误n其中一个项目出现如题错误,仅此一个错误,msdn那个同名错误有看过,但是无从下手,其他也看过一些解决方法仍然解决不了,求大神指教
error MSB6006: “cmd.exe”已退出,代码为 2
<em>error</em> MSB6006: “cmd.exe”已退出,<em>代码</em>为 2 最近使用 QCAD开源<em>代码</em>编译,老是报上述错误。 解决方案:项目–右键–convert…,然后再编译就可以了。 仅作记录使用 ...
error MSB6006: “CL.exe”已退出,代码为 -1073740966
也不知道什么时候开始,我编写程序出现这样的问题:例如,编写控制台程序,比如最简单的helloworld。然后编译的时候出现问题:rn生成启动时间为 2013-3-7 11:02:31。rnInitializeBuildStatus:rn 正在对“Debug\helloworld.unsuccessfulbuild”执行 Touch 任务。rnC:\Program Files\MSBuild\Microsoft.Cpp\v4.0\Platforms\Win32\Microsoft.Cpp.Win32.Targets(147,5): <em>error</em> MSB6006: “CL.exe”已退出,<em>代码</em>为 -1073740966。rnrn生成失败。rnrn已用时间 00:00:01.56rn我做过的努力:rn重新修复安装,结果还是这样。按照网上的,把system32下面的CL.exe删掉,还是不行。在笔记本上面可以运行,然后一一对比VC++目录。结果发现是一样的(不排除我看错的情况,我也是大概看看。)。查看PATH,发现也没有什么异常。到底是什么原因?
3个数和为0
给出一个长度为N的无序数组,数组中的元素为整数,有正有负包括0,并互不相等。从中找出所有和 = 0的3个数的组合。如果没有这样的组合,输出No Solution。如果有多个,按照3个数中最小的数从小到大排序,如果最小的数相等则按照第二小的数排序。Input第1行,1个数N,N为数组的长度(0 &amp;lt;= N &amp;lt;= 1000) 第2 - N + 1行:Aii(-10^9 &amp;lt;= Aii &amp;...
数据库错误代码为:-3 ???
我用的是access2000数据库,第一次增加保存没问题,不退出,直接进行修改,然后保存提示下列错误:若退出再打开反复修改保存没问题。(所有数据窗口都有此问题)rn数据库错误<em>代码</em>为:-3rn数据库错误信息为:rnRow changed between retrieve and update.rnrnNo changes made to database.rnrnUPDATE t_sbtz_gf_dk SET zzcdz = 'sdfsfsd' WHERE id IS NULL AND devid IS NULL AND dev_no IS NULL AND dev_name IS NULL AND dkxh IS NULL AND unit_no IS NULL AND dev_code IS NULL AND vol_level IS NULL AND curr_kind IS NULL AND ddbh IS NULL AND dy IS NULL AND dl IS NULL AND rrl IS NULL AND tggl IS NULL AND wggl IS NULL AND dk IS NULL AND zzcj IS NULL AND zzcdz = 'sdfsdf' AND lxdh IS NULL AND lxr IS NULL AND ccbh IS NULL AND ccrq IS NULL AND tyrq IS NULL AND lasttime IS NULL AND edpl IS NULL AND ljfs IS NULL AND lqfs IS NULL AND eddg = 123 AND lszk IS NULL AND yxwd IS NULL AND yxws IS NULL AND dklx IS NULL
NKCallIntChain返回值为3
KernelIoControl IOCTL_HAL_REQUEST_SYSINTR 方法申请了一个动态中断,物理中断用的定时器中断3,逻辑中断返回30rnOEMInterruptHandle里面判断是定时器3中断来了,调用NKCallIntChain(定时器中断3)返回为3,SYSINT_CHAIN,请问这是为什么呢rnrn内核中串口驱动也是IOCTL_HAL_REQUEST_SYSINTR 方法申请中断的,NKCallIntChain返回值是正确的
vtk 与QT 编译出现error MSB3073错误,以管理员启动vs仍出错。
参照http://www.zhangzscn.com/index.php/vs2013%e7%bc%96%e8%af%91vtk7-0,编译vtk的,原因是
php error 提示为CGI Error,怎么办呀!!!!!!!!!!!!!!!!!!!!!
php程序提示错误为:CGI ErrorrnThe specified CGI application misbehaved by not returning a complete set of HTTP headers. The headers it did return are:rnrn系统:win2000 server (d:\winnt) IIS5.0rn PHP:php-4.1.1-installerrnrn安装步骤如下:rn1)添加虚拟目录: php 指向目录为: f:\php 权限把它全选上了rn2)安装PHP程序:执行php-4.1.1-installer程序,根据提示程序自动把php安装到c:\php目录下rn3)安装mysql 把mysql解压到c:\mysql目录下,执行c:\mysql\bin\mysqld-nt install 再执行net start mysqlrn4)编写测试程序info.php能正常显示,rnrn5)安装BBS程序,完成后,就显示rnrnCGI ErrorrnThe specified CGI application misbehaved by not returning a complete set of HTTP headers. The headers it did return are:rnrnrn这个问题一直困扰着我呀,救我吧,大虾们!我快急死了,装了不下n次,每次都这样!55555555555555555555rnrnrnrnrn
poj 代码提交 Runntime Error
大家好,我在poj的1001题提交后老是RunntimeError,但是我自己在eclipse上测试没问题,非常苦恼,求帮助。rn<em>代码</em>如下:[code=java]import java.util.HashMap;rnimport java.util.Map;rnimport java.util.Scanner;rnpublic class Main rn public static void main(String[] args) throws Exceptionrn Map map = new HashMap();rn int i=0;rn for(char c='A';c1)rn System.out.println(key.replace(3, 3, "-")+" "+value);rn rn rn rn[/code]rn求帮助!
VS2015+Qt5.7.1编译出错 MSB6006 “cmd.exe”已退出,代码为 3
1>------ 已启动生成: 项目: OpenRoadEd, 配置: Release x64 ------rn1> Performing Custom Build Toolsrn1> 系统找不到指定的路径。rn1> Performing Custom Build Toolsrn1> 系统找不到指定的路径。rn1> Performing Custom Build Toolsrn1> 系统找不到指定的路径。rn1> Performing Custom Build Toolsrn1> 系统找不到指定的路径。rn1> Performing Custom Build Toolsrn1> 系统找不到指定的路径。rn1> Performing Custom Build Toolsrn1> 系统找不到指定的路径。rn1> Performing Custom Build Toolsrn1> 系统找不到指定的路径。rn1> Performing Custom Build Toolsrn1> 系统找不到指定的路径。rn1> Performing Custom Build Toolsrn1> 系统找不到指定的路径。rn1> Performing Custom Build Toolsrn1> 系统找不到指定的路径。rn1> Performing Custom Build Toolsrn1> 系统找不到指定的路径。rn1> Performing Custom Build Toolsrn1> 系统找不到指定的路径。rn1> Performing Custom Build Toolsrn1> 系统找不到指定的路径。rn1> Performing Custom Build Toolsrn1> 系统找不到指定的路径。rn1> Performing Custom Build Toolsrn1> 系统找不到指定的路径。rn1> Performing Custom Build Toolsrn1> 系统找不到指定的路径。rn1> Performing Custom Build Toolsrn1> 系统找不到指定的路径。rn1> Performing Custom Build Toolsrn1> 系统找不到指定的路径。rn1> Performing Custom Build Toolsrn1> 系统找不到指定的路径。rn1> Performing Custom Build Toolsrn1> 系统找不到指定的路径。rn1> Performing Custom Build Toolsrn1> 系统找不到指定的路径。rn1> Performing Custom Build Toolsrn1> 系统找不到指定的路径。rn1> Performing Custom Build Toolsrn1> 系统找不到指定的路径。rn1> Performing Custom Build Toolsrn1> 系统找不到指定的路径。rn1> Performing Custom Build Toolsrn1> 系统找不到指定的路径。rn1> Performing Custom Build Toolsrn1> 系统找不到指定的路径。rn1> Performing Custom Build Toolsrn1> 系统找不到指定的路径。rn1> Performing Custom Build Toolsrn1> 系统找不到指定的路径。rn1> Performing Custom Build Toolsrn1> 系统找不到指定的路径。rn1> Performing Custom Build Toolsrn1> 系统找不到指定的路径。rn1> Performing Custom Build Toolsrn1> 系统找不到指定的路径。rn1> Performing Custom Build Toolsrn1> 系统找不到指定的路径。rn1> Performing Custom Build Toolsrn1> 系统找不到指定的路径。rn1> Performing Custom Build Toolsrn1> 系统找不到指定的路径。rn1> Performing Custom Build Toolsrn1> 系统找不到指定的路径。rn1>C:\Program Files (x86)\MSBuild\Microsoft.Cpp\v4.0\V140\Microsoft.CppCommon.targets(171,5): <em>error</em> MSB6006: “cmd.exe”已退出,<em>代码</em>为 3。rn========== 生成: 成功 0 个,失败 1 个,最新 0 个,跳过 0 个 ==========rnrnrn已经尝试过不生成清单,项目属性右键也没有转换成qmake工程的选项rnrn安装的qt插件如下图rn[img=https://img-bbs.csdn.net/upload/201802/24/1519458374_532328.png][/img]rnrn路径也没有中文rnrnrn大家帮忙解决一下,不胜感激!
【随笔】初为程序猿-做代码民工的日子3
首先,还是奉上一些看到的好句: 我看的,想哭的一段话 https://www.zhihu.com/question/56748730/answer/156880703 作者链接:https://www.zhihu.com/people/weiran-shenxiu/activities 无奈我们看懂彼此是彼此的过客啊 爱情是个轮廓不可能私有 把最初的感动钜细无遗的保留心中 不容许让时
error MSB6006: "cmd.exe" exited with code 3
哪位大侠知道,快告诉我吧,折腾老半天了。
删除3天以前的日志文件,Fatal error
我不懂PHP,现在想实现一个功能,删除指定目录中三天以前的文件(日志),就在百度上找的一个删除目录的函数,如下rn[code=PHP]rn function del_directory($dir)rn if(!($mydir = @dir($dir)))rn return;rn rn while($file = $mydir->read())rn if(is_dir("$dir$file") && $file!='.' && $file!='..')rn @chmod("$dir$file", 0777);rn del_dir("$dir$file");rn elseif(is_file("$dir/$file"))rn $file_time=@stat($file);//读取文件的最后更新时间rn if(time() - $file_time > 3600 * 24 * 3)rn @chmod("$dir/$file", 0777);rn @unlink("$dir/$file");rn rn rn rn $mydir->close();rn @chmod($dir, 0777);rn @rmdir($dir);rn [/code]rn报错:Fatal <em>error</em>: Unsupported operand types in D:\wamp\www\Player\playlogviewer.php on line 36rn对应的是这一行<em>代码</em>:if(time() - $file_time > 3600 * 24 * 3)rnrn麻烦看看是什么问题,谢谢!rnrn
fatal error LNK1120: 3 个无法解析的外部命令
我用的工具是VS2008,新建的MFC WIN32应用,在属性C/C++常规中添加了boost的包含目录,直接编译就出现这个错误了。
Error creating bean with name '(inner bean)#3
严重: Exception sending context initialized event to listener instance of class org.springframework.web.context.ContextLoaderListenerrnorg.springframework.beans.factory.BeanCreationException: Error creating bean with name 'org.springframework.web.servlet.mvc.method.annotation.RequestMappingHandlerAdapter#1': Cannot create inner bean '(inner bean)' of type [org.springframework.web.bind.support.ConfigurableWebBindingInitializer] while setting bean property 'webBindingInitializer'; nested exception is org.springframework.beans.factory.BeanCreationException: Error creating bean with name '(inner bean)#3': Cannot resolve reference to bean 'validator' while setting bean property 'validator'; nested exception is org.springframework.beans.factory.BeanCreationException: Error creating bean with name 'validator' defined in file [D:\appspace\eclipseworkspace\.metadata\.plugins\org.eclipse.wst.server.core\tmp0\wtpwebapps\tjyy\WEB-INF\classes\spring-mvc.xml]: Error setting property values; nested exception is org.springframework.beans.PropertyBatchUpdateException; nested PropertyAccessExceptions (1) are:rnPropertyAccessException 1: org.springframework.beans.MethodInvocationException: Property 'validationMessageSource' threw exception; nested exception is java.lang.NoClassDefFoundError: org/hibernate/validator/resourceloading/ResourceBundleLocatorrn at org.springframework.beans.factory.support.BeanDefinitionValueResolver.resolveInnerBean(BeanDefinitionValueResolver.java:282)rn at org.springframework.beans.factory.support.BeanDefinitionValueResolver.resolveValueIfNecessary(BeanDefinitionValueResolver.java:126)rn at org.springframework.beans.factory.support.AbstractAutowireCapableBeanFactory.applyPropertyValues(AbstractAutowireCapableBeanFactory.java:1391)rn at org.springframework.beans.factory.support.AbstractAutowireCapableBeanFactory.populateBean(AbstractAutowireCapableBeanFactory.java:1132)rn at org.springframework.beans.factory.support.AbstractAutowireCapableBeanFactory.doCreateBean(AbstractAutowireCapableBeanFactory.java:522)rn at org.springframework.beans.factory.support.AbstractAutowireCapableBeanFactory.createBean(AbstractAutowireCapableBeanFactory.java:461)rn at org.springframework.beans.factory.support.AbstractBeanFactory$1.getObject(AbstractBeanFactory.java:295)rn at org.springframework.beans.factory.support.DefaultSingletonBeanRegistry.getSingleton(DefaultSingletonBeanRegistry.java:223)rn at org.springframework.beans.factory.support.AbstractBeanFactory.doGetBean(AbstractBeanFactory.java:292)rn at org.springframework.beans.factory.support.AbstractBeanFactory.getBean(AbstractBeanFactory.java:194)rn at org.springframework.beans.factory.support.DefaultListableBeanFactory.preInstantiateSingletons(DefaultListableBeanFactory.java:607)rn at org.springframework.context.support.AbstractApplicationContext.finishBeanFactoryInitialization(AbstractApplicationContext.java:932)rn at org.springframework.context.support.AbstractApplicationContext.refresh(AbstractApplicationContext.java:479)rn at org.springframework.web.context.ContextLoader.configureAndRefreshWebApplicationContext(ContextLoader.java:383)rn at org.springframework.web.context.ContextLoader.initWebApplicationContext(ContextLoader.java:283)rn at org.springframework.web.context.ContextLoaderListener.contextInitialized(ContextLoaderListener.java:112)rn at org.apache.catalina.core.StandardContext.listenerStart(StandardContext.java:5068)rn at org.apache.catalina.core.StandardContext.startInternal(StandardContext.java:5584)rn at org.apache.catalina.util.LifecycleBase.start(LifecycleBase.java:147)rn at org.apache.catalina.core.ContainerBase$StartChild.call(ContainerBase.java:1572)rn at org.apache.catalina.core.ContainerBase$StartChild.call(ContainerBase.java:1562)rn at java.util.concurrent.FutureTask.run(Unknown Source)rn at java.util.concurrent.ThreadPoolExecutor.runWorker(Unknown Source)rn at java.util.concurrent.ThreadPoolExecutor$Worker.run(Unknown Source)rn at java.lang.Thread.run(Unknown Source)rnCaused by: org.springframework.beans.factory.BeanCreationException: Error creating bean with name '(inner bean)#3': Cannot resolve reference to bean 'validator' while setting bean property 'validator'; nested exception is org.springframework.beans.factory.BeanCreationException: Error creating bean with name 'validator' defined in file [D:\appspace\eclipseworkspace\.metadata\.plugins\org.eclipse.wst.server.core\tmp0\wtpwebapps\tjyy\WEB-INF\classes\spring-mvc.xml]: Error setting property values; nested exception is org.springframework.beans.PropertyBatchUpdateException; nested PropertyAccessExceptions (1) are:rnPropertyAccessException 1: org.springframework.beans.MethodInvocationException: Property 'validationMessageSource' threw exception; nested exception is java.lang.NoClassDefFoundError: org/hibernate/validator/resourceloading/ResourceBundleLocatorrn at org.springframework.beans.factory.support.BeanDefinitionValueResolver.resolveReference(BeanDefinitionValueResolver.java:329)rn at org.springframework.beans.factory.support.BeanDefinitionValueResolver.resolveValueIfNecessary(BeanDefinitionValueResolver.java:107)rn at org.springframework.beans.factory.support.AbstractAutowireCapableBeanFactory.applyPropertyValues(AbstractAutowireCapableBeanFactory.java:1391)rn at org.springframework.beans.factory.support.AbstractAutowireCapableBeanFactory.populateBean(AbstractAutowireCapableBeanFactory.java:1132)rn at org.springframework.beans.factory.support.AbstractAutowireCapableBeanFactory.doCreateBean(AbstractAutowireCapableBeanFactory.java:522)rn at org.springframework.beans.factory.support.AbstractAutowireCapableBeanFactory.createBean(AbstractAutowireCapableBeanFactory.java:461)rn at org.springframework.beans.factory.support.BeanDefinitionValueResolver.resolveInnerBean(BeanDefinitionValueResolver.java:271)rn ... 24 morernCaused by: org.springframework.beans.factory.BeanCreationException: Error creating bean with name 'validator' defined in file [D:\appspace\eclipseworkspace\.metadata\.plugins\org.eclipse.wst.server.core\tmp0\wtpwebapps\tjyy\WEB-INF\classes\spring-mvc.xml]: Error setting property values; nested exception is org.springframework.beans.PropertyBatchUpdateException; nested PropertyAccessExceptions (1) are:rnPropertyAccessException 1: org.springframework.beans.MethodInvocationException: Property 'validationMessageSource' threw exception; nested exception is java.lang.NoClassDefFoundError: org/hibernate/validator/resourceloading/ResourceBundleLocatorrn at org.springframework.beans.factory.support.AbstractAutowireCapableBeanFactory.applyPropertyValues(AbstractAutowireCapableBeanFactory.java:1427)rn at org.springframework.beans.factory.support.AbstractAutowireCapableBeanFactory.populateBean(AbstractAutowireCapableBeanFactory.java:1132)rn at org.springframework.beans.factory.support.AbstractAutowireCapableBeanFactory.doCreateBean(AbstractAutowireCapableBeanFactory.java:522)rn at org.springframework.beans.factory.support.AbstractAutowireCapableBeanFactory.createBean(AbstractAutowireCapableBeanFactory.java:461)rn at org.springframework.beans.factory.support.AbstractBeanFactory$1.getObject(AbstractBeanFactory.java:295)rn at org.springframework.beans.factory.support.DefaultSingletonBeanRegistry.getSingleton(DefaultSingletonBeanRegistry.java:223)rn at org.springframework.beans.factory.support.AbstractBeanFactory.doGetBean(AbstractBeanFactory.java:292)rn at org.springframework.beans.factory.support.AbstractBeanFactory.getBean(AbstractBeanFactory.java:194)rn at org.springframework.beans.factory.support.BeanDefinitionValueResolver.resolveReference(BeanDefinitionValueResolver.java:323)rn ... 30 morernCaused by: org.springframework.beans.PropertyBatchUpdateException; nested PropertyAccessExceptions (1) are:rnPropertyAccessException 1: org.springframework.beans.MethodInvocationException: Property 'validationMessageSource' threw exception; nested exception is java.lang.NoClassDefFoundError: org/hibernate/validator/resourceloading/ResourceBundleLocatorrn at org.springframework.beans.AbstractPropertyAccessor.setPropertyValues(AbstractPropertyAccessor.java:101)rn at org.springframework.beans.AbstractPropertyAccessor.setPropertyValues(AbstractPropertyAccessor.java:57)rn at org.springframework.beans.factory.support.AbstractAutowireCapableBeanFactory.applyPropertyValues(AbstractAutowireCapableBeanFactory.java:1424)rn ... 38 more
使用pip工具时,遇到【ERROR -3】
错误提示: Retrying (Retry(total=4, connect=None, read=None, redirect=None, status=None)) after connection broken by 'NewConnectionError('&amp;amp;amp;amp;lt;pip._vendor.urllib3.connection.VerifiedHTTPSConnection objec...
a.s:3: Error: undefined symbol `HHH' in operation
有一个很怪癖的问题:rna.h内容如下rn#define HHH 0x01rn#define BBB 0x02rnrna.s内容如下rn#include “a.h”rnH:rn orr r1,r0,#HHH|BBBrnrn这样编译rnarm-linux-gcc a.s -o a.orn如果没有用|,即去掉|BBB 则不会出错。。编译出来的HHH是未定义符号Urn但是加了|BBB 却说HHH 和BBB 未定义。。。。rn请问怎么解决?
错误 3 error C2143: 语法错误 : 缺少“;”(在“”的前面)
#pragma once rn#include rn#include "stdAfx.h"rn#include rn#include rn//#include "Idrive.h"rnrnclass CActivemovie3rnrnprotected:rnrn CActivemovie3();rnrnpublic:rnrnCString getfilename(); //获得文件的位置rnrnvoid setfilename(const char* lpsznewvalue); //设置文件的位置rnrnvoid run(); //播放rnrnvoid pause(); //暂停rnrnvoid stop(); //停止rnrnvoid setcurrentposition(double newvalue); //设置播放的位置rnrndouble getcurrentposition(); //获得播放的位置rnrnlong getvolume(); //获得音量rn rnvoid setvolume(long nnewvalue); //设置音量rnrnvoid setautostart(bool bnewvalue); //设置自动播放rnrnpublic:rn virtual ~CActivemovie3();rn#ifdef _DEBUGrn virtual void AssertValid() const;rn virtual void Dump(CDumpContext& dc) const;rn#endifrn rn;rnrn这是个项目中的一个头文件,运行显示如下错误rn错误 3 <em>error</em> C2143: 语法错误 : 缺少“;”(在“”的前面) c:\users\administrator\desktop\8_4_框架-idrive\idrive\idrive\activemovie3.h 8rn错误 4 <em>error</em> C4430: 缺少类型说明符 - 假定为 int。注意: C++ 不支持默认 int c:\users\administrator\desktop\8_4_框架-idrive\idrive\idrive\activemovie3.h 8rnrn
《Error control coding -- From theory to practice》3
该书浅显易懂,是编码理论的入门书籍,但是其关键技术讲的非常好,如RS马的频域译码、Belekamp-Welch译码等,Belekamp-Welch译码再其他书上很少见到!
请教:javax.naming.TimeLimitExceededException:LDAP: error code 3
[code=Java]rnCaused by: org.springframework.ldap.TimeLimitExceededException: [LDAP: <em>error</em> code 3 - Timelimit Exceeded]; nested exception is javax.naming.TimeLimitExceededException: [LDAP: <em>error</em> code 3 - Timelimit Exceeded]; remaining name '/'rn at org.springframework.ldap.support.LdapUtils.convertLdapException(LdapUtils.java:149)rn at org.springframework.ldap.core.LdapTemplate.search(LdapTemplate.java:319)rn at org.springframework.ldap.core.LdapTemplate.search(LdapTemplate.java:237)rn at org.springframework.ldap.core.LdapTemplate.search(LdapTemplate.java:624)rn at org.springframework.ldap.core.LdapTemplate.search(LdapTemplate.java:535)rn at org.springframework.ldap.core.LdapTemplate.search(LdapTemplate.java:462)rn at org.springframework.ldap.core.LdapTemplate.search(LdapTemplate.java:483)rn at org.springframework.ldap.core.LdapTemplate.search(LdapTemplate.java:503)rn at com.huawei.uc.ldap.service.impl.LdapServiceImpl.insertDepartmentFromAD(LdapServiceImpl.java:298)rn at com.huawei.uc.ldap.service.impl.LdapServiceImpl$$FastClassByCGLIB$$3a74c23a.invoke()rn at net.sf.cglib.proxy.MethodProxy.invoke(MethodProxy.java:191)rn at org.springframework.aop.framework.Cglib2AopProxy$CglibMethodInvocation.invokeJoinpoint(Cglib2AopProxy.java:688)rn at org.springframework.aop.framework.ReflectiveMethodInvocation.proceed(ReflectiveMethodInvocation.java:150)rn at org.springframework.aop.aspectj.MethodInvocationProceedingJoinPoint.proceed(MethodInvocationProceedingJoinPoint.java:80)rn at com.huawei.uc.commons.userlog.UserOperateLog.logMessage(UserOperateLog.java:131)rn ... 163 morernCaused by: javax.naming.TimeLimitExceededException: [LDAP: <em>error</em> code 3 - Timelimit Exceeded]; remaining name '/'rn at com.sun.jndi.ldap.LdapCtx.mapErrorCode(LdapCtx.java:3097)rn at com.sun.jndi.ldap.LdapCtx.processReturnCode(LdapCtx.java:2987)rn at com.sun.jndi.ldap.LdapCtx.processReturnCode(LdapCtx.java:2794)rn at com.sun.jndi.ldap.LdapNamingEnumeration.getNextBatch(LdapNamingEnumeration.java:129)rn at com.sun.jndi.ldap.LdapNamingEnumeration.hasMoreImpl(LdapNamingEnumeration.java:198)rn at com.sun.jndi.ldap.LdapNamingEnumeration.hasMore(LdapNamingEnumeration.java:171)rn at org.springframework.ldap.core.LdapTemplate.search(LdapTemplate.java:295)rn ... 176 morernrn[/code]
MediaPlayer initialize Visualizer engine error: -3
调用系统MediaPlayer播放音乐时出现以下错误(Huawei Nexus 6P Android 6.0.1)rn java.lang.RuntimeException: Cannot initialize Visualizer engine, <em>error</em>: -3
管理信息系统代码3
管理信息系统<em>代码</em> 书的<em>代码</em>3
单点登录示范代码3
单点登录示范<em>代码</em>3
MSP430F5529代码3
德州仪器单片机MSP430F5529开发板配套<em>代码</em>,下载至开发板即可使用。
(3)联机代码疑问?
1)select name from tempdb..sysobjicts where name like '#c%'rntempdb..sysobjicts哪里的? #c%前加#是什么意思?rn2)cast语法中有类别如下rn*explicit converisionrn*implicit converisionrn*conversion not allowedrn都是些什么意思?rnrn
html模块3代码
html模块3<em>代码</em> web.zip
3行代码。。。
/*输出成绩*/rnvoid PrScore(void)rn rn char str[10];rn setfillstyle(SOLID_FILL,YELLOW);rn bar(50,15,220,35);rn setcolor(6);rn settextstyle(0,0,2);rn sprintf(str,"score:%d",score);rn outtextxy(55,20,str);rnrn请问最后3行<em>代码</em>是什么意思?以及他的用法。。
stm32f1xx软件代码3
stm32f1xx软件<em>代码</em>示例及官方<em>代码</em>库源码
CAD杀毒 2.0.1.228下载
【基本介绍】   CAD病毒有别于传统病毒,致使目前很多杀毒软件对其无能为力,此工具可以帮您将CAD恢复到正常状态!   CAD中毒:打印文件不正常,实线变虚线,大部分命令无效,跳出对话框等该病毒利用CAD的读取机制,在第一次打开带有病毒的图纸后,该病毒即悄悄运行,并感染每一张新打开的图纸,将病毒文件到处复制,并生成很多名为acad.lsp的程序。即便是重装CAD甚至重装系统都不能解决问题。病毒感染计算机系统后,会在搜索AutoCAD软件数据库路径下的自动运行文件(acad.lsp)后,生成一个备份文件acadapp.lsp,其内容和自动运行文件一样。打开CAD图纸时,软件就会运行加载该文 相关下载链接:[url=//download.csdn.net/download/faildd/3545924?utm_source=bbsseo]//download.csdn.net/download/faildd/3545924?utm_source=bbsseo[/url]
操作系统设计与实现下载
讲解操作系统的设计原理与方法 第1章 引言 1.1 什么是操作系统 1.1.1 操作系统作为扩展机 1.1.2 操作系统作为资源管理器 1.2 操作系统的发展历史 1.2.1 第一代计算机(1945-1955):真空管和插接板 1.2.2 第二代计算机(1955-1965):晶体管和批处理系统 1.2.3 第三代计算机(1965-1980):集成电路和多道程序 1.2.4 第四代计算机(1980-):个人计算机 1.2.5 MINIX 3的历史 1.3 操作系统概念 。 。 。 。。 。 。 。 。 。 。 相关下载链接:[url=//download.csdn.net/download/bestoneli/4430151?utm_source=bbsseo]//download.csdn.net/download/bestoneli/4430151?utm_source=bbsseo[/url]
摄像头万能驱动.rar下载
摄像头万能驱动.rar 相关下载链接:[url=//download.csdn.net/download/haoning7788/4582299?utm_source=bbsseo]//download.csdn.net/download/haoning7788/4582299?utm_source=bbsseo[/url]
我们是很有底线的