ImportError: No module named httplib [问题点数:40分,结帖人u010443291]

一键查看最优答案

确认一键查看最优答案?
本功能为VIP专享,开通VIP获取答案速率将提升10倍哦!
Bbs1
本版专家分:0
结帖率 100%
Bbs6
本版专家分:7762
Blank
红花 2013年10月 其他开发语言大版内专家分月排行榜第一
Blank
黄花 2013年9月 其他开发语言大版内专家分月排行榜第二
2013年8月 其他开发语言大版内专家分月排行榜第二
2013年7月 其他开发语言大版内专家分月排行榜第二
2011年4月 PHP大版内专家分月排行榜第二
Blank
蓝花 2013年10月 PHP大版内专家分月排行榜第三
2013年5月 PHP大版内专家分月排行榜第三
2013年4月 其他开发语言大版内专家分月排行榜第三
2013年4月 PHP大版内专家分月排行榜第三
2013年3月 其他开发语言大版内专家分月排行榜第三
2011年5月 PHP大版内专家分月排行榜第三
Bbs5
本版专家分:3882
Blank
红花 2006年12月 PHP大版内专家分月排行榜第一
2006年11月 PHP大版内专家分月排行榜第一
2006年10月 PHP大版内专家分月排行榜第一
2006年9月 PHP大版内专家分月排行榜第一
2007年5月 PHP大版内专家分月排行榜第一
2007年4月 PHP大版内专家分月排行榜第一
2007年3月 PHP大版内专家分月排行榜第一
Blank
黄花 2006年5月 PHP大版内专家分月排行榜第二
2006年4月 PHP大版内专家分月排行榜第二
2007年1月 PHP大版内专家分月排行榜第二
Blank
蓝花 2013年10月 其他开发语言大版内专家分月排行榜第三
2007年2月 PHP大版内专家分月排行榜第三
Bbs1
本版专家分:0
Bbs1
本版专家分:0
Anaconda dlib安装 解决no moudle named dlib
在使用pycharm导入dlib时提示错误 no moudle <em>named</em> dlib 打开cmd窗口 输入指令 pip install dlib 结果各种提示错误,安装不上。 有说要先安装Cmake的,结果装上了Cmake,配置好环境变量,还是依旧提示错误。 新的解决方案:python版本是3.5 我的python版本是3.5 去这个网址下载对应版本的dilb ht...
ImportError: No module named 'httplib'
<em>ImportError</em>: <em>No</em> <em>module</em> <em>named</em> '<em>httplib</em>' 原因:Python 2.x中的"<em>httplib</em>"模块在Python 3.x中变成了"http.client" 原代码: import <em>httplib</em> import urllib reqheaders={ 'MobileType':'Android', ...
Python报ImportError: No module named错误解决过程记录
错误原因: 刚开始学习Python的小伙伴应该和我一样不知道怎么解决这个错误,其实报这个错是因为模块的缺失,只需要使用python的命令进行安装模块即可 解决方案: Windows环境下: 进入Python目录:C:/Python27/下,按住Shift+R 选择在 此处打开命令窗口 输入python -m pip install Pillow ,这里的Pillow就
ImportError: No module named grpc解决办法
运行python程序,报错 <em>ImportError</em>: <em>No</em> <em>module</em> <em>named</em> grpc 解决办法: $ python -m pip install grpcio $ python -m pip install grpcio-tools 以上。
ModuleNotFoundError:No Module named 'mglearn' 解决办法
Module<em>No</em>tFoundError:<em>No</em> Module <em>named</em> 'mglearn' 解决办法
ModuleNotFoundError: No module named 'requests' 的 解决方案
如果运行Python程序时显示这个报错信息,请尝试这个解决方案 打开Python文件的安装目录,进入Scripts文件中,按住Shift键+鼠标右击,选择【在此处打开Powershell窗口】 输入指令,然后按回车键,等待执行结束 pip install requests 如图所示则运行结束 再次执行报错的程序,现在已经可以正常运行了 到此文章结束 这是我通过学习对知识的整理及备...
mysql-python安装以后,仍然报错:ImportError: No module named mysqlDB
平台是debian7.7 python用的是2.7.3 用pip安装mysql-python显示成功 (youngTree)junjielee@debian:~$ sudo pip install m
linux下python缺少bz2模块的修复
yum install -y bzip2* cd ../Python-2.7.6/Modules/zlib ./configure make make install cd ../../ python setup.py install
python模块以及导入出现ImportError: No module named 'xxx'问题
在建testcase的时候,跟代码文件夹建了一个独立的文件夹tests, 用于存放测试用例, 但单独运行的时候,却报 找不到模块
python学习-调用Splinter: ImportError: cannot import name Browser
安装了python,安装了Splinter,但是调用Splinter打开火狐浏览器就是提示 <em>ImportError</em>: cannot import name Browser。 网上找的测试代码: 打开火狐浏览器-&amp;gt;打开百度搜索python关键词 from splinter import Browser def main(): browser = Browser() br...
python安装dlib模块出错
使用python -m pip install dlib 出错原因如下: python -m pip install dlib Collecting dlib Using cached dlib-19.1.0.tar.gz Building wheels for collected packages: dlib Running setup.py bdist_wheel for dlib ... error Complete output from command D:\python语言\python27\python.exe -u -c "import setuptools, tokenize;__file__='c:\\users\\administrator\\appdata\\local\\temp\\pip-build-yjbauy\\dlib\\setup.py';exec(compile(getattr(tokenize, 'open', open)(__file__).read().replace('\r\n', '\n'), __file__, 'exec'))" bdist_wheel -d c:\users\administrator\appdata\local\temp\tmpebunu3pip-wheel- --python-tag cp27: running bdist_wheel running build error: Cannot find cmake, ensure it is installed and in the path. You can install cmake using the instructions at https://cmake.org/install/ You can also specify its path with --cmake parameter. ---------------------------------------- Failed building wheel for dlib Running setup.py clean for dlib **Failed to build dlib Installing collected packages: dlib Running setup.py install for dlib ... error** Complete output from command D:\python语言\python27\python.exe -u -c "import setuptools, tokenize;__file__='c:\\users\\administrator\\appdata\\local\\temp\\pip-build-yjbauy\\dlib\\setup.py';exec(compile(getattr(tokenize, 'open', open)(__file__).read().replace('\r\n', '\n'), __file__, 'exec'))" install --record c:\users\administrator\appdata\local\temp\pip-xtjkek-record\install-record.txt --single-version-externally-managed --compile: running install running build error: Cannot find cmake, ensure it is installed and in the path. You can install cmake using the instructions at https://cmake.org/install/ You can also specify its path with --cmake parameter. ---------------------------------------- Command "D:\python语言\python27\python.exe -u -c "import setuptools, tokenize;__file__='c:\\users\\administrator\\appdata\\local\\temp\\pip-build-yjbauy\\dlib\\setup.py';exec(compile(getattr(tokenize, 'open', open)(__file__).read().replace('\r\n', '\n'), __file__, 'exec'))" install --record c:\users\administrator\appdata\local\temp\pip-xtjkek-record\install-record.txt --single-version-externally-managed --compile" failed with error code 1 in c:\users\administrator\appdata\loc 以前安装过python2和python3,现在已经把python3卸载了。 使用pip install XXX会出现错误,所以才用python -m pip install dlib windows 64为位的系统
python安装dlib
在dlib官网下载文件, 直接在下载的文件根目录敲入: python setup.py install 去执行python的setup脚本就好了。但是直接执行这个可能会出的问题就是少了些依赖的库, 所以一定要先装了opencv还有boost两个库。 装好之后记得添加dlib到系统的环境变量: export PYTHONPATH=/path/to/dlib/python_
成功解决ModuleNotFoundError: No module named 'scipy._lib._ccallback'
成功解决Module<em>No</em>tFoundError: <em>No</em> <em>module</em> <em>named</em> 'scipy._lib._ccallback' 目录 解决问题 解决思路 解决方法 解决问题 Module<em>No</em>tFoundError: <em>No</em> <em>module</em> <em>named</em> 'scipy._lib._ccallback' 解决思路 找不到模块错误:没有名为'scipy...
ImportError: No module named httplib2 No module named 'import_export'
<em>ImportError</em>: <em>No</em> <em>module</em> <em>named</em> <em>httplib</em>2 https://www.jianshu.com/p/30df0d1c7524
idea ModuleNotFoundError: No module named 'XXX'
今天用Jenkins执行.py文件时,总是提示Module<em>No</em>tFoundError: <em>No</em> <em>module</em> <em>named</em> ‘XXX’,百思不得其解。 但是在PyCharm中却是能执行成功的,想了想然后在终端中运行该.py文件,仍然提示Module<em>No</em>tFoundError: <em>No</em> <em>module</em> <em>named</em> ‘XXX’ 。 后面发现,在命令行中执行.py文件时找不到包是因为我们没有把项目路径保存,可通...
安装了grpc但是无法导入:ImportError: No module named 'grpc'
今天在同事的路径下运行程序,需要加sudo权限执行Python程序,结果总提示<em>ImportError</em>: <em>No</em> <em>module</em> <em>named</em> 'grpc', pip list 显示明明都装好了grpc包,进入python环境执行import grpc也都正常,最后发现去掉sudo就好了。。。也不知道为什么,但是同事的路径没写文件权限,把文件夹所属人改到我名下就愉快的执行程序了。 记得有时候执行scp...
ModuleNotFoundError:no module named 'requests'
问题:显示找不到这个模块 。 解决方法,首先我上网查了一下,显示没有这个模块的话我们可在命令行输入pip install requests这个命令 安装这个模块 但是问题是我安装了这个模块后还是依旧显示这个错误。 上面是通过pip去安装这个模块。这里的文件上也显示了又这个模块。当我再次运行时还是出现了问题 然后我换了个想法,因为我是安装了Anaconda,requests本...
python解决ModuleNotFoundError No module named 'HTMLTestRunner'
HTMLTestRunner是Python标准库的unittest模块的扩展,无法通过pip安装; py2解决方法: 从http://tungwaiyip.info/software/HTMLTestRunner.html下载HTMLTestRunner.py并将文件放到python2安装目录的Lib下,然后再次运行文件,可成功运行! py3解决方法: 总结: 第94行,将impor...
faster-r-cnn在Windows+tensorflow环境下运行出错No module named 'lib.utils.cython_bbox'
报错如下图所示,代码是在githubhttps://github.com/dBeker/Faster-RCNN-TensorFlow-Python3.5上下的。
python 开一个简单的http服务失败- No module named simplehttpserver
<em>No</em> <em>module</em> <em>named</em> simplehttpserver 今天准备开一个简单的服务,因为有夸域问题准备开一个服务,确发现失败了 后来查了资料发现python3改为下面的命令了 python -m simplehttpserver ...
ImportError: No module named httplib"">py2exe error: "ImportError: No module named httplib"
py2exe打包,与py2exe error: "<em>ImportError</em>: <em>No</em> <em>module</em> <em>named</em> <em>httplib</em>"的解决。
解决:在CentOS中安装ab出现yum命令错误(No module named yum)的解决办法
最近由于要进行性能测试,在虚拟机中安装:yum -y install httpd-tools ;出现如下错误: There was a problem importing one of the Python <em>module</em>s required to run yum. The error leading to this problem was: /lib64/libnssutil3.so:...
爬虫笔记(10/1)--------http.cookiejar模块
http.cookiejar模块定义了以下类: 1.class http.cookiejar.CookieJar(policy=<em>No</em>ne) CookieJar对象有些方法如增加cookie header,extract cookie,参考文档。 2.class http.cookiejar.FileCookieJar(filename,delayload=<em>No</em>ne,policy=<em>No</em>ne)
[41]python3 requests与http.cookiejar的使用(cookie的保存与加载)
在学习Python之余,发现Python2与Python3 有很大的变化,之前使用urllib和cookielib来保存cookie,发现很繁琐,于是改用requests。发现cookielib在3.x版本中改成了http.cookiejar。经过测试后成功保存了cookie。使用方法如下 # requests 与 http.cookiejar相结合使用 import requests ...
Python3.6报错:ModuleNotFoundError: No module named 'MySQLdb'
from sqlalchemy import create_engine engine = create_engine('mysql://root:root@127.0.0.1:3306/test?charset=utf8') 报错: Module<em>No</em>tFoundError: <em>No</em> <em>module</em> <em>named</em> 'MySQLdb' 解决方法: MySQLdb只支持Python2.,还不支持3....
Ubuntu16.04+Anaconda环境下dlib库无法导入解决方法
环境配置:Ubuntu16.04+Anaconda4.4.0(python3.6) 问题背景:dlib库本人是采用pip安装的,安装过程中显示安装成功,并且在conda list指令下可以看出dlib已经正常安装 图1 但进入python后并import dlib会出现如下错误: >>> import dlib Traceback (most recent call last):
Python模块导入出现ModuleNotFoundError: No module named '***'
Traceback (most recent call last): File "/usr/flink/alert/server/greeter_server.py", line 8, in &lt;<em>module</em>&gt; from example import helloworld_pb2, helloworld_pb2_grpc Module<em>No</em>tFoundError: <em>No</em> mo...
python 3.x报错:No module named 'cookielib'或No module named 'urllib2'
1. Module<em>No</em>tFoundError: <em>No</em> <em>module</em> <em>named</em> 'cookielib' Python3中,importcookielib改成 importhttp.cookiejar,然后方法里cookielib也改成http.cookiejar。 2. Module<em>No</em>tFoundError: <em>No</em> <em>module</em> <em>named</em> 'urllib2'...
python中import包的一些心得,解决ImportError: No module named
python中import包的一些心得,解决<em>ImportError</em>: <em>No</em> <em>module</em> <em>named</em> 今天用python3,在引包的时候出现一些错误,于是测试了一些情况,有以下几点心得,记录一下。 1.如果要import文件夹里的,记得是package才行,dictionary不行,区别是有没有__init__.py 2.如果是python2,在import同一个文件夹里的,不用加前缀,比如pro...
ImportError: No module named managers
代码: import os import cPickle as pickle filename = '../dftest.pkl' if(os.path.exists(filename)):   w=open(filename, 'rb')   dfTest = pickle.load(w) w.close() 结果报错: Traceback (most recent...
python配置splinter时importerror: no module named six
2019独角兽企业重金招聘Python工程师标准&gt;&gt;&gt; ...
【Python错误解决】No module named 'urllib2' 解决办法
主要问题出现在Python版本,你用的是3版本,写的代码还是2版本格式,举例子: import urllib2 response = urllib2.urlopen('http://www.123456.com/') html = response.read() print html 报错:<em>No</em> <em>module</em> <em>named</em> 'urllib2'解决方法: urllib.re...
解决ImportError: No module named zlib问题
解决<em>ImportError</em>: <em>No</em> <em>module</em> <em>named</em> zlib问题 分类: linux python 2013-12-01 16:29 1058人阅读 评论(0) 收藏 举报 pythondjangozlib 今天在创建django工程时,报了这个错 其实前几天也遇见过当时是在装一个setuptools时,报了这个错误zlib not available按照网上的方法,装好之后重...
【Python学习】第三方库安装后仍然import失败,提示ModuleNotFoundError:No module named'XXX'
来源:https://www.jianshu.com/p/bdeb237af302 安装pycharm后,import numpy,运行后提示 Module<em>No</em>tFoundError:<em>No</em> <em>module</em> <em>named</em>'XXX' 打开命令行,输入pip install numpy后,成功安装,但再次运行仍然提示错误。 原因猜测是第三方库的安装路径与import路径不一致导致 解决方法: 1....
ModuleNotFoundError: No module named 'pip'
1 问题 2 解决
在运行进行视频检测的代码时报错:ModuleNotFoundError: No module named 'libbgs'
在运行进行视频检测的代码时报错错误:Module<em>No</em>tFoundError:<em>No</em> <em>module</em> <em>named</em>’libbgs’## 导致这个错误的原因是没有构建BGSLibrary, 1、参考下列链接进行配置(我的系统是linux+anaconda+python3进行配置) https://github.com/andrewssobral/bgslibrary/wiki/Wrapper:-Pyt...
import urllib.parse ImportError: No module named parse
import urllib.parse <em>ImportError</em>: <em>No</em> <em>module</em> <em>named</em> parse 错误原因: 出现这个错误,是因为我使用的Python版本是2.7, 根据Python 2.x urlparse模块文档, urlparse模块在Python 3中重命名为urllib.parse 所以模块在Python 2.7下你应该使用url...
Python-ImportError: No module named librosa(或其他库)解决方法
运行python程序时,经常会遇到一种错误类型:<em>ImportError</em>: <em>No</em> <em>module</em> <em>named</em> xxx,其中xxx一般是一个库。比如,我最近跑GitHub上的代码时,就提示<em>ImportError</em>: <em>No</em> <em>module</em> <em>named</em> librosa。有两种方法可以解决这个问题。 方法1:检查python中是否已安装该库。首先在命令行中输入 pip list,检测python是否已安装该库。...
python程序在命令行执行提示ModuleNotFoundError: No module named 'XXX' 解决方法
在ide中执行python程序,都已经在默认的项目路径中,所以直接执行是没有问题的。但是在cmd中执行程序,所在路径是python的搜索路径,如果涉及到import引用就会报类似<em>ImportError</em>: <em>No</em> <em>module</em> <em>named</em> xxx这样的错误,解决方法: 在报错的模块中添加: import sysimport oscurPath = os.path.abspath(os.pat...
解决Linux下Matplotlib安装遇到的问题 ModuleNotFoundError: No module named 'matplotlib'
在 Linux 环境下安装 Pycharm (这里安装的是最新版本),可能会出现以下这种闹心的事,翻阅了各大网站,试了各种方法都不行,但在我的不懈努力下终于还是将之解决了,怎叫一个大快人心呐 错误提示 提示该模块未找到,此时需要对其进行安装 python 3+ 请复制以下指令在 terminal 中执行 $ sudo apt-get install python3-matplotlib p...
ModuleNotFoundError: No module named 'cloudera'
在使用Python处理问题的时候出现了如下报错: 原因是我这里使用Python3.7去处理的时候发生报错。 建议使用Python2或者换一个连接器,代替(pyhs2)。
ModuleNotFoundError: No module named 'quotetutorial.items'的解决方法
最近在学习scrapy爬虫框架,遇到一个困扰我很久的问题,把我的解决经验分给大家: 错误的样式: F5运行之后报错:Module<em>No</em>tFoundError: <em>No</em> <em>module</em> <em>named</em> ‘quotetutorial.items’ 原代码也没错,截图如下: 这里默认你的srcapy框架的各种依赖库已经安装完善: 情况一:爬虫名字和项目名字一样,导致导入模块时出错 解决方法:更改爬虫文件的名...
ImportError: No module named 'PIL'
<em>ImportError</em>: <em>No</em> <em>module</em> <em>named</em> PIL 错误 的解决方法: 安装命令: pip install Pillow 如图所示:
创建Django, ModuleNotFoundError: No module named 'django'报错
在Pycharm上创建Django项目之后,在Terminal命令行运行命令:python manage.py startapp login,然后报错,报错内容如下: Traceback (most
PyCharm错误解决办法:ModuleNotFoundError: No module named 'matplotlib'
柳鲲鹏   在家里的电脑上,安装了  Anaconda和PyCharm,一运行,提示错误: Module<em>No</em>tFoundError: <em>No</em> <em>module</em> <em>named</em> 'matplotlib'   这如何是好?还发WHAT呆,赶紧网上搜索啊。解决办法: File-&amp;gt;Settings-&amp;gt;Project PyCharm-&amp;gt;Project Interpreter的齿轮,Add。 ...
python 安装httplib2 0.9.2 或使用pip安装
1、首先下载<em>httplib</em>2 0.9.2,下载地址: https://pypi.python.org/pypi/<em>httplib</em>2/#downloads 2、然后解压到Python27的安装目录下,将下载的<em>httplib</em>2 0.9.2解压后的文件夹名字修改为<em>httplib</em> 3、通过dos命令进入cmd C:\Users\Administrator&amp;gt;cd:d\Python27\http...
splinter安装
splinter  1027  pip install splinter  1028  cd opt  1029  git clone git://github.com/cobrateam/splinter.git  1030  ll  1031  cd splinter  1032  ll  1033  python setuppy.install  1034  python s
ModuleNotFoundError: No module named 'encodings'
问题描述: Fatal Python error: Py_Initialize: unable to load the file system codec Module<em>No</em>tFoundError: <em>No</em> <em>module</em> <em>named</em> 'encodings' Current thread 0x00007308 (most recent call first): 1: 查看环境变量和系统变量是否正...
httplib2类库
<em>httplib</em>2最新类库 for python
python解决 ModuleNotFoundError: No module named '_bz2'
在服务器上安装python3.6.5,之前用的没什么问题,今天使用matplotlib给出了报错。报错内容:    from _bz2 import BZ2Compressor, BZ2DecompressorModule<em>No</em>tFoundError: <em>No</em> <em>module</em> <em>named</em> '_bz2'看了一堆些常见的解决教程,都不好用,后来看了了stackflow发现了问题:https://stacko...
No module named 'http.client'
今天运行程序出现了这个问题 <em>No</em> <em>module</em> <em>named</em> ‘http.client’,请恕我这个小白一脸懵,查了N多资料,都说勾选 Show command line afterwards 选项,但是我的咋就没有嘞???????????????????????????????? 然后查来查去,发现新版和旧版不一样,新版改名了!!!! 找到 debug Configurations 勾选 Ru...
tensorflow报错:ImportError:No module named 'tensorflow.python.platform'?
今天要打开tensorboard的时候出现报错: ![图片说明](https://img-ask.csdn.net/upload/201906/02/1559476838_499887.png) 然后试着用python import tensorflow as tf 检查了一下,还是同样的报错。 所有用到import TensorFlow的程序都无法运行了。 用网上的方法,添加PATH或者给tensorflow升级、重新安装后都是这样,不知道是为啥。
MAC 使用pycharm出现ImportError: No module named numpy 解决方法
Mac OS X 10.11.5 问题描述: 我用的是anaconda安装python3.6 已经在终端 pip install numpy 但是在pycharm运行程序出现错误:<em>ImportError</em>: <em>No</em> <em>module</em> <em>named</em> numpy  解决方法: 首先在终端输入 $which python3.6 获得安装路径后。 然后在pycharm的preference
py-fasterrcnn 关于 numpy 不兼容的问题的问题
一、numpy不兼容安装py-fasterrcnn 的时候,由于numpy 的版本太低导致各种不兼容,因为我装的是anaconda2 ,如果改numpy的版本的话,会导致其他软件的不兼容,比如cv2,它要求的numpy的版本就是大于1.11.0的。所以最好直接该源码。需要修改的地方如下:1,1) /home/xxxxx/py-faster-rcnn/lib/roi_data_layer/minib...
训练faster-rcnn python版本的时候报错No module named cython_bbox
补充一点:将proposal_target_layer.py中的 from utils.cython_bbox import bbox_overlaps 替换成: from utils.bbox import bbox_overlaps
运行faster-rcnn遇到的 importerror:no module named cv2 Ubuntu14.04
在github上运行py-faster-rcnn的代码时。前几步跟着下面说的指示走都可以进行下去,但是到了执行语句 ./tools/demo.py时问题来了: 会出现import error: no <em>module</em> <em>named</em> cv2 这个问题就是属于opencv方面的问题了 仔细看说明会发现它提前说让你装Python-opencv库了,所以就开始装,装不上啊 用了sudo apt-ge...
PyQt5安装及ModuleNotFoundError: No module named 'PyQt5'问题解决
安装pyQt5费了很多的周折,不过现在还是安装好了,现在重新梳理一下整个安装过程,注意我使用的是win7操作系统。1、登录Python官网,目前最新的版本是3.6.3,网址为:https://www.python.org/downloads/release/python-363/选中Windows x86-64 executalbe installer,将其下载下来,由于是可执行文件,直接安装即可...
最简单的在Python3.7版本上安装matplotlib库的方法
最近刚开始学用Python进行网络信息提取和数据分析,但是由于我安装的是目前Python的最新的版本,所以在安装Python的一些库的时候遇到了很多问题,而且国内的一些论坛上没有找到解决的办法,比如说matlibplot这个库在3.7版本一直装不了,在win10的cmd中用了各种命令解决不了,每当下载安装这个库时总是过一会显示请求超时,看了网上很多人说是这问题那问题,其实只需要一种很简单的方法就能...
ModuleNotFoundError: No module named '_lzma'
bug产生过程: 用python-cpca包时,这个包用到pandas,而pandas用到了_lzma这个玩意儿,lzma是python3.3之后引入的压缩算法标准模块,在本地MacOS上运行良好,然后部署到Linux服务器遇到这个傻吊bug:Module<em>No</em>tFoundError: <em>No</em> <em>module</em> <em>named</em> '_lzma'。 在MacOS上import lzma或者import _lz...
ModuleNotFoundError: No module named 'Cython'
在虚拟环境中用下面命令安装Cython(本人是3.7版): python3.7 -m pip install cython
python“ModuleNotFoundError: No module named 模块名” 错误的一种情况
跨目录导包,运行python脚本时,有时出现如题的错误。原因一般是用了os,sys两个模块,而没有理解清楚两者的关系。os是关于本地系统的操作,sys是关于python环境的操作,如模块搜索路径配置。 一种情况如下: import sys, os sys.path.append(os.pardir) # 为了导入父目录的文件而进行的设定 注意到,这里os.pardir是当前操作系统工作目录的父...
[121]yum出现错误ImportError: No module named urlgrabber.grabber
yum 出现错误: root@iZ23t4pnz63Z ~]# yum update Loaded plugins: fastestmirror Loading mirror speeds from cached hostfile * base: mirrors.aliyuncs.com * epel: mirrors.aliyuncs.com * extras: mirrors.al...
使用nohup运行python文件报错:Import error: No module named XXX等
最近在用linux跑神经网络模型,由于跑一轮时间比较长,而且网络不稳定Xshell容易断开,所以需要使用nohup运行python文件,但是遇到了问题。在linux下可以直接使用python test.py运行的文件,使用nohup python test.py就会报错,报的错大致就是Import error: <em>No</em> <em>module</em> <em>named</em> XXX,例如numpy,pandas引入错误。直接复制...
关于PyCharm导入自己写的module时报错:No Module Named XXX的解决方案
现象:方案:
完美解决 ModuleNotFoundError: No module named 'pip'
我在安装django的一个第三方包时,就是执行下边命令时cmd提示pip版本得更新,确怎么也更新不了pip。 pip install django-grappelli 我进去anaconda,提示anaconda也需要更新,更新完以后,再次进入cmd进行pip更新,竟然提示: Module<em>No</em>tFoundError: <em>No</em> <em>module</em> <em>named</em> 'pip' 解决办法: 1、执行...
ModuleNotFoundError: No module named 'pytest'
把 .py文件名中的含有test或test_换成别的就行。
解决ModuleNotFoundError: No module named 'pip'问题
Python学习遇到小问题:Module<em>No</em>tFoundError: <em>No</em> <em>module</em> <em>named</em> ‘pip’ 今天想要装一下wxPython第三方库来写一下Python的GUI的时候发现cmd窗口下无法执行pip命令,想了想昨晚好像是pip命令行提示了我有新版本可以更新使用,更新之后也不成功,但昨晚没有怎么理会,以为没事,但今早起来一看发现pip命令都用不了了,出现了Module<em>No</em>tFoun...
ImportError: No module named XXX 错误解决方法(Windows)
window环境下使用pycharm编辑器来写Python时,由from *** import *** 语句导致控制台输出<em>ImportError</em>: <em>No</em> <em>module</em> <em>named</em> ***时,显而易见是由于未找到名为***的模块。遇到这类问题,首先要确认是否已经安装过该模块。 以from bs4 import BeautifulSoup 语句为例,如果控制台输出<em>ImportError</em>: <em>No</em> mo
ModuleNotFoundError: No module named 'flask'怎么办?网上搜不到原因
C:\Users\11039\board>python hello.py Traceback (most recent call last): File "hello.py", line 3, in
解决Python模块报错:ModuleNotFoundError: No module named 'cStringIO'
原作者遇到了跟我一样的问题,我也是在执行下面代码: import cStringIO 时提示报错为: Module<em>No</em>tFoundError: <em>No</em> <em>module</em> <em>named</em> 'cStringIO' 文中答复给出的解决方案是: From Python 3.0 changelog; The StringIO and cStringIO <em>module</em>s are gone. Inste
解决importerror no module named mysqldb
系统:ubuntu 语言:Python 使用MySQLdb ,但是提示importerror no <em>module</em> <em>named</em> mysqldb Python中最连接Mysql常用的驱动是: mysql-python :mysql的C语言的驱动 mysql-connector:msql官方的驱动 pymysql:python语言的驱动 我这里安装的是 mysql-python 终端中执
python导入模块报错:ImportError: No module named mysql.connector
&amp;gt;&amp;gt;&amp;gt; import pymysql Traceback (most recent call last): File &quot;&amp;lt;stdin&amp;gt;&quot;, line 1, in &amp;lt;<em>module</em>&amp;gt; 首先需要确保你使用的是不是国内的源, 然后再运行pip: #安装驱动 pip install mysql-connector #然后运行pip pip instal...
解决 ModuleNotFoundError: No module named 'pip'
今天 安装其它python包时,提示说 pip 10.0.1可用,就更新了一下,但是 更新过程中出现了错误,如图所示 因为这个错误导致 pip找不到, 可以首先执行python -m ensurepip 然后执行python -m pip install --upgrade pip 即可更新完毕。 如下图所示 知乎:https://zhuanlan.zhih...
python命令行执行 .py文件提示ModuleNotFoundError: No module named 'XXX' 解决方法
今天用Jenkins执行.py文件时,总是提示Module<em>No</em>tFoundError: <em>No</em> <em>module</em> <em>named</em> 'XXX',百思不得其解。但是在PyCharm中却是能执行成功的,想了想然后在终端中运行该.py文件,仍然提示Module<em>No</em>tFoundError: <em>No</em> <em>module</em> <em>named</em> 'XXX' 。后面发现,在命令行中执行.py文件时找不到包是因为我们没有把项目路径保存,可通过s
Jupyter Notebook:no module named....的解决策略
如在tensorflow环境下,使用jupyter notebook时(通过Anaconda Navigator的launch启动jupyter notebook), 输入下面语句时报错: import matplotlib.pyplot as plt 时报错   <em>ImportError</em> Traceback (most recent
java调python,报错ImportError: No module named cx_Oracle
通过java调python,报错: Exception in thread "main" Traceback (most recent call last): File "Test.py", line
ModuleNotFoundError: No module named 'pygal.i18n'
![图片说明](https://img-ask.csdn.net/upload/201709/26/1506431970_200011.png)
No module named http_client
<em>ImportError</em> at /users/ <em>No</em> <em>module</em> <em>named</em> http_client Request Method: GET Request URL: http://127.0.0.1:8000/users/?format=json Django Version: 1.6.1 Exception Type: <em>ImportError</em> Exception Val
Python中ModuleNotFoundError: No module named 'SocketServer'问题解决
引言: Flask是Python中鼎鼎大名的web框架,今天试手了一下,可是碰到了一个问题,一波三折方才解决.....
ImportError: No module named psutil/grpc/p4的解决
参考文章:http://www.bubuko.com/infodetail-2637410.html 1 现象 运行脚本的时候报了两个错误 1.1psutil报错 <em>ImportError</em>: <em>No</em> <em>module</em> <em>named</em> psutil ../../utils/Makefile:27: recipe for target 'run' failed make: *** [run] Err...
No module named _tkinter"问题解决过程总结">Python下"No module named _tkinter"问题解决过程总结
引言:在Python3下运行Matplotlib之时,碰到了”<em>No</em> <em>module</em> <em>named</em> _tkinter“的问题,花费数小时进行研究解决,这里讲整个过程记录下来,并尝试分析过程中的解决思路利弊得失,以资后效,这里重点提示需要关注错误信息的分析,这个是第一现场。
ubuntu14.04 + dlib19.2
ubuntu14.04 + dlib19.2下载dlib dlib官网这里好像只有最新的dlib版本包,下载选项在左下角有个蓝色的按钮,写着download 如果不想下载最新版本,也可以从github上下载,这里能下到各种版本的dlib,你只需要在branch那一栏点击tag,有一个下拉菜单可以有各种版本的dlib 博主用的还是目前最新的版本19.2,因为最新的dlib版本添加了一些新的人脸检测器,
ubuntu下Tensorflow 报错: ImportError: No module named 'matplotlib'
我的问题是: 在使用Jupyter <em>No</em>tebook跑tensorflow程序时,出现报错<em>ImportError</em>: <em>No</em> <em>module</em> <em>named</em> 'matplotlib',然而在spyder(非tensorflow环境)下运行import matplotlib.pyplot as plt就没有问题。然后在网上查了很多资料,大部分都是说: (1)用终端“sudo apt-get install
解决python中使用matplotlib时候出现ImportError: No module named _tkinter
1.如果python版本是python3+  sudo apt-get install python3-tk  此时安装对应的tk版本是系统最新的,对应python最新版本  此时需要更新对应的python版本,例如我原来是python3.5.2,更新到python3.6.3版本  (缺点是:之前装的库都要重新安装,例如tensorflow,numpy,matplotlib等) 2.
mac osx libsvm与python接口:ModuleNotFoundError: No module named 'svm'
系统为oxs,python平台为anaconda简单粗暴打包下载版,想要使用libsvm,采用方案为以下网址: http://blog.csdn.net/daizziad1314/article/details/52528395 对这个方案我想先做出以下两点修正: 1. mac os 应该是在libsvm的路径下执行 >> make lib;虽然说个人现在也不是很懂这一步的意义是什么,也
解决 ImportError: No module named 'serial' 问题
在pycharm里编写Python串口程序的时候,编译时提示 <em>ImportError</em>: <em>No</em> <em>module</em> <em>named</em> 'serial' 解决办法: 安装 serial <em>module</em> 这里区分python2和 python3: 首先需要在终端输入: sudo apt install python-pip //python2 sudo apt install
ImportError: No module named sqlalchemy
python新手,今天用sqlalchemy操作数据库时,报错:<em>ImportError</em>: <em>No</em> <em>module</em> <em>named</em> sqlalchemy sqlalchemy明明已经导了,这样的报错可能是因为没有安装MySQL-python,可以去这里下载安装试试  http://www.codegood.com/downloads MySQL-python-1.2.4b4.
明明已经安装了某个模块,python报错:ImportError: No module named ***
笔者初学python,碰见一些坑,分享出来,节约大家时间: 1、错误信息如下: <em>ImportError</em>: <em>No</em> <em>module</em> <em>named</em> numpy 如果什么都没装,请出门右转,通过pip安装numpy即可!命令如下: pip install numpy 如果连pip都没有,请先安装pip!命令如下: sudo apt-get install python-pip
ImportError: No module named api
问题: >>> import fabric                             Traceback (most recent call last):   File "", line 1, in   File "/root/liuyiping/fabric.py", line 2, in <em>ImportError</em>: <em>No</em> <em>module</em> <em>named</em> api 解决:
Java学习的正确打开方式
在博主认为,对于入门级学习java的最佳学习方法莫过于视频+博客+书籍+总结,前三者博主将淋漓尽致地挥毫于这篇博客文章中,至于总结在于个人,实际上越到后面你会发现学习的最好方式就是阅读参考官方文档其次就是国内的书籍,博客次之,这又是一个层次了,这里暂时不提后面再谈。博主将为各位入门java保驾护航,各位只管冲鸭!!!上天是公平的,只要不辜负时间,时间自然不会辜负你。 何谓学习?博主所理解的学习,它是一个过程,是一个不断累积、不断沉淀、不断总结、善于传达自己的个人见解以及乐于分享的过程。
程序员必须掌握的核心算法有哪些?
由于我之前一直强调数据结构以及算法学习的重要性,所以就有一些读者经常问我,数据结构与算法应该要学习到哪个程度呢?,说实话,这个问题我不知道要怎么回答你,主要取决于你想学习到哪些程度,不过针对这个问题,我稍微总结一下我学过的算法知识点,以及我觉得值得学习的算法。这些算法与数据结构的学习大多数是零散的,并没有一本把他们全部覆盖的书籍。下面是我觉得值得学习的一些算法以及数据结构,当然,我也会整理一些看过...
Joboshare DVD Copy下载
复制完整的dvd频,包括全部视频节目。也可复制加密视频光盘,内附有序列号。 相关下载链接:[url=//download.csdn.net/download/heptastich/3444837?utm_source=bbsseo]//download.csdn.net/download/heptastich/3444837?utm_source=bbsseo[/url]
up_985106_php-webdriver-bindings_ke05si.rar下载
php源码实现,php-webdriver-bindings这个PHP库允许创建功能测试与PHP webdriver,参考的例子程序供学习参看 相关下载链接:[url=//download.csdn.net/download/bafriouo/5097015?utm_source=bbsseo]//download.csdn.net/download/bafriouo/5097015?utm_source=bbsseo[/url]
Homedale 无线网络信号强度检测下载
可以快速的查看到周围的Wifi强度,在进行网络布局设置时非常有用 相关下载链接:[url=//download.csdn.net/download/whpwhp1979/8122093?utm_source=bbsseo]//download.csdn.net/download/whpwhp1979/8122093?utm_source=bbsseo[/url]
相关热词 c#选择结构应用基本算法 c# 收到udp包后回包 c#oracle 头文件 c# 序列化对象 自定义 c# tcp 心跳 c# ice连接服务端 c# md5 解密 c# 文字导航控件 c#注册dll文件 c#安装.net
我们是很有底线的