centos 下编译gstreamer 出现问题 [问题点数:40分,结帖人liumaoye]

Bbs1
本版专家分:12
结帖率 100%
centos 上面安装gstreamer 相关插件,由于版权问题,原始yum没有
yum -y install http://li.nux.ro/download/nux/dextop/el7/x86_64/nux-dextop-release-0-5.el7.nux.noarch.rpm yum install libdvdcss <em>gstreamer</em>{,1}-plugins-ugly <em>gstreamer</em>-plugins-bad-nonfree <em>gstreamer</em>1-plug
centos7 安装gstreamer
yum install <em>gstreamer</em>* 安装完成后,<em>编译</em>下面代码
Gstreamer for android 编译
Gstreamer 因为依赖库比较多,<em>编译</em><em>gstreamer</em>的过程会碰到很多问题。 Android 使用的不是标准的gnu c库,而是google自己搞的 bionic libc。这就导致<em>gstreamer</em>在<em>编译</em>时有些库需要修改代码,给交叉<em>编译</em>带来额外的工作。 Gsteamer 提供了一个方便的工具cerbero,这是python写的脚本能够方便地<em>编译</em>出<em>gstreamer</em>的库 只需要下面三步
android gstreamer 使用静态库 所有插件都找不到 main: assertion failed: (filesrc)
**从gtreamer 官网下载的<em>gstreamer</em>-1.0-android-arm-1.7.91,里面的插件全部是静态库.a **自己编写C测试程序,很简单,读取jpeg文件,使用filesrc插件
ubuntu启动qtcreator,提示缺少libgstreamer-0.10.so.0
在Linux下启动Qtcreator的时候, 报错:error while loading shared libraries: lib<em>gstreamer</em>-0.10.so.0: cannot open shared object file: No such file or directory 查找资料之后, 借助 apt-file 命令 可以查找缺少包所依赖的linux文件, 然后用 apt-
centos安装gstreamer报错解决方案
最近在倒腾语音识别的一个方案(https://github.com/jcsilva/docker-kaldi-<em>gstreamer</em>-server.git),在ubuntu下可以安装README.md的步骤顺利安装成功,在<em>centos</em>下,则需要自行修改Dockfile的指令,讲讲其中遇到的两个问题:1、安装openfst一直失败,这个问题主要是经验不足造成的,由于之前失败过,后边尽管按照提示一步一步解...
gstreamer gstreamer
ubuntu下<em>gstreamer</em>的相关资料 吐血整理
gstreamer之RTSP Server编译及注意事项
柳鲲鹏 下载 下载网址 https://<em>gstreamer</em>.freedesktop.org/src/gst-rtsp-server/ 下载哪个版本?这个要跟自己的<em>gstreamer</em>配套(小于等于)。比如吾<em>gstreamer</em>版本是1.8.3,虽然最新的是1.14.4,吾必须下载1.8.3。否则<em>编译</em>会报错: configure: Requested '<em>gstreamer</em>-1.0 &amp;gt;= 1....
【GStreamer】GStreamer学习资源汇总
Gstreamer学习 http://blog.iotwrt.com/media/2017/11/17/<em>gstreamer</em>-study/ 官方关于Gstreamer的教程(英文)https://<em>gstreamer</em>.freedesktop.org/documentation/tutorials/table-of-concepts.html 当然也有国内已经有相关学者将其翻译成中文,...
编译出现问题
<em>出现问题</em>/tmp/cc5607Wr.o: In function bool boost::regex_match >, char, boost::regex_traits > >(char const*, char
gstreamer安装
本人亲测可安装在fedora14。
全志平台Tina系统yocto编译环境gstreamer编译不过问题
全志平台Tina系统yocto<em>编译</em>环境<em>gstreamer</em><em>编译</em>不过问题 MACHINE=tulip-mozart source setup-environment bitbake image-tulip-mozart-chromium时报错:   nitialising tasks: 100% |#######################################| Time: 0...
CentOS上的若干个package安装失败
CentOS上的若干个package安装失败 在安装百度开源深度学习框架PaddlePaddle时,使用源码<em>编译</em>安装,在这之前需要安装一些依赖包,教程中使用的是Ubuntu系统,不巧的是,笔者使用的服务器是CentsOS系统,一些依赖包的安装也有所区别。 首先,不同于Ubuntu系统的apt-get install,CentOS应该使用yum install命令 以下是几个不同于Ubunt...
Gstreamer的安装
相关索引:https://blog.csdn.net/knowledgebao/article/details/84621238 官网: https://<em>gstreamer</em>.freedesktop.org/ 官网安装方法: https://<em>gstreamer</em>.freedesktop.org/documentation/frequently-asked-questions/getting.h...
VMware安装CentOS出现问题
Anaconda died after receibing signal 7 我在网上找到了不同的解决方法,但都不行。最后怀疑自己的iso文件有问题 所以重新下载了一下<em>centos</em>文件 国外网站的小哥也把文件弄到新的dvd中就解决了问题...
安装centos 6.2 出现问题
安装<em>centos</em> 6.2出现system_call_fastpath错误,本人菜鸟,希望大神能帮忙解答一下
centos 更换源出现问题
安装<em>centos</em>后,准备配置163的源rnrncd /etc/yum.repos.d rnmv CentOS-Base.repo CentOS-Base.repo.bkrnwget http://mirrors.163.com/.help/CentOS6-Base-163.repornmv CentOS6-Base-163.repo CentOS-Base.repo rnyum clean allrnyum updaternyum makecache rn<em>出现问题</em>:rnrn[root@localhost yum.repos.d]# yum makecachernLoaded plugins: fastestmirrorrnRepository base is listed more than once in the configurationrnRepository updates is listed more than once in the configurationrnRepository extras is listed more than once in the configurationrnRepository <em>centos</em>plus is listed more than once in the configurationrnRepository contrib is listed more than once in the configurationrnhttp://mirrors.sohu.com/<em>centos</em>/7/addons/x86_64/repodata/repomd.xml: [Errno 14] HTTP Error 404 - Not FoundrnTrying other mirror.rnhttp://mirror.<em>centos</em>.org/<em>centos</em>/7/addons/x86_64/repodata/repomd.xml: [Errno 14] HTTP Error 404 - Not FoundrnTrying other mirror.rnrnrn One of the configured repositories failed (CentOS-7 - Addons - sohu.com),rn and yum doesn't have enough cached data to continue. At this point the onlyrn safe thing yum can do is fail. There are a few ways to work "fix" this:rnrn 1. Contact the upstream for the repository and get them to fix the problem.rnrn 2. Reconfigure the baseurl/etc. for the repository, to point to a workingrn upstream. This is most often useful if you are using a newerrn distribution release than is supported by the repository (and thern packages for the previous distribution release still work).rnrn 3. Disable the repository, so yum won't use it by default. Yum will thenrn just ignore the repository until you permanently enable it again or usern --enablerepo for temporary usage:rnrn yum-config-manager --disable addonsrnrn 4. Configure the failing repository to be skipped, if it is unavailable.rn Note that yum will try to contact the repo. when it runs most commands,rn so will have to try and fail each time (and thus. yum will be be muchrn slower). If it is a very temporary problem though, this is often a nicern compromise:rnrn yum-config-manager --save --setopt=addons.skip_if_unavailable=truernrnfailure: repodata/repomd.xml from addons: [Errno 256] No more mirrors to try.rnhttp://mirrors.sohu.com/<em>centos</em>/7/addons/x86_64/repodata/repomd.xml: [Errno 14] HTTP Error 404 - Not Foundrnhttp://mirror.<em>centos</em>.org/<em>centos</em>/7/addons/x86_64/repodata/repomd.xml: [Errno 14] HTTP Error 404 - Not Foundrnrn请问,如何解决?163的源不可以用了吗?
linux学习笔记2---gstreamer1.0 安装与简介
> 安裝 GStreamer 1.0  ~$ sudo apt-get install <em>gstreamer</em>1.0 ~$ sudo apt-get install <em>gstreamer</em>-tools 由于<em>gstreamer</em>有两个版本 0.1和1.0  虽然说两个 互不影响   但是还是安装一个1.0版本   使用gst-*工具: ~$ gst-play-1.0 http:
gstreamer-1.16.0安装过程
主要参考链接: glib源码安装使用方法 认真看就行 ubuntu16.04 <em>gstreamer</em>源码安装 安装高版本glib和pcre正则依赖库的坑!
Gstreamer开发环境搭建
一 安装<em>gstreamer</em> 1 下载<em>gstreamer</em>源码 http://<em>gstreamer</em>.freedesktop.org/src/<em>gstreamer</em>/ 我下的是<em>gstreamer</em>-0.10.31.tar.gz 2 解压缩,进入目录 ./configure 出现如下错误: configure: No package 'glib-2.0' found 
centos6.3,Qt5,已经装了gstreamer但不能播视频是什么原因
系统是Centos6.3,用的是Qt5 creator的videowidget那个demo,<em>编译</em>完成运行的时候,播avi,mp4,mkv都不行,但mp3可以播放。 提示Internal data st
gstreamer ugly插件x264enc不能编译的原因
<em>编译</em>时发现ugly需要x264库 不然会不会生成x264enc插件的 sudo apt-get install libx264-dev
gstreamer plugin 怎么用C++编写&编译
请问<em>gstreamer</em> 的plugin 能否用C++编写和<em>编译</em>,<em>gstreamer</em>自带的例子只能用c来写和<em>编译</em>。
下CentOS下配置tomcat6时候 出现问题
我把解压后的文件放到local下 然后启动时出现面情况 怎么我这多了最后一句啊????????rn[root@localhost bin]# ./startup.shrnUsing CATALINA_BASE: /usr/local/tomcatrnUsing CATALINA_HOME: /usr/local/tomcatrnUsing CATALINA_TMPDIR: /usr/local/tomcat/temprnUsing JRE_HOME: /usr/jdk1.6.0_18rnUsing CLASSPATH: /usr/local/tomcat/bin/bootstrap.jarrnrnrn我的logs日志 是这样的 rn/usr/local/tomcat/bin/catalina.sh: line 332: /usr/jdk1.6.0_18/bin/java: 没有那个文件或目录rnrn我的jdk1.6安装正确啊 rnrn[root@localhost ~]# java -versionrnjava version "1.6.0_18"rnJava(TM) SE Runtime Environment (build 1.6.0_18-b07)rnJava HotSpot(TM) Client VM (build 16.0-b13, mixed mode, sharing)rn
vmware 安装centos 6.0 出现问题
安装<em>centos</em> 5.5 没有<em>出现问题</em>,但安装<em>centos</em> 6.0时<em>出现问题</em>rn安装启动的时候出现: unknown keyworld in configuration file :!rn No DEFAULT or UI configuration directive found !rnboot:
centos安装MySQL出现问题与解决
我是直接运行命令: yum install mysql 然后 执行 mysql -uroot -p 报错:ERROR 2002 (HY000): Can't connect to local MySQL server through socket '/var/lib/mysql/mysql.sock' (2) 执行命令:service mysqld start 报错: Redirect...
centOS安装qt4.8.0 - - ERROR: Package gstreamer-app-0.10 not found
https://download.qt.io/archive/qt/ 各种版本 在 http://get.qt.nokia.com/qt/source/qt-everywhere-opensource-src-4.8.0.tar.gz 下载了个Qt开源包.   1.解压:tar xvf qt-everywhere-opensource-src-4.8.0.tar     进入解压后文件夹c
eclipse编译servlet出现问题!!!
eclipse<em>编译</em>servlet是自动<em>编译</em>的,可是我做一个简单的登录窗口用到一个login.jsp和一个处理form 的Loginservlet.javarn可是保存完这个servlet后没有发现Loginservlet.class,右击工程属性看<em>编译</em>后class的位置发现在MyWebProject/WebRoot/WEB-INF/classes,可是我在左边的workspace里却找不到classes目录,也没有发现Loginservlet.class,我的jar都导入了,配置也都是默认的啊rneclipse刚上手,希望大家给我点指点rn被一个简单的问题搞的头晕了
自定义函数编译出现问题
新建了一个win32 application工程.rn两个文件:main.crn my.crnrnmy.c中放自定义的函数。其中我定义了一个函数:rn void closeSocket_skt(SOCKET connect_skt) rn rn closesocket(connect_skt);rn rn<em>编译</em>提示:rnd:\vc\test\my.c(1) : error C2146: syntax error : missing ')' before identifier 'connect_skt'rnd:\vc\test\my.c(1) : error C2061: syntax error : identifier 'connect_skt'rnd:\vc\test\my.c(1) : error C2059: syntax error : ';'rnd:\vc\test\my.c(1) : error C2059: syntax error : ')'rnd:\vc\test\my.c(2) : error C2449: found '' at file scope (missing function header?)rnd:\vc\test\my.c(4) : error C2059: syntax error : ''rnError executing cl.exe.rn如果我将该函数放置到main.c中,则<em>编译</em>正确!rn请问这是什么原因?
vs2010编译出现问题
[code=C/C++][/code]rn#pragma oncernrnrnclass CBoxrnrnpublic:rn CBox(double lv,double lw,double lh);rn ~CBox();rn double Volume()const;rn double GetLeng()const;rn double GetWide()const;rn double GetHeight()const;rn //重载加运算符rn CBox operator+(const CBox& aBox)const;rnrn //重载乘运算符rn CBox operator*(int n)const;rnrn //重载除运算符rn int operator/(const CBox& aBox)const;rnprivate:rn double m_Leng;rn double m_Wide;rn double m_Height;rn//这是 ddd.h 文件的 内容 rn[code=C/C++][/code]rn#include "ddd.h"rnrndouble CBox::GetHeight()constrnrn return m_Height;rnrnrndouble CBox::GetLeng()constrnrn return m_Leng;rnrnrndouble CBox::GetWide()constrnrn return m_Wide;rn//这是 ddd.cpp 文件内容rnrnrn<em>编译</em>的时候出现这样的<em>编译</em>错误(这是语法错误,但我觉得我的语法并没有错)rn[color=#3366FF]1>ddd.cpp(3): error C2628: “CBox”后面接“double”是非法的(是否忘记了“;”?)rn1>ddd.cpp(4): error C2556: “CBox CBox::GetHeight(void) const”: 重载函数与“double CBox::GetHeight(void) const”只是在返回类型上不同rn1> d:\documents\visual studio 2010\projects\aaaa\aaaa\ddd.h(12) : 参见“CBox::GetHeight”的声明rn1>ddd.cpp(4): error C2371: “CBox::GetHeight”: 重定义;不同的基类型rn1> d:\documents\visual studio 2010\projects\aaaa\aaaa\ddd.h(12) : 参见“CBox::GetHeight”的声明rn1> aaa.cpprn1> 正在生成代码...rn1> 正在跳过...(未检测到相关更改)rn1> operlater.cpprn1>[/color]rn补充: 我之前<em>编译</em>驱动的时候也出现了这种情况就是明明代码没错,但<em>编译</em>的时候就出现了语法错误了,之后我在看雪那找到了个方法。就是 用好像是ddk里面的文件代替了vs2010里面的一个文件(其实我也不记得是vs2010的文件替换掉ddk里面的文件还是调转来),这样就可以<em>编译</em>驱动了,现在<em>编译</em>这程序又不行了,怎么办?
编译boost_1_33_1出现问题
<em>编译</em>boost 的时候,进入boost\tools\build\jam_src运行build.bat批处理文件出现提示为:\Microsoft was unexpected at this time. 我的机器是win7 64bit的! 所以会有Program Files(x86)rnrnrn请问这个问题怎么解决?!!!
delphi 编译出现问题 请教!!!
<em>编译</em>后一段时间(或点击窗体) 自动弹出以下错误:rnproject d:\\***\***\aa.exe raised too many consecutive exceptions 'single step at 0x010861ee'.Process Stopped.Use Step or Run to continue.rn这样我的delphi 就不能调试程序!rn重装delphi也不行!!!rn请问是什么问题?怎么解决阿?rn是 delphi7
定制模拟器编译出现问题
软件平台:wince6.0rn硬件平台:S5PV210rnrn定制wince模拟器,<em>编译</em>的时候出现如下<em>编译</em>ERROR:rn[code=C/C++]rnBUILD: [00:0000001271:PROGC ] Building COMPILE Pass in C:\WINCE600\PLATFORM\COMMON\SRC\SOC\S5PV210_SEC_V1\OAL\INTR\ directory.rnBUILD: [01:0000001281:PROGC ] Compiling .\intr.crnBUILD: [01:0000001284:ERRORE] C:\WINCE600\PLATFORM\COMMON\SRC\SOC\S5PV210_SEC_V1\OAL\INTR\.\intr.c(25) : fatal error C1083: Cannot open include file: 'soc_cfg.h': No such file or directoryrnBUILD: [01:0000001285:PROGC ] Compiling .\fiq.crnBUILD: [01:0000001288:PROGC ] Compiling .\map.crnBUILD: [01:0000001291:ERRORE] C:\WINCE600\PLATFORM\COMMON\SRC\SOC\S5PV210_SEC_V1\OAL\INTR\.\map.c(22) : fatal error C1083: Cannot open include file: 'intr_reg.h': No such file or directoryrn[/code]rnrn我看了下"C:\WINCE600\PLATFORM\COMMON\SRC\SOC\S5PV210_SEC_V1\OAL\INTR"的source文件:rn[code=C/C++]rnrnTARGETNAME = oal_intr_S5PV210_sec_v1rnTARGETTYPE = LIBRARYrnrnSYNCHRONIZE_DRAIN = 1rnNOMIPS16CODE = 1rnrnCDEFINES = $(CDEFINES) -DCEDDK_USEDDKMACRO -DOAL_BSP_CALLBACKSrnrn!IF "$(ENABLE_OAL_ILTIMING)"=="1"rnCDEFINES = $(CDEFINES) -DOAL_ILTIMINGrn!ENDIFrnrn!IF "$(BSP_USEDVFS)" == "1"rnCDEFINES = $(CDEFINES) -DBSP_USEDVFSrn!ENDIFrnrn!if "$(BSP_TICK_COMPENSATION)" == "1"rnCDEFINES=$(CDEFINES) -DRTC_TICK_ERROR_COMPENSATIONrn!endifrnrnINCLUDES = $(INCLUDES);..\INCrnrnSOURCELIBS = \rn $(_PLATCOMMONLIB)\$(_CPUDEPPATH)\oal_intr_common.librnrnSOURCES = \rn intr.c \rn fiq.c \rn map.crn[/code]rnrn首先确定的是BSP是没有任何问题的,因为<em>编译</em>在硬件上跑的NK是没有任何问题的!rn定制模拟器的时候,第一步选择的是:rn[img=http://hi.csdn.net/attachment/201107/25/62540_1311571247IY6w.jpg][/img]rnrn不知道有没有做过相关内容的兄弟,指导下~~
编译OpenJDK出现问题
本人刚刚接触Java虚拟机方面的知识,看了一下《深入理解Java虚拟机一书》,但刚刚开始<em>编译</em>就遇到了问题,make sanity<em>编译</em>成功,但make之后出现的错误如下:rn[code=text]build-bootstrap-javac:rn [javac] Compiling 95 source files to /home/xlf/jdk7u-dev/build/langtools/build/bootstrap/classesrn [javac] /home/xlf/jdk7u-dev/langtools/src/share/classes/com/sun/tools/javac/comp/Resolve.java:2182: warning: [overrides] Class Resolve.InapplicableSymbolsError.Candidate overrides equals, but neither it nor any superclass overrides hashCode methodrn [javac] private class Candidate rn [javac] ^rn [javac] error: warnings found and -Werror specifiedrn [javac] 1 errorrn [javac] 1 warningrnrnBUILD FAILEDrn/home/xlf/jdk7u-dev/langtools/make/build.xml:452: The following error occurred while executing this line:rn/home/xlf/jdk7u-dev/langtools/make/build.xml:795: Compile failed; see the compiler error output for details.rnrnTotal time: 3 secondsrnmake[2]: *** [build] Error 1rnmake[2]: Leaving directory `/home/xlf/jdk7u-dev/langtools/make'rnmake[1]: *** [langtools-build] Error 2rnmake[1]: Leaving directory `/home/xlf/jdk7u-dev'rnmake: *** [build_product_image] Error 2[/code]rn不太明白是为什么,希望有大神能够指教一下!不胜感激!!!
我要编译LINUX内核.出现问题
在#make xconfig命令后rn出现错误rn"rn#make xconfigrnHOSTOC scripts/basic/plit-includern file included from /usr/include/linux/errno.h:4,rn from /usr/include/bits/errno.h:25,rn from /usr/include/errno.h:36,rn from script/basic/split-include.c:26:rn/usr/include/asm/errno.h:4:31: asm-generic/errno.h: 没有那个文件或目录rnmake[1]:***[scripts/basic/split-include] Error 1rnmake: ***[scripts_basic] Error 2rn"rn这怎么解决啊?rn我是新手要作毕业设计"LINUX下的PCI设备扩展"请高手指点一下,呵呵
C++ 多线程编译出现问题
#include rn#include "iostream.h"rnrnrnrnvoid* tprocess1(void* args)rn while(1)rn cout << "tprocess1" << endl;rn rn return NULL;rnrnrnvoid* tprocess2(void* args)rn while(1)rn cout << "tprocess2" << endl;rn rn return NULL;rnrnrnint main()rn pthread_t t1;rn pthread_t t2;rn pthread_create(&t1,NULL,tprocess1,NULL);rn pthread_create(&t2,NULL,tprocess2,NULL);rn pthread_join(t1,NULL);rn return 0;rnrnrn错误提示:rnCompiling...rn2.cpprnLinking...rn2.obj : error LNK2001: unresolved external symbol __imp__pthread_joinrn2.obj : error LNK2001: unresolved external symbol __imp__pthread_creaternDebug/多线程.exe : fatal error LNK1120: 2 unresolved externalsrn执行 link.exe 时出错.rnrn多线程.exe - 1 error(s), 0 warning(s)rn
编译出现问题,帮帮忙!
高手们这个是什么错误啊,找了半天了,找不出来rnLinking...rnnafxcwd.lib(afxmem.obj) : error LNK2005: "void * __cdecl operator new(unsigned int)" (??2@YAPAXI@Z) already defined in LIBCD.lib(new.obj)rnnafxcwd.lib(afxmem.obj) : error LNK2005: "void __cdecl operator delete(void *)" (??3@YAXPAX@Z) already defined in libcpd.lib(delop.obj)rnnafxcwd.lib(thrdcore.obj) : error LNK2001: unresolved external symbol __endthreadexrnnafxcwd.lib(thrdcore.obj) : error LNK2001: unresolved external symbol __beginthreadexrnDebug/8.exe : fatal error LNK1120: 2 unresolved externalsrnrn代码:rnrn/*head.h*/rn#ifndef HEADrn #define HEADrn #include rn #include rn using namespace std;rn#endifrnrn/*Book.h*/rn#include "head.h"rnrnclass Bookrnrn public:rn Book(string &book_name, string &book_id, string &book_author, string &book_publish, double &book_price);rn private:rn string book_name, book_id, book_author, book_pulish;rn double book_price;rn;rnrn/*Book.cpp*/rn#include "Book.h"rnrnBook::Book(string &book_name, string &book_id, string &book_author, string &book_pulish, double &book_price)rn: book_name(book_name), book_id(book_id), book_author(book_author), book_pulish(book_pulish), book_price(book_price)rnrnrnrnrn/*Borrow_Record.h*/rn#include "head.h"rn#include rnrnclass Borrow_Recordrnrn public:rn Borrow_Record(string &card_id, string &book_id);rn private:rn string &card_id, book_id;rn CTime borrow_time, return_time;rn;rnrn/*Library_Card.h*/rn#include "head.h"rnrnclass Library_Cardrnrn public:rn Library_Card(string &card_id, string &card_name, string &card_class, string &profession);rn private:rn string card_id, card_name, card_class, profession;rn;rnrn/*Library_Card.cpp*/rn#include "Library_Card.h"rnrnLibrary_Card::Library_Card(string &card_id, string &card_name, string &card_class, string &profession)rn:card_id(card_id), card_name(card_name), card_class(card_class), profession(profession)rnrnrnrnrn/*Borrow_Record.cpp*/rn#include "Borrow_Record.h"rnrnBorrow_Record::Borrow_Record(string &card_id, string &book_id)rn:card_id(card_id), book_id(book_id)rnrn CTime time = CTime::GetCurrentTime();rn borrow_time = time;rn CTimeSpan tp(30,0,0,0);rn time += tp;rn return_time = time;rnrnrn/*main.cpp*/rn#include "Book.h"rn#include "Library_Card.h"rn#include "Borrow_Record.h"rn#include rnrnrnint main()rnrn vector book;rn vector card;rn vector record;rnrn int op(1);rnrn cout << "选择你要的操作:/t 1、增加图书信息;\t2、增加借书证信息;\t3、增加借书记录;\t0、退出";rn cin >> op;rnrn while(1 == 1)rn rn switch(op)rn rn case 1 : break;rn case 2 : break;rn case 3 : break;rn case 0 : break;rn default : ;rn rn rnrn return 0;rnrn
vc下zlib编译出现问题~~~~~~~~
我刚刚下了一个zlib的源代码,下载地址:http://www.zlib.net/zlib123.zip,用vc打开其中的projects\visualc6下的zlib.dsw工程文件后,进行<em>编译</em>,就报出了以下的错误:rnrn--------------------Configuration: zlib - Win32 LIB ASM Debug--------------------rnAssembling...rn'ml.exe' 不是内部或外部命令,也不是可运行的程序rn或批处理文件。rnError executing c:\windows\system32\cmd.exe.rnrnzlibd.lib - 1 error(s), 0 warning(s)rnrn我找了一下也没发现有“ml.exe”这样的文件啊,不晓得是哪个地方出的问题啊!源代码是绝对没有动过的。希望有对zlib有研究的帮帮忙啊!先谢过啦!
编译docker源码出现问题
初学docker,尝试静态迁移。我在<em>编译</em>docker源码的时候使用make build时成功,但是接下来使用make binary的时候提示出现错误,但是这个错误我并不知道怎么去解决,也没有找到相应的解决办法。希望有知道的人能为我解惑,感激不尽!rn[img=https://img-bbs.csdn.net/upload/201608/01/1470038690_272557.png][/img]rnrn我<em>编译</em>的源码文件在[url=https://github.com/boucher/docker/releases/tag/v1.10_2-16-16-experimental][/url] 此外在最下面的网址docker1.10标签中,上面说到用dev文件去创建一个daemon,貌似没有说到<em>编译</em>的事情,这几个文件的用法我也不是很清楚,如果您能给出确切的建议,感激不尽!rn参考网站:rn[url=https://docs.docker.com/v1.5/contributing/devenvironment/][/url]rn[url=https://criu.org/Docker][/url]rn
gcc 编译出现问题
. /configure --prefix=/usr/local/gcc-4.1.0/gcc-buildrn提示configure: error: no acceptable cc found in $PATHrn不知道怎么解决rn
Eclipse编译项目出现问题
今天在使用eclipse<em>编译</em>项目时,出现如下的问题 出现这个问题的原因是,在<em>编译</em>项目的时候,使用的buildtools为sdk最新的<em>编译</em>工具,只需要在project.properties文件中添加sdk.buildtools=23.0.1即可
SSD编译出现问题
nvcc warning : The 'compute_20', 'sm_20', and 'sm_21' architectures are deprecated, and may be removed in a future release (Use -Wno-deprecated-gpu-targets to suppress warning). nvcc warning : The 'c
编译连接出现问题,求解!
all references to "SHELL32.dll" discarded by /OPT:REFrn什么原因啊?
uboot编译出现问题
[img=https://img-bbs.csdn.net/upload/201409/16/1410867755_187431.jpg][/img]rn如图,请问这是什么问题啊,怎么解决啊?
【求救】编译spca5xx出现问题
学着在linux下安装摄像头驱动,但是进行到<em>编译</em>阶段就<em>出现问题</em>,请大虾指点迷津,感激感激。rnrnlinux:RH9rndriver:spca5xx-20060301rn安装步骤:rn1、<em>编译</em>内核rn2、spca5xx-20060301/make cleanrn3、spca5xx-20060301/makern此时<em>编译</em>的打印信息如下:rn[root@EnotsComputer spca5xx-20060301]# makernCompiling drivers/usb/spcadecoder.crnCompiling drivers/usb/spca5xx.crnIn file included from /lib/modules/2.4.20-8/build/include/linux/vmalloc.h:8,rn from drivers/usb/spca5xx.c:46:rn/lib/modules/2.4.20-8/build/include/linux/highmem.h: In function `bh_kmap':rn/lib/modules/2.4.20-8/build/include/linux/highmem.h:20: warning: pointer of type `void *' used in arithmeticrndrivers/usb/spca5xx.c: In function `spca5xx_mmap':rndrivers/usb/spca5xx.c:5081: warning: passing arg 1 of `remap_page_range_R2baf18f2' makes pointer from integer without a castrndrivers/usb/spca5xx.c:5081: incompatible type for argument 4 of `remap_page_range_R2baf18f2'rndrivers/usb/spca5xx.c:5081: too few arguments to function `remap_page_range_R2baf18f2'rndrivers/usb/spca5xx.c: At top level:rndrivers/usb/spca5xx.c:5126: warning: initialization from incompatible pointer typerndrivers/usb/spca5xx.c:8426: warning: initialization from incompatible pointer typerndrivers/usb/spca5xx.c:8427: warning: initialization from incompatible pointer typerndrivers/usb/spca5xx.c:8428: warning: initialization from incompatible pointer typerndrivers/usb/spca5xx.c:8429: warning: braces around scalar initializerrndrivers/usb/spca5xx.c:8429: warning: (near initialization for `spca5xx_driver.disconnect')rndrivers/usb/spca5xx.c:8429: warning: excess elements in scalar initializerrndrivers/usb/spca5xx.c:8429: warning: (near initialization for `spca5xx_driver.disconnect')rndrivers/usb/spca5xx.c:150: warning: `bright' defined but not usedrndrivers/usb/spca5xx.c:151: warning: `contrast' defined but not usedrnmake: *** [drivers/usb/spca5xx.o] Error 1rn
C++ 银行家算法 编译出现问题
#include rnusing namespace std; rn#include rn#include rnrnrn#define M 3 //资源的种类数rn#define N 5 //进程的个数rnrnvoid output(int iMax[N][M],int iAllocation[N][M],int iNeed[N][M],int iAvailable[M],char cName[N]); //统一的输出格式rnbool safety(int iAllocation[N][M],int iNeed[N][M],int iAvailable[M],char cName[N]);rnbool banker(int iAllocation[N][M],int iNeed[N][M],int iAvailable[M],char cName[N]);rnrnvoid main()rnrn int i,j;rn //当前可用每类资源的资源数rn int iAvailable[M]=3,3,2;rn //系统中N个进程中的每一个进程对M类资源的最大需求rn int iMax[N][M]=7,5,3,3,2,2,9,0,2,2,2,2,4,3,3;rn //iNeed[N][M]每一个进程尚需的各类资源数rn //iAllocation[N][M]为系统中每一类资源当前已分配给每一进程的资源数rn int iNeed[N][M],iAllocation[N][M]=0,1,1,2,0,0,3,0,2,2,1,1,0,0,2;rn //进程名rn char cName[N]='a','b','c','d','e';rn bool bExitFlag=true; //退出标记rn char ch; //接收选择是否继续提出申请时传进来的值rn bool bSafe; //存放安全与否的标志rn //计算iNeed[N][M]的值rn for(i=0;i
java编译出现问题
<em>编译</em>一个源文件时,出现下面这样的错误:rn注意:F:\Java\vector\TestCollection.java 使用了未经检查或不安全的操作。要了解详细信息,请使用 -Xlint:unchecked 重新<em>编译</em>。rn这是什么原因?
编译D3D例子,出现问题
将多个文件加入工程后,<em>编译</em>ClipVolume.cpp未出错,而d3dapp.cpp,d3dfile.cpp就出错了。并且是dxsdk\samples\c++\common\include\d3denumeration.h(31) : error C2146: syntax error : missing ';' before identifier 'AdapterIdentifier'的头文件。rn我不知道为什么,8.1就没有错呀。rn请指教
编译通过,安装出现问题
因为我在lib中导入了一个okio包。 这个包是在retefit2 和 okhttp中都会用到的 数据流读写操作的类库。 因为项目中用到了retrofit2 ,而其用到了okhttp,自己使用oss进行导入lib中后,带了一个oss自带的okhttp 2. 6 版本, 然后带了一个 okio 包 。 报错 解决办法:删除掉 okio包, 如何发现:看一下自己ap
linux中编译出现问题
先是./configurernrn[code=text]root@ubuntu:~/Desktop/spro-4.0# ./configurernchecking for a BSD-compatible install... /usr/bin/install -crnchecking whether build environment is sane... yesrn/root/Desktop/spro-4.0/auxdir/missing: Unknown `--run' optionrnTry `/root/Desktop/spro-4.0/auxdir/missing --help' for more informationrnconfigure: WARNING: `missing' script is too old or missingrnchecking for gawk... gawkrnchecking whether make sets $MAKE... yesrnchecking for a BSD-compatible install... /usr/bin/install -crnchecking for ranlib... ranlibrnchecking for gcc... gccrnchecking for C compiler default output... a.outrnchecking whether the C compiler works... yesrnchecking whether we are cross compiling... nornchecking for suffix of executables... rnchecking for suffix of object files... ornchecking whether we are using the GNU C compiler... yesrnchecking whether gcc accepts -g... yesrnchecking for style of include used by make... GNUrnchecking dependency style of gcc... gcc3rnchecking for gcc option to accept ANSI C... none neededrnchecking how to run the C preprocessor... gcc -Ernchecking for AIX... nornchecking for ANSI C header files... yesrnchecking for sys/types.h... yesrnchecking for sys/stat.h... yesrnchecking for stdlib.h... yesrnchecking for string.h... yesrnchecking for memory.h... yesrnchecking for strings.h... yesrnchecking for inttypes.h... yesrnchecking for stdint.h... yesrnchecking for unistd.h... yesrnchecking minix/config.h usability... nornchecking minix/config.h presence... nornchecking for minix/config.h... nornchecking for library containing strerror... none requiredrnchecking for function prototypes... yesrnchecking for ANSI C header files... (cached) yesrnchecking for string.h... (cached) yesrnchecking for gcc option to accept ANSI C... none neededrnchecking for an ANSI C-conforming const... yesrnchecking for inline... inlinernchecking whether byte ordering is bigendian... nornchecking for size_t... yesrnchecking for char... yesrnchecking size of char... 1rnchecking for short... yesrnchecking size of short... 2rnchecking for long... yesrnchecking size of long... 8rnchecking for ANSI C header files... (cached) yesrnchecking whether time.h and sys/time.h may both be included... yesrnchecking sys/time.h usability... yesrnchecking sys/time.h presence... yesrnchecking for sys/time.h... yesrnchecking limits.h usability... yesrnchecking limits.h presence... yesrnchecking for limits.h... yesrnchecking malloc.h usability... yesrnchecking malloc.h presence... yesrnchecking for malloc.h... yesrnchecking stdarg.h usability... yesrnchecking stdarg.h presence... yesrnchecking for stdarg.h... yesrnchecking for stdlib.h... (cached) yesrnchecking math.h usability... yesrnchecking math.h presence... yesrnchecking for math.h... yesrnchecking for string.h... (cached) yesrnchecking errno.h usability... yesrnchecking errno.h presence... yesrnchecking for errno.h... yesrnchecking for working alloca.h... yesrnchecking for alloca... yesrnchecking for vprintf... yesrnchecking for _doprnt... norn./configure: line 6057: CF_GCC_WARNINGS: command not foundrnchecking if malloc debugging is wanted... nornconfigure: creating ./config.statusrnconfig.status: creating Makefilernconfig.status: creating doc/Makefilernconfig.status: creating auxdir/Makefilernconfig.status: creating test/Makefilernconfig.status: creating test/ref/Makefilernconfig.status: creating test/dat/Makefilernconfig.status: creating config.hrnconfig.status: config.h is unchangedrnconfig.status: executing depfiles commandsrn[/code]rnrn然后make[code=text]root@ubuntu:~/Desktop/spro-4.0# makernmake all-recursivernmake[1]: Entering directory '/root/Desktop/spro-4.0'rnMaking all in docrnMaking all in auxdirrnmake[2]: Entering directory '/root/Desktop/spro-4.0/auxdir'rnmake[2]: Nothing to be done for 'all'.rnmake[2]: Leaving directory '/root/Desktop/spro-4.0/auxdir'rnMaking all in testrnmake[2]: Entering directory '/root/Desktop/spro-4.0/test'rnMaking all in refrnmake[3]: Entering directory '/root/Desktop/spro-4.0/test/ref'rnmake[3]: Nothing to be done for 'all'.rnmake[3]: Leaving directory '/root/Desktop/spro-4.0/test/ref'rnMaking all in datrnmake[3]: Entering directory '/root/Desktop/spro-4.0/test/dat'rnmake[3]: Nothing to be done for 'all'.rnmake[3]: Leaving directory '/root/Desktop/spro-4.0/test/dat'rnmake[3]: Entering directory '/root/Desktop/spro-4.0/test'rnmake[3]: Nothing to be done for 'all-am'.rnmake[3]: Leaving directory '/root/Desktop/spro-4.0/test'rnmake[2]: Leaving directory '/root/Desktop/spro-4.0/test'rnmake[2]: Entering directory '/root/Desktop/spro-4.0'rngcc -g -O2 -o scopy scopy.o getopt.o getopt1.o -lm -L. -lspro rn./libspro.a(misc.o): In function `spf_buf_normalize':rn/root/Desktop/spro-4.0/misc.c:276: undefined reference to `sqrt'rn/root/Desktop/spro-4.0/misc.c:185: undefined reference to `sqrt'rn./libspro.a(misc.o): In function `set_lifter':rn/root/Desktop/spro-4.0/misc.c:402: undefined reference to `sin'rn./libspro.a(misc.o): In function `sig_normalize':rn/root/Desktop/spro-4.0/misc.c:425: undefined reference to `sqrt'rn./libspro.a(misc.o): In function `set_sig_win':rn/root/Desktop/spro-4.0/misc.c:458: undefined reference to `cos'rn/root/Desktop/spro-4.0/misc.c:473: undefined reference to `cos'rn/root/Desktop/spro-4.0/misc.c:473: undefined reference to `cos'rn/root/Desktop/spro-4.0/misc.c:465: undefined reference to `cos'rncollect2: error: ld returned 1 exit statusrnMakefile:307: recipe for target 'scopy' failedrnmake[2]: *** [scopy] Error 1rnmake[2]: Leaving directory '/root/Desktop/spro-4.0'rnMakefile:386: recipe for target 'all-recursive' failedrnmake[1]: *** [all-recursive] Error 1rnmake[1]: Leaving directory '/root/Desktop/spro-4.0'rnMakefile:202: recipe for target 'all' failedrnmake: *** [all] Error 2rn[/code]rnrnmake就报错了。。。 好像configure就有错了rnrn目录和里面的东西已经设置成777了 所以不会是权限问题rnrn这是在linux中安装一个叫spro的东西rnhttp://www.irisa.fr/metiss/guig/spro/install.htmlrn按照官网的教程 下载4.0的安装之后出现的问题rn实在是不懂c和c++ rn百度了半天也搞不懂为什么错。。。rnrn请求大佬们帮帮忙 谢谢了!
MATLAB编译libsvm出现问题
今天用MATLAB<em>编译</em>libsvm<em>出现问题</em>特此总结一下: 主要问题是VS版本过高而MATLAB版本过低。 可以通过下载TDM-GCC-64解决问题, 下面是TDM的下载过程 第一步:下载TDM-GCC(注意看清是32位还是64位),TDM-GCC的安装路径不要包括空格;  http://tdm-gcc.tdragon.net/download  第二步:新建环境变量MW_MINGW64
求助:j2ee编译出现问题??
各位java前辈:rn小弟初学j2ee架设一个入门的helloWorld教程就遇到了问题,<em>编译</em>了Cleint.java文件后,用java Client查看信息就报错如下:rnException in thread "main" javax.naming.NoInitialContextException: Need to specirnfy class name in environment or system property, or as an applet parameter, or irnn an application resource file: java.naming.factory.initialrn at javax.naming.spi.NamingManager.getInitialContext(Unknown Source)rn at javax.naming.InitialContext.getDefaultInitCtx(Unknown Source)rn at javax.naming.InitialContext.getURLOrDefaultInitCtx(Unknown Source)rn at javax.naming.InitialContext.lookup(Unknown Source)rn at Client.main(Client.java:9)rn困扰了我很久,一直不知是出于什么原因,还望各位前辈给予指点,谢谢!以下是四个源文件。rn…………………………………………………………………………………………..rnHello.javarnimport javax.ejb.*;rnimport java.rmi.*;rnpublic interface Hello extends EJBObject rn // 业务方法,必须抛出RemoteException:rn public String say() throws RemoteException;rnrn………………………………………………………………………………….rnHome.javarnimport java.io.*;rnimport java.rmi.*;rnimport javax.ejb.*;rnrnpublic interface HelloHome extends EJBHome rn // create方法需要抛出RemoteException和CreateException:rn Hello create() throws RemoteException, CreateException;rnrn……………………………………………………………………………………..rnHelloBean.javarnimport java.rmi.*;rnimport javax.ejb.*;rnpublic class HelloBean implements SessionBean rn private SessionContext ctx;rn public String say() rn return "Hello, world.";rn rn public void setSessionContext(SessionContext ctx) rn this.ctx = ctx;rn rn public void ejbCreate() rn public void ejbRemove() rn public void ejbActivate() rn public void ejbPassivate() rnrn…………………………………………………………………………………………….rnClient.javarnimport javax.naming.*;rnimport javax.rmi.*;rnpublic class Client rn public static void main(String[] args) throws Exception rn // init context:rn Context ctx = new InitialContext();rn // 通过JNDI查找HelloBean:rn Object obj = ctx.lookup("ejb/Hello");rn // 获得home object:rn HelloHome home = (HelloHome)PortableRemoteObject.narrow(obj, HelloHome.class);rn // 创建ejb object:rn Hello hello = home.create();rn // 调用商业方法:rn String words = hello.say();rn System.out.println(words);rn rnrn……………………………………………………………………………………………….rnrn
编译人脸识别的时候出现问题
错误 46 error LNK2001: 无法解析的外部符号 __imp_CryptAcquireContextA E:\face_code\Face-c925292b7a966f46b39c8a240cc97611d5c20ab2\Face.git\win\FaceDetect\NlprAuthorization.lib(md5.obj)
FFmpeg编译出现问题
1.一般问题解决添加头文件的地址 2.添加头文件 _ns;
VC编译出现问题
各位大侠,我用vc<em>编译</em>时只能<em>编译</em>一次,在文档里会生成一个ver.dat文件,然后就不能进行第二次<em>编译</em>了,说是对rc文件进行访问时发生了一个错误,这是怎么了?还请各位指导!
g++编译C++出现问题.........
#includernusing namespace std;rnclass Pointrnrnpublic:rn Point(int xx=0,int yy=0) X=xx;Y=yy;rn Point(Point &p);rn int GetX() return X;rn int GetY() return Y;rnprivate:rn int X,Y;rn;rnPoint::Point(Point &p)rnrn X=p.X;rn Y=p.Y;rn cout<<
编译一个函数出现问题
先声明:rnvoid WriteLogFile(char* fileName,char *content,BOOL bCloseLog=FALSE);rn再定义:rnvoid WriteLogFile(char* fileName,char *content,BOOL bCloseLog)rnrn rn rn发现<em>编译</em>不能通过?
AR8161网卡驱动编译出现问题
我电脑装完系统,不能连接以太网。ifconfig看一下,没有网卡。rn[code=text]linux-rbq3:/ # ifconfig rnlo Link encap:Local Loopback rn inet addr:127.0.0.1 Mask:255.0.0.0rn inet6 addr: ::1/128 Scope:Hostrn UP LOOPBACK RUNNING MTU:65536 Metric:1rn RX packets:36 errors:0 dropped:0 overruns:0 frame:0rn TX packets:36 errors:0 dropped:0 overruns:0 carrier:0rn collisions:0 txqueuelen:0 rn RX bytes:1800 (1.7 Kb) TX bytes:1800 (1.7 Kb)rnrnwlan0 Link encap:Ethernet HWaddr 9C:4E:36:52:F0:9C rn inet addr:192.168.1.5 Bcast:192.168.1.255 Mask:255.255.255.0rn inet6 addr: fe80::9e4e:36ff:fe52:f09c/64 Scope:Linkrn UP BROADCAST RUNNING MULTICAST MTU:1500 Metric:1rn RX packets:11812 errors:0 dropped:0 overruns:0 frame:0rn TX packets:12714 errors:0 dropped:0 overruns:0 carrier:0rn collisions:0 txqueuelen:1000 rn RX bytes:9506254 (9.0 Mb) TX bytes:2634706 (2.5 Mb)rn[/code]rnrn[code=text]linux-rbq3:/ # ifconfig eth0 uprneth0: unknown interface: No such devicern[/code]rnrn没有网卡驱动。看看自己的网卡型号rn[code=text]linux-rbq3:/ # lspci|grep netrn02:00.0 Ethernet controller: Atheros Communications Inc. AR8161 Gigabit Ethernet (rev 08)rn[/code]rnrn然后google,baidu AR8161的驱动。rn找到了compat-wireless 兼容驱动,安装之(gcc,kernel-headers,kernel-devel都已安装)rn[code=text]# tar xf compat-wireless-3.6.8-1.tar.bz2 rn# cd compat-wireless-3.6.8-1/rncompat-wireless-3.6.8-1 # ./scripts/driver-select alxrnProcessing new driver-select request...rnBacking up makefile: Makefile.bkrnBackup exists: Makefile.bkrnBacking up makefile: drivers/net/ethernet/broadcom/Makefile.bkrnBacking up makefile: drivers/net/ethernet/atheros/Makefile.bkrnBackup exists: Makefile.bkrnBackup exists: Makefile.bkrnBackup exists: drivers/net/ethernet/broadcom/Makefile.bkrn[/code]rn[code=text]compat-wireless-3.6.8-1 # makernmake -C /lib/modules/3.7.10-1.24-desktop/build M=/home/monking/Downloads/compat-wireless-3.6.8-1 modules rnmake[1]: Entering directory `/usr/src/linux-3.7.10-1.24-obj/x86_64/desktop' rn/usr/src/linux-3.7.10-1.24/scripts/Makefile.build:44: /home/monking/Downloads/compat-wireless-3.6.8-1/drivers/net/ethernet/atheros/alx/Makefile: No such file or directory rnmake[6]: *** No rule to make target `/home/monking/Downloads/compat-wireless-3.6.8-1/drivers/net/ethernet/atheros/alx/Makefile'. Stop. rnmake[5]: *** [/home/monking/Downloads/compat-wireless-3.6.8-1/drivers/net/ethernet/atheros/alx] Error 2 rnmake[4]: *** [/home/monking/Downloads/compat-wireless-3.6.8-1/drivers/net/ethernet/atheros] Error 2 rnmake[3]: *** [_module_/home/monking/Downloads/compat-wireless-3.6.8-1] Error 2 rnmake[2]: *** [sub-make] Error 2 rnmake[1]: *** [all] Error 2 rnmake[1]: Leaving directory `/usr/src/linux-3.7.10-1.24-obj/x86_64/desktop' rnmake: *** [modules] Error 2 [/code]rnrnrn然后就到这一步继续不下去了。提示说没有/home/monking/Downloads/compat-wireless-3.6.8-1/drivers/net/ethernet/atheros/alx/Makefile这个文件,怎么解决啊?rnrn
libxml2 在linux下的编译出现问题
错误如下rnruntest.c:196:18: fatal error: glob.h: No such file or directoryrncompilation terminated.rnmake[5]: *** [runtest.o] Error 1rnmake[4]: *** [all-recursive] Error 1rnmake[3]: *** [all] Error 2rnmake[2]: *** [THIRD_PARTY] Error 2rnmake[1]: *** [utils/thirdparty/CMakeFiles/THIRD_PARTY.dir/all] Error 2rnmake: *** [all] Error 2rnrnrn大神们求帮助啊
编译linux内核出现问题
我在对单个的linux内核程序进行预处理时,用-I指定了搜索路径,可是这只能找到#include<>的头文件,#include ""的就找不到,这是什么问题,要怎么办呀?
编译busybox出现问题
我用的是Ubuntu16 <em>编译</em>工具链是arm-linux-4.5.1 busybox 是busybox-1.25.0rn在网上已经查过资料但是问题还是没有解决啊! 哪位大神帮下忙谢谢啊rn以下是make之后出现的问题rnrnmiscutils/nandwrite.c: In function 'nandwrite_main':rnmiscutils/nandwrite.c:152:3: error: 'MTD_FILE_MODE_RAW' undeclared (first use in this function)rnmiscutils/nandwrite.c:152:3: note: each undeclared identifier is reported only once for each function it appears inrnscripts/Makefile.build:197: recipe for target 'miscutils/nandwrite.o' failedrnmake[1]: *** [miscutils/nandwrite.o] Error 1rnMakefile:742: recipe for target 'miscutils' failedrnmake: *** [miscutils] Error 2rn
SSD编译的时候出现问题
/usr/include/boost/property_tree/detail/json_parser_read.hpp: In constructor ‘boost::property_tree::json_parser::json_grammar::definition::definition(const boost::property_tree::json_parser::json_gram
MTK-A10环境 编译出现问题
请问这个问题怎么解决,网上找了一天也没有一个适合是解决方案rn
编译uboot出现问题
[img=https://img-bbs.csdn.net/upload/201409/16/1410857340_692190.jpg][/img]rn请问一下我<em>编译</em>uboot的时候出现这个错误是什么意思啊?
编译release出现问题
在<em>编译</em>debug的时候没有出错的提示,但是在<em>编译</em>release的时候,居然超过了100个error;rn------ 已启动全部重新生成: 项目: yhzl, 配置: Release Win32 ------rn正在删除项目“yhzl”(配置“Release|Win32”)的中间文件和输出文件rn正在<em>编译</em>...rnstdafx.cpprn正在<em>编译</em>...rnyhzlDlg.cpprnh:\程序设计\yhzl\yhzl\ExcelAccess.h(146) : error C2664: “SQLGetInstalledDriversW”: 不能将参数 1 从“char [2001]”转换为“LPWSTR”rn 与指向的类型无关;转换要求 reinterpret_cast、C 样式转换或函数样式转换rnh:\程序设计\yhzl\yhzl\ExcelAccess.h(231) : error C2664: “MessageBoxW”: 不能将参数 2 从“const char [36]”转换为“LPCWSTR”rn 与指向的类型无关;转换要求 reinterpret_cast、C 样式转换或函数样式转换rnh:\程序设计\yhzl\yhzl\ExcelAccess.h(245) : error C2664: “MessageBoxW”: 不能将参数 2 从“const char [55]”转换为“LPCWSTR”rn 与指向的类型无关;转换要求 reinterpret_cast、C 样式转换或函数样式转换rnh:\程序设计\yhzl\yhzl\ExcelAccess.h(251) : error C2664: “void ATL::CStringT::Format(const wchar_t *,...)”: 不能将参数 1 从“const char [74]”转换为“const wchar_t *”rn withrn [rn BaseType=wchar_t,rn StringTraits=StrTraitMFCrn ]rn 与指向的类型无关;转换要求 reinterpret_cast、C 样式转换或函数样式转换rnh:\程序设计\yhzl\yhzl\ExcelAccess.h(253) : error C2664: “void ATL::CStringT::Format(const wchar_t *,...)”: 不能将参数 1 从“const char [75]”转换为“const wchar_t *”rn withrn [rn BaseType=wchar_t,rn StringTraits=StrTraitMFCrn ]rn 与指向的类型无关;转换要求 reinterpret_cast、C 样式转换或函数样式转换rnh:\程序设计\yhzl\yhzl\ExcelAccess.h(256) : error C2678: 二进制“+”: 没有找到接受“const char [17]”类型的左操作数的运算符(或没有可接受的转换)rn C:\Program Files\Microsoft Visual Studio 8\VC\atlmfc\include\atlsimpstr.h(666): 可能是“ATL::CSimpleStringT ATL::CSimpleStringT::operator +(const ATL::CSimpleStringT &,const ATL::CSimpleStringT &)”[通过使用参数相关的查找找到]rn withrn [rn BaseType=TCHARrn ]rn C:\Program Files\Microsoft Visual Studio 8\VC\atlmfc\include\atlsimpstr.h(677): 或“ATL::CSimpleStringT ATL::CSimpleStringT::operator +(const ATL::CSimpleStringT &,const wchar_t *)”[使用参数相关的查找找到]rn withrn [rn BaseType=TCHARrn ]rn .................................rnrn这里只贴了前面的几个,因为后面的都差不多,rnrnrn看了应该都知道是从ansi像unicode转换的问题,但是怎么解决这个问题呢?????请各位大侠指教啊
java编译的时候出现问题
java代码写好之后,开始<em>编译</em>的时候 为什么老是出现这个代码呢?是版本问题吗?我是个新手,所以请大家给个解决的方案,谢过先。我的eCLIPSE是直接解压的,没有经过安装的rnjava.lang.UnsupportedClassVersionError: HelloWorld : Unsupported major.minor version 51.0rn at java.lang.ClassLoader.defineClass1(Native Method)rn at java.lang.ClassLoader.defineClass(Unknown Source)rn at java.security.SecureClassLoader.defineClass(Unknown Source)rn at java.net.URLClassLoader.defineClass(Unknown Source)rn at java.net.URLClassLoader.access$000(Unknown Source)rn at java.net.URLClassLoader$1.run(Unknown Source)rn at java.security.AccessController.doPrivileged(Native Method)rn at java.net.URLClassLoader.findClass(Unknown Source)rn at java.lang.ClassLoader.loadClass(Unknown Source)rn at sun.misc.Launcher$AppClassLoader.loadClass(Unknown Source)rn at java.lang.ClassLoader.loadClass(Unknown Source)rn at java.lang.ClassLoader.loadClassInternal(Unknown Source)rnException in thread "main"
用DEVC++编译出现问题
提示Why in the world are you trying to compile an empty project?rn高手帮帮忙
编译c#的时候出现问题
“/www”应用程序中的服务器错误。rn--------------------------------------------------------------------------------rnrn无法提供此类型的页。 rn说明: 由于已明确禁止所请求的页类型,无法对该类型的页提供服务。扩展名“.cs”可能不正确。 请检查以下的 URL 并确保其拼写正确。 rnrn请求的 URL: /www/1.csrnrnrn--------------------------------------------------------------------------------rn版本信息: Microsoft .NET Framework 版本:1.1.4322.573; ASP.NET 版本:1.1.4322.573
gstreamer插件简介(1)--gstreamer框架
1. 简介         GStreamer是一个开源的多媒体框架库。利用它,可以构建一系列的媒体处理模块,包括从简单的ogg播放功能到复杂的音频(混音)和视频(非线性编辑)的处理。 应用程序可以透明的利用解码和过滤技术。开发者可以使用简洁通用的接口来编写一个简单的插件来添加新的解码器或滤镜。 2. 本文主讲内容         本文主要讲述目前应用在常用的linux桌面系统上的gs
gstreamer学习笔记---如何创建gstreamer插件?
    <em>gstreamer</em>的功能强大是毋庸置疑的,它采用C语言编程,但是通过gObject,将各插件封装成面向对象编程的工具。那么如何创建<em>gstreamer</em>呢,当然,可以自己手动写,但是,<em>gstreamer</em>有提供一个叫make_element的工具,我们为什么不直接使用这个工具帮助我们生成所需要的插件呢。   1.获取创建插件的模板 gst-template     首先要确定你的PC安装了...
GStreamer(二)
GStreamer
GStreamer讲解
对于GStreamer中一些应用程序编写,使用工具,插件编写的入门知识讲解,有兴趣的话,可以查看一下。
Gstreamer 开发手册
方便Gstreamer的使用与开发,Gstreamer具有强大的功能,这是很实用的一个文档。
GStreamer(一)
GStreamer
Gstreamer 显示图片
首先,通过简单的gst-launch命令可以进行picturename图片的播放: gst-launch-0.10 filesrc location=/home/user/picturename.jpg ! jpegdec ! freeze ! autovideosink gst-launch-0.10 filesrc location=/home/user/picturename.png
gstreamer源代码
<em>gstreamer</em>的源代码。下载解压后可以<em>编译</em>运行。
gstreamer manual
<em>gstreamer</em>应用开发手册 GStreamer Application Development Manual (1.6.0) GStreamer is an extremely powerful and versatile framework for creating streaming media applications. Many of the virtues of the GStreamer framework come from its modularity: GStreamer can seamlessly incorporate new plugin modules. But because modularity and power often come at a cost of greater complexity, writing new applications is not always easy.
gstreamer源码包
Linux 下的MP3播放器会用到的解码器,里面包含了许多写播放器用到的解码文件
gstreamer 项目实践
gplayer PLAY <em>gstreamer</em> <em>gstreamer</em> 项目实践 gplayer PLAY <em>gstreamer</em> <em>gstreamer</em> 项目实践
gstreamer on android
<em>gstreamer</em> on android,fluendo 公司开发
gstreamer源码
This is GStreamer Version 0.10.19 on S60 platform. WHAT S60 PLATFORMS GSTREAMER SUPPORTS Currently GStreamer is supported on S60 3.2 and 5.0 SDK's. WHAT GSTREAMER SUPPORTS ON SYMBIAN PLATFORM
pwg gstreamer
<em>gstreamer</em> plugin write guide
Gstreamer手册
《Gstreamer手册》学习GStreamer的书籍。
GStreamer基础教程
1. <em>gstreamer</em>  tutorials网站: https://<em>gstreamer</em>.freedesktop.org/documentation/tutorials/basic/index.html github 地址: https://github.com/Kurento/<em>gstreamer</em>/ 网上翻译的相关文章: http://blog.csdn.net/saku
gstreamer源码分析
gstpad: //pad链接涉及的api linkfunc() =&gt; gst_pad_set_link_function() unlinkfunc() queryfunc() //激活pad时涉及的api activatefunc() activatemodefunc() ...
Phonon::GStreamer::Backend: Failed to initialize GStreamer
遇到这个问题,完整问题如下:rnroot@beagleboard:~# ./qt -qwsrninit device manager under Poweron phasern"Warning: You do not seem to have the base GStreamer plugins installed.rn All audio and video support has been disabled"rnPhonon::GStreamer::Backend: Failed to initialize GStreamerrnrn(:1873): GStreamer-CRITICAL **: gst_object_ref: assertion `object != NULL' failedrnrn(:1873): GStreamer-CRITICAL **: gst_object_sink: assertion `GST_IS_OBJECT (object)' failedrnrn我之前运行这个程序都没有说要用到GStreamer,现在突然说GStreamer没装好,我直接将DVSDK里面的所有libgst* 库开呗过去了也不行。求交流···
gstreamer播放器,playbin2插件使用,适合新来gstreamer
#include int main(int argc,char **argv) {  GstElement *playbin2,*fakesink,*mfw_v4lsink;  GMainLoop *loop;  gst_init(&argc,&argv);  loop=g_main_loop_new(NULL,FALSE);  mfw_v4lsink=gst_elemen
GStreamer开发
GStreamer开发介绍
GStreamer的问题
在<em>编译</em>aldegonde-0.0.1程序的时候出现如下:rnchecking for <em>gstreamer</em>-0.8 >= 0.8.0rn <em>gstreamer</em>-gconf-0.8 >= 0.8.0rn <em>gstreamer</em>-interfaces-0.8 >= 0.8.0... Package <em>gstreamer</em>-0.8 was not found in the pkg-config search path. Perhaps you should add the directory containing `<em>gstreamer</em>-0.8.pc' to the PKG_CONFIG_PATH environment variable No package '<em>gstreamer</em>-0.8' found Package <em>gstreamer</em>-gconf-0.8 was not found in the pkg-config search path. Perhaps you should add the directory containing `<em>gstreamer</em>-gconf-0.8.pc' to the PKG_CONFIG_PATH environment variable No package '<em>gstreamer</em>-gconf-0.8' found Package <em>gstreamer</em>-interfaces-0.8 was not found in the pkg-config search path. Perhaps you should add the directory containing `<em>gstreamer</em>-interfaces-0.8.pc' to the PKG_CONFIG_PATH environment variable No package '<em>gstreamer</em>-interfaces-0.8' foundrnconfigure: error: Library requirements (<em>gstreamer</em>-0.8 >= 0.8.0rn <em>gstreamer</em>-gconf-0.8 >= 0.8.0rn <em>gstreamer</em>-interfaces-0.8 >= 0.8.0) not met; consider adjusting the PKG_CONFIG_PATH environment variable if your libraries are in a nonstandard prefix so pkg-config can find them.rn我已经安装了<em>gstreamer</em>-0.10.19,如何解决这个问题?谢谢!rn
Gstreamer 编译安装
1. Download the latest version of <em>gstreamer</em> available at: http://<em>gstreamer</em>.freedesktop.org/src/ The following are the files you need from version 1.6.0: ●  <em>gstreamer</em>-1.6.0.tar.xz ●  gst-plugins-ba
gstreamer音乐播放器
Linux下基于GTK和<em>gstreamer</em>的音乐播放器
GStreamer框架
GStreamer框架
Gstreamer使用教程(一):Linux下安装和使用Gstreamer
1、Ubuntu安装Gstreamer sudo sudo apt-get install lib<em>gstreamer</em>* 2、使用Git命令下载例子 git clone https://gitlab.freedesktop.org/<em>gstreamer</em>/gst-docs 3、进入到gst-docs/examples/tutorials目录,以basic-tutorial-1.c文件为例<em>编译</em>使用 g...
gstreamer手册
<em>gstreamer</em>手册中文版。文档为pdf。 GStreamer是一个创建流媒体应用程序的框架。其基本设计思想来自于俄勒冈(Oregon)研究生学院有关视频管道的创意, 同时也借鉴了DirectShow的设计思想。
Python核心编程(中文第二版)下载
Python核心编程中文 相关下载链接:[url=//download.csdn.net/download/zhudk1987/3892774?utm_source=bbsseo]//download.csdn.net/download/zhudk1987/3892774?utm_source=bbsseo[/url]
用VC++6.0 MFC 编写的 猫捉老鼠游戏 设适合初学者下载
用VC++6.0 MFC 编写的 猫捉老鼠游戏 里面附有有代码和可执行文件 设适合初学者 相关下载链接:[url=//download.csdn.net/download/lanxiajun/3913898?utm_source=bbsseo]//download.csdn.net/download/lanxiajun/3913898?utm_source=bbsseo[/url]
spring_mvc下载
Spring_mvc实例,源码。实现简单的登录跳转。 相关下载链接:[url=//download.csdn.net/download/sc68414523/5118937?utm_source=bbsseo]//download.csdn.net/download/sc68414523/5118937?utm_source=bbsseo[/url]
相关热词 c#检测非法字符 c#双屏截图 c#中怎么关闭线程 c# 显示服务器上的图片 api嵌入窗口 c# c# 控制网页 c# encrypt c#微信网页版登录 c# login 居中 c# 考试软件
我们是很有底线的