安装Android x86系统后,出现“Missing operating system.....”,求大神帮忙
相关推荐
Android Studio中安装CodeBuddy插件提示Missing JCEF Runtime问题修复工具-bat脚本版
Android Studio中安装CodeBuddy插件提示Missing JCEF Runtime问题修复工具-bat脚本版 完美解决JCEF版本问题,一键修复工具;
android笔记
可能没卸载干净。在安装mysql数据库时,如果重新安装,很容易遇见apply security setting error,即在配置mysql启动服务时,在启动apply security setting时会出错,原因是卸载mysql时并没有完全删除文件,所以有必要手动清除这些,要清除的文件主要: 一、mysql的安装目录,一般为C:\Program Files目录下。 二、mysql的数据存放目录,一般在C:\Documents and Settings\All Users\Application Data目录下(需要注意的时Application Data这个文件夹默认是隐藏的,要通过 工具->文件夹选项->查看->显示所有文件与文件夹 来设置隐藏文件可见)。 三、删除注册表数据,通过regedit,删除以下几个文件: 引用
softap_ap6212a0_tinav2.1_验证通过_旧版本的系统_20170915_1223没有外层目录.7z
旧版本版本的全志R16平台的tinav2.1的系统打开softAP 2017/9/14 17:25 版本:V1.0 1、原始编译: rootroot@cm-System-Product-Name:~$ cd /home/wwt/ rootroot@cm-System-Product-Name:/home/wwt$ tar zxvf tinaV2.1_wyb_20170302_patch_leo_20161102.tar.gz rootroot@cm-System-Product-Name:/home/wwt$ mv tinaV2.1 softap_ap6212a0_tinav2.1 rootroot@cm-System-Product-Name:/home/wwt$ cd softap_ap6212a0_tinav2.1/ rootroot@cm-System-Product-Name:/home/wwt/softap_ap6212a0_tinav2.1$ rootroot@cm-System-Product-Name:/home/wwt/softap_ap6212a0_tinav2.1$ source build/envsetup.sh including target/allwinner/tulip-d1/vendorsetup.sh including target/allwinner/octopus-sch/vendorsetup.sh including target/allwinner/azalea-perf2/vendorsetup.sh including target/allwinner/azalea-perf3/vendorsetup.sh including target/allwinner/octopus-dev/vendorsetup.sh including target/allwinner/astar-evb/vendorsetup.sh including target/allwinner/generic/vendorsetup.sh including target/allwinner/azalea-perf1/vendorsetup.sh including target/allwinner/astar-parrot/vendorsetup.sh including target/allwinner/astar-spk/vendorsetup.sh including target/allwinner/azalea-evb/vendorsetup.sh rootroot@cm-System-Product-Name:/home/wwt/softap_ap6212a0_tinav2.1$ lunch You're building on Linux Lunch menu... pick a combo: 1. tulip_d1-tina 2. tulip_d1-dragonboard 3. octopus_sch-tina 4. octopus_sch-dragonboard 5. azalea_perf2-tina 6. azalea_perf2-dragonboard 7. azalea_perf3-tina 8. azalea_perf3-dragonboard 9. octopus_dev-tina 10. octopus_dev-dragonboard 11. astar_evb-tina 12. azalea_perf1-tina 13. azalea_perf1-dragonboard 14. astar_parrot-tina 15. astar_parrot-dragonboard 16. astar_spk-tina 17. astar_spk-dragonboard 18. azalea_evb-tina 19. azalea_evb-dragonboard Which would you like?14 ============================================ PLATFORM_VERSION_CODENAME=Neptune PLATFORM_VERSION=2.0.0 TARGET_PRODUCT=astar_parrot TARGET_BUILD_VARIANT=tina TARGET_BUILD_TYPE=release TARGET_BUILD_APPS= TARGET_ARCH=arm TARGET_ARCH_VARIANT=armv7-a-neon TARGET_CPU_VARIANT=cortex-a7 TARGET_2ND_ARCH= TARGET_2ND_ARCH_VARIANT= TARGET_2ND_CPU_VARIANT= HOST_ARCH=x86_64 HOST_OS=linux HOST_OS_EXTRA=Linux-3.13.0-24-generic-x86_64-with-Ubuntu-14.04-trusty HOST_BUILD_TYPE=release BUILD_ID=57513AA3 OUT_DIR= ============================================ rootroot@cm-System-Product-Name:/home/wwt/softap_ap6212a0_tinav2.1$ make -j12 rootroot@cm-System-Product-Name:/home/wwt/softap_ap6212a0_tinav2.1$ pack -d 2、 将softap.tar.bz2解压到package/allwinner下。 将dnsmasq.tar.bz2解压并替换package/network/services下的dnsmasq文件夹。 3、配置内核: rootroot@cm-System-Product-Name:/home/wwt/softap_ap6212a0_tinav2.1$ make kernel_menuconfig [*] Networking support ---> --- Networking support Networking options ---> (在第二屏) [ ] Network packet filtering framework (Netfilter) ---> 修改为: [*] Network packet filtering framework (Netfilter) ---> [ ] Advanced netfilter configuration 修改为: [*] Advanced netfilter configuration Core Netfilter Configuration ---> < > Netfilter NFACCT over NFNETLINK interface < > Netfilter NFQUEUE over NFNETLINK interface < > Netfilter LOG over NFNETLINK interface < > Netfilter connection tracking support < > Netfilter Xtables support (required for ip_tables) 修改为: < > Netfilter NFACCT over NFNETLINK interface < > Netfilter NFQUEUE over NFNETLINK interface < > Netfilter LOG over NFNETLINK interface <*> Netfilter connection tracking support [*] Connection mark tracking support [*] Connection tracking security mark support (NEW) (默认选中) [*] Supply CT list in procfs (OBSOLETE) [*] Connection tracking events [*] Connection tracking timeout (NEW) [*] Connection tracking timestamping < > DCCP protocol connection tracking support (EXPERIMENTAL) < > SCTP protocol connection tracking support (EXPERIMENTAL) < > UDP-Lite protocol connection tracking support < > Amanda backup protocol support < > FTP protocol support < > H.323 protocol support < > IRC protocol support < > NetBIOS name service protocol support < > SNMP service protocol support < > PPtP protocol support < > SANE protocol support (EXPERIMENTAL) < > SIP protocol support < > TFTP protocol support <M> Connection tracking netlink interface <M> Connection tracking timeout tuning via Netlink <*> Netfilter Xtables support (required for ip_tables) *** Xtables combined modules *** (有很多项,在下面!) <*> "conntrack" connection tracking match support <*> "state" match support < > IP virtual server support ---> 修改为: <*> IP virtual server support ---> [ ] Netfilter connection tracking (NEW) 修改为(在最后面): [*] Netfilter connection tracking IP: Netfilter Configuration ---> < > IPv4 connection tracking support (required for NAT) 修改为: <*> IPv4 connection tracking support (required for NAT) < > IP tables support (required for filtering/masq/NAT) 修改为: <*> IP tables support (required for filtering/masq/NAT) <*> Packet filtering < > Full NAT 修改为: <*> Full NAT <*> MASQUERADE target support <*> NETMAP target support <*> REDIRECT target support <*> Packet mangling 4、配置系统: rootroot@cm-System-Product-Name:/home/wwt/softap_ap6212a0_tinav2.1$ make menuconfig Base system ---> < > dnsmasq.............................................. DNS and DHCP server 修改为: <*> dnsmasq.............................................. DNS and DHCP server Allwinner ---> < > softap............................................... Tina softap manager (NEW) ---- 修改为: <*> softap............................................... Tina softap manager ---> --- softap............................................... Tina softap manager < > softap-demo......................................... Tina softap app demo (NEW) 修改为: <*> softap-demo......................................... Tina softap app demo Network ---> Firewall ---> < > iptables................................. IP firewall administration tool ---- 修改为: (里面不用选中) <*> iptables................................. IP firewall administration tool ---> Network ---> < > hostapd................................. IEEE 802.1x Authenticator (full) < > hostapd-common............... hostapd/wpa_supplicant common support files < > hostapd-common-old 修改为: <*> hostapd................................. IEEE 802.1x Authenticator (full) -*- hostapd-common............... hostapd/wpa_supplicant common support files < > hostapd-common-old Utilities ---> <*> playdemo................................... music play in 3 kinds of mode 修改为: < > playdemo................................... music play in 3 kinds of mode 5、配置编译加载选项: rootroot@cm-System-Product-Name:/home/wwt/softap_ap6212a0_tinav2.1$ find . -name netfilter.mk ./package/kernel/linux/modules/netfilter.mk ./build/netfilter.mk rootroot@cm-System-Product-Name:/home/wwt/softap_ap6212a0_tinav2.1$ W:\softap_ap6212a0_tinav2.1\build\netfilter.mk $(eval $(call nf_add,IPT_CORE,CONFIG_NETFILTER_XT_TARGET_LOG, $(P_XT)xt_LOG)) $(eval $(call nf_add,IPT_CORE,CONFIG_NETFILTER_XT_TARGET_LOG, $(P_XT)nf_log_common)) $(eval $(call nf_add,IPT_CORE,CONFIG_NETFILTER_XT_TARGET_LOG, $(P_V4)nf_log_ipv4)) $(eval $(call nf_add,IPT_CORE,CONFIG_NETFILTER_XT_TARGET_TCPMSS, $(P_XT)xt_TCPMSS)) $(eval $(call nf_add,IPT_CORE,CONFIG_IP_NF_TARGET_REJECT, $(P_V4)ipt_REJECT)) $(eval $(call nf_add,IPT_CORE,CONFIG_IP_NF_TARGET_REJECT, $(P_V4)nf_reject_ipv4)) $(eval $(call nf_add,IPT_CORE,CONFIG_NETFILTER_XT_MATCH_TIME, $(P_XT)xt_time)) $(eval $(call nf_add,IPT_CORE,CONFIG_NETFILTER_XT_MARK, $(P_XT)xt_mark)) $(eval $(call nf_add,IPT_CORE,CONFIG_NETFILTER_XT_TARGET_LOG, $(P_XT)xt_LOG)) #$(eval $(call nf_add,IPT_CORE,CONFIG_NETFILTER_XT_TARGET_LOG, $(P_XT)nf_log_common)) #$(eval $(call nf_add,IPT_CORE,CONFIG_NETFILTER_XT_TARGET_LOG, $(P_V4)nf_log_ipv4)) $(eval $(call nf_add,IPT_CORE,CONFIG_NETFILTER_XT_TARGET_TCPMSS, $(P_XT)xt_TCPMSS)) $(eval $(call nf_add,IPT_CORE,CONFIG_IP_NF_TARGET_REJECT, $(P_V4)ipt_REJECT)) #$(eval $(call nf_add,IPT_CORE,CONFIG_IP_NF_TARGET_REJECT, $(P_V4)nf_reject_ipv4)) $(eval $(call nf_add,IPT_CORE,CONFIG_NETFILTER_XT_MATCH_TIME, $(P_XT)xt_time)) $(eval $(call nf_add,IPT_CORE,CONFIG_NETFILTER_XT_MARK, $(P_XT)xt_mark)) 不配置这里就会在这里让你选择(选择:N/y都会出错的!) rootroot@cm-System-Product-Name:/home/wwt/softap_ap6212a0_tinav2.1$ make -j12 make -C /home/wwt/softap_ap6212a0_tinav2.1/out/astar-parrot/compile_dir/target/linux-astar-parrot/linux-3.4.39 HOSTCFLAGS="-O2 -I/home/wwt/softap_ap6212a0_tinav2.1/out/host/include -I/home/wwt/softap_ap6212a0_tinav2.1/out/host/usr/include -Wall -Wmissing-prototypes -Wstrict-prototypes" CROSS_COMPILE="arm-openwrt-linux-muslgnueabi-" ARCH="arm" KBUILD_HAVE_NLS=no KBUILD_BUILD_USER="" KBUILD_BUILD_HOST="" CONFIG_SHELL="bash" V='' CC="arm-openwrt-linux-muslgnueabi-gcc" modules make[5]: Entering directory `/home/wwt/softap_ap6212a0_tinav2.1/lichee/linux-3.4' scripts/kconfig/conf --silentoldconfig Kconfig drivers/net/wireless/bcmdhd/Kconfig:57:warning: defaults for choice values not supported .config:3733:warning: override: TREE_PREEMPT_RCU changes choice state * * Restart config... * * * IP: Netfilter Configuration * IPv4 connection tracking support (required for NAT) (NF_CONNTRACK_IPV4) [Y/n/m/?] y proc/sysctl compatibility with old connection tracking (NF_CONNTRACK_PROC_COMPAT) [N/y/?] n IP Userspace queueing via NETLINK (OBSOLETE) (IP_NF_QUEUE) [N/m/y/?] n IP tables support (required for filtering/masq/NAT) (IP_NF_IPTABLES) [Y/n/m/?] y "ah" match support (IP_NF_MATCH_AH) [N/m/y/?] n "ecn" match support (IP_NF_MATCH_ECN) [N/m/y/?] n "rpfilter" reverse path filter match support (IP_NF_MATCH_RPFILTER) [N/m/y/?] n "ttl" match support (IP_NF_MATCH_TTL) [N/m/y/?] n Packet filtering (IP_NF_FILTER) [Y/n/m/?] y REJECT target support (IP_NF_TARGET_REJECT) [M/n/y/?] m Force socket error when rejecting with icmp* (IP_NF_TARGET_REJECT_SKERR) [N/y/?] (NEW) n 出错: sh /home/rediron/r16_tinav2.1/softap_ap6212a0_tinav2.1/out/astar-parrot/compile_dir/target/linux-astar-parrot/strace-4.10/ipkg-sunxi/strace rstrip.sh: /home/rediron/r16_tinav2.1/softap_ap6212a0_tinav2.1/out/astar-parrot/compile_dir/target/linux-astar-parrot/strace-4.10/ipkg-sunxi/strace/usr/bin/strace: executable \$0 \$@"; ) > postinst; ( echo "#!/bin/sh"; echo ". \${IPKG_INSTROOT}/lib/functions.sh"; echo "default_prerm \$0 \$@"; ) > prerm; chmod 0755 postinst prerm; ) install -d -m0755 /home/rediron/r16_tinav2.1/softap_ap6212a0_tinav2.1/out/astar-parrot/packages/base unxi/strace /home/rediron/r16_tinav2.1/softap_ap6212a0_tinav2.1/out/astar-parrot/packages/base av2.1/out/astar-parrot/packages/base/strace_4.10-1_sunxi.ipk rm -rf /home/rediron/r16_tinav2.1/softap_ap6212a0_tinav2.1/out/astar-parrot/staging_dir/target/rootfs/tmp-strace strace install -d -m0755 /home/rediron/r16_tinav2.1/softap_ap6212a0_tinav2.1/out/astar-parrot/staging_dir/target/rootfs/tmp-strace/usr/bin v2.1/out/astar-parrot/staging_dir/target/rootfs/tmp-strace/usr/bin/ me/rediron/r16_tinav2.1/softap_ap6212a0_tinav2.1/out/astar-parrot/staging_dir/target/rootfs/' rm -rf /home/rediron/r16_tinav2.1/softap_ap6212a0_tinav2.1/out/astar-parrot/staging_dir/target/rootfs/tmp-strace touch /home/rediron/r16_tinav2.1/softap_ap6212a0_tinav2.1/out/astar-parrot/staging_dir/target/rootfs/stamp/.strace_installed /rediron/r16_tinav2.1/softap_ap6212a0_tinav2.1/out/astar-parrot/staging_dir/target/pkginfo/strace.default.install make[3]: Leaving directory `/home/rediron/r16_tinav2.1/softap_ap6212a0_tinav2.1/package/devel/strace' make[2]: Leaving directory `/home/rediron/r16_tinav2.1/softap_ap6212a0_tinav2.1' make[1]: *** [/home/rediron/r16_tinav2.1/softap_ap6212a0_tinav2.1/out/astar-parrot/staging_dir/target/stamp/.package_compile] Error 2 make[1]: Leaving directory `/home/rediron/r16_tinav2.1/softap_ap6212a0_tinav2.1' Build failed - please re-run with -j1 to see the real error message make: *** [world] 错误 1 #### make failed to build some targets (36:27 (mm:ss)) #### rootroot@cm-System-Product-Name:/home/rediron/r16_tinav2.1/softap_ap6212a0_tinav2.1$ make -j1 rm -rf /home/rediron/r16_tinav2.1/softap_ap6212a0_tinav2.1/out/astar-parrot/staging_dir/target/rootfs/tmp-ap6212-firmware touch /home/rediron/r16_tinav2.1/softap_ap6212a0_tinav2.1/out/astar-parrot/staging_dir/target/rootfs/stamp/.ap6212-firmware_installed ; echo "ap6212-firmware" >> /home/rediron/r16_tinav2.1/softap_ap6212a0_tinav2.1/out/astar-parrot/staging_dir/target/pkginfo/linux-firmware.default.install make[3]: Leaving directory `/home/rediron/r16_tinav2.1/softap_ap6212a0_tinav2.1/package/firmware/linux-firmware' make[3]: Entering directory `/home/rediron/r16_tinav2.1/softap_ap6212a0_tinav2.1/package/kernel/linux' rm -rf /home/rediron/r16_tinav2.1/softap_ap6212a0_tinav2.1/out/astar-parrot/staging_dir/target/rootfs/tmp-kernel kernel # nothing to do me/rediron/r16_tinav2.1/softap_ap6212a0_tinav2.1/out/astar-parrot/staging_dir/target/rootfs/' rm -rf /home/rediron/r16_tinav2.1/softap_ap6212a0_tinav2.1/out/astar-parrot/staging_dir/target/rootfs/tmp-kernel touch /home/rediron/r16_tinav2.1/softap_ap6212a0_tinav2.1/out/astar-parrot/staging_dir/target/rootfs/stamp/.kernel_installed diron/r16_tinav2.1/softap_ap6212a0_tinav2.1/out/astar-parrot/staging_dir/target/pkginfo/linux.default.install rm -rf /home/rediron/r16_tinav2.1/softap_ap6212a0_tinav2.1/out/astar-parrot/staging_dir/target/rootfs/tmp-kmod-input-core kmod-input-core NOTICE: module '/home/rediron/r16_tinav2.1/softap_ap6212a0_tinav2.1/out/astar-parrot/compile_dir/target/linux-astar-parrot/linux-3.4.39/drivers/input/input-core.ko' is built-in. ONTROL/postinst-pkg; chmod 0755 /home/rediron/r16_tinav2.1/softap_ap6212a0_tinav2.1/out/astar-parrot/staging_dir/target/rootfs/tmp-kmod-input-core/CONTROL/postinst-pkg; fi ore/. /home/rediron/r16_tinav2.1/softap_ap6212a0_tinav2.1/out/astar-parrot/staging_dir/target/rootfs/' rm -rf /home/rediron/r16_tinav2.1/softap_ap6212a0_tinav2.1/out/astar-parrot/staging_dir/target/rootfs/tmp-kmod-input-core touch /home/rediron/r16_tinav2.1/softap_ap6212a0_tinav2.1/out/astar-parrot/staging_dir/target/rootfs/stamp/.kmod-input-core_installed /home/rediron/r16_tinav2.1/softap_ap6212a0_tinav2.1/out/astar-parrot/staging_dir/target/pkginfo/linux.default.install unxi/kmod-ipt-core/CONTROL /home/rediron/r16_tinav2.1/softap_ap6212a0_tinav2.1/out/astar-parrot/staging_dir/target/pkginfo ERROR: module '/home/rediron/r16_tinav2.1/softap_ap6212a0_tinav2.1/out/astar-parrot/compile_dir/target/linux-astar-parrot/linux-3.4.39/net/netfilter/nf_log_common.ko' is missing. make[3]: *** [/home/rediron/r16_tinav2.1/softap_ap6212a0_tinav2.1/out/astar-parrot/packages/kernel/kmod-ipt-core_3.4.39-1_sunxi.ipk] Error 1 make[3]: Leaving directory `/home/rediron/r16_tinav2.1/softap_ap6212a0_tinav2.1/package/kernel/linux' make[2]: *** [package/kernel/linux/compile] Error 2 make[2]: Leaving directory `/home/rediron/r16_tinav2.1/softap_ap6212a0_tinav2.1' make[1]: *** [/home/rediron/r16_tinav2.1/softap_ap6212a0_tinav2.1/out/astar-parrot/staging_dir/target/stamp/.package_compile] Error 2 make[1]: Leaving directory `/home/rediron/r16_tinav2.1/softap_ap6212a0_tinav2.1' make: *** [world] 错误 2 #### make failed to build some targets (16 seconds) #### rootroot@cm-System-Product-Name:/home/rediron/r16_tinav2.1/softap_ap6212a0_tinav2.1$ grep nf_log_common . -R grep: ./out/astar-parrot/compile_dir/target/linux-astar-parrot/linux-3.4.39/.git/svn: 没有那个文件或目录 grep: ./out/astar-parrot/compile_dir/host/u-boot-2014.10/arch/sandbox/include/asm/arch: 没有那个文件或目录 grep: ./build/.git/svn: 没有那个文件或目录 ./build/netfilter.mk:$(eval $(call nf_add,IPT_CORE,CONFIG_NETFILTER_XT_TARGET_LOG, $(P_XT)nf_log_common)) grep: ./package/.git/svn: 没有那个文件或目录 grep: ./target/.git/svn: 没有那个文件或目录 grep: ./.repo/manifests/.git/svn: 没有那个文件或目录 grep: ./tools/.git/svn: 没有那个文件或目录 grep: ./tools/.git/packed-refs: 没有那个文件或目录 grep: ./config/.git/svn: 没有那个文件或目录 grep: ./lichee/linux-3.4/.git/svn: 没有那个文件或目录 grep: ./lichee/brandy/.git/svn: 没有那个文件或目录 grep: ./scripts/.git/svn: 没有那个文件或目录 grep: ./dl/.git/svn: 没有那个文件或目录 grep: ./docs/.git/svn: 没有那个文件或目录 grep: ./prebuilt/.git/svn: 没有那个文件或目录 grep: ./prebuilt/gcc/linux-x86/aarch64/toolchain-sunxi/toolchain/aarch64-openwrt-linux/lib/lib: 符号连接的层数过多 grep: 警告: ./prebuilt/gcc/linux-x86/aarch64/toolchain-sunxi/toolchain/aarch64-openwrt-linux/lib/lib64: 嵌套目录循环 grep: ./prebuilt/gcc/linux-x86/aarch64/toolchain-sunxi/toolchain/aarch64-openwrt-linux/lib64/lib: 符号连接的层数过多 grep: 警告: ./prebuilt/gcc/linux-x86/aarch64/toolchain-sunxi/toolchain/aarch64-openwrt-linux/lib64/lib64: 嵌套目录循环 grep: ./prebuilt/gcc/linux-x86/aarch64/toolchain-sunxi/toolchain/aarch64-openwrt-linux-musl/lib/lib: 符号连接的层数过多 grep: 警告: ./prebuilt/gcc/linux-x86/aarch64/toolchain-sunxi/toolchain/aarch64-openwrt-linux-musl/lib/lib64: 嵌套目录循环 grep: ./prebuilt/gcc/linux-x86/aarch64/toolchain-sunxi/toolchain/aarch64-openwrt-linux-musl/lib64/lib: 符号连接的层数过多 grep: 警告: ./prebuilt/gcc/linux-x86/aarch64/toolchain-sunxi/toolchain/aarch64-openwrt-linux-musl/lib64/lib64: 嵌套目录循环 grep: ./prebuilt/gcc/linux-x86/aarch64/toolchain-sunxi/toolchain/lib/lib: 符号连接的层数过多 grep: 警告: ./prebuilt/gcc/linux-x86/aarch64/toolchain-sunxi/toolchain/lib/lib64: 嵌套目录循环 grep: ./prebuilt/gcc/linux-x86/aarch64/toolchain-sunxi/toolchain/lib64/lib: 符号连接的层数过多 grep: 警告: ./prebuilt/gcc/linux-x86/aarch64/toolchain-sunxi/toolchain/lib64/lib64: 嵌套目录循环 grep: ./prebuilt/gcc/linux-x86/aarch64/toolchain-sunxi/toolchain/lib32/lib: 符号连接的层数过多 grep: 警告: ./prebuilt/gcc/linux-x86/aarch64/toolchain-sunxi/toolchain/lib32/lib64: 嵌套目录循环 grep: ./prebuilt/gcc/linux-x86/arm/toolchain-sunxi/toolchain/arm-openwrt-linux-muslgnueabi/lib/lib: 符号连接的层数过多 grep: ./prebuilt/gcc/linux-x86/arm/toolchain-sunxi/toolchain/lib/lib: 符号连接的层数过多 grep: ./prebuilt/gcc/linux-x86/arm/toolchain-sunxi/toolchain/lib64/lib: 符号连接的层数过多 grep: ./prebuilt/gcc/linux-x86/arm/toolchain-sunxi/toolchain/lib32/lib: 符号连接的层数过多 grep: ./prebuilt/gcc/linux-x86/arm/toolchain-sunxi/toolchain/arm-openwrt-linux/lib/lib: 符号连接的层数过多 grep: ./toolchain/.git/svn: 没有那个文件或目录 rootroot@cm-System-Product-Name:/home/rediron/r16_tinav2.1/softap_ap6212a0_tinav2.1$ rootroot@cm-System-Product-Name:/home/rediron/r16_tinav2.1/softap_ap6212a0_tinav2.1$ rootroot@cm-System-Product-Name:/home/rediron/r16_tinav2.1/softap_ap6212a0_tinav2.1$ make -j12 还会出现的错误: rm -rf /home/wwt/softap_ap6212a0_tinav2.1/out/astar-parrot/staging_dir/target/rootfs/tmp-hostapd-common mkdir -p /home/wwt/softap_ap6212a0_tinav2.1/out/astar-parrot/staging_dir/target/rootfs/stamp /home/wwt/softap_ap6212a0_tinav2.1/out/astar-parrot/staging_dir/target/rootfs/tmp-hostapd-common install -d -m0755 /home/wwt/softap_ap6212a0_tinav2.1/out/astar-parrot/staging_dir/target/rootfs/tmp-hostapd-common/lib/netifd install -m0644 ./files/netifd.sh /home/wwt/softap_ap6212a0_tinav2.1/out/astar-parrot/staging_dir/target/rootfs/tmp-hostapd-common/lib/netifd/hostapd.sh SHELL= flock /home/wwt/softap_ap6212a0_tinav2.1/tmp/.root-copy.flock -c 'cp -fpR /home/wwt/softap_ap6212a0_tinav2.1/out/astar-parrot/staging_dir/target/rootfs/tmp-hostapd-common/. /home/wwt/softap_ap6212a0_tinav2.1/out/astar-parrot/staging_dir/target/rootfs/' rm -rf /home/wwt/softap_ap6212a0_tinav2.1/out/astar-parrot/staging_dir/target/rootfs/tmp-hostapd-common touch /home/wwt/softap_ap6212a0_tinav2.1/out/astar-parrot/staging_dir/target/rootfs/stamp/.hostapd-common_installed if [ -f /home/wwt/softap_ap6212a0_tinav2.1/out/astar-parrot/staging_dir/target/pkginfo/hostapd.supplicant-full.install.clean ]; then rm -f /home/wwt/softap_ap6212a0_tinav2.1/out/astar-parrot/staging_dir/target/pkginfo/hostapd.supplicant-full.install /home/wwt/softap_ap6212a0_tinav2.1/out/astar-parrot/staging_dir/target/pkginfo/hostapd.supplicant-full.install.clean; fi; echo "hostapd-common" >> /home/wwt/softap_ap6212a0_tinav2.1/out/astar-parrot/staging_dir/target/pkginfo/hostapd.supplicant-full.install make[3]: Leaving directory `/home/wwt/softap_ap6212a0_tinav2.1/package/network/services/hostapd' make[2]: Leaving directory `/home/wwt/softap_ap6212a0_tinav2.1' make[1]: *** [/home/wwt/softap_ap6212a0_tinav2.1/out/astar-parrot/staging_dir/target/stamp/.package_compile] Error 2 make[1]: Leaving directory `/home/wwt/softap_ap6212a0_tinav2.1' Build failed - please re-run with -j1 to see the real error message make: *** [world] 错误 1 #### make failed to build some targets (01:19 (mm:ss)) #### rootroot@cm-System-Product-Name:/home/wwt/softap_ap6212a0_tinav2.1$ rootroot@cm-System-Product-Name:/home/wwt/softap_ap6212a0_tinav2.1$ rootroot@cm-System-Product-Name:/home/wwt/softap_ap6212a0_tinav2.1$ rootroot@cm-System-Product-Name:/home/wwt/softap_ap6212a0_tinav2.1$ make -j1 or -D_FORTIFY_SOURCE=1 -Wl,-z,now -Wl,-z,relro -I/home/wwt/softap_ap6212a0_tinav2.1/out/astar-parrot/compile_dir/target/softap-0.0.1/ipkg-install/usr/include -L/home/wwt/softap_ap6212a0_tinav2.1/out/astar-parrot/staging_dir/target/usr/lib -L/home/wwt/softap_ap6212a0_tinav2.1/out/astar-parrot/staging_dir/target/lib -L/home/wwt/softap_ap6212a0_tinav2.1/prebuilt/gcc/linux-x86/arm/toolchain-sunxi/toolchain/usr/lib -L/home/wwt/softap_ap6212a0_tinav2.1/prebuilt/gcc/linux-x86/arm/toolchain-sunxi/toolchain/lib -znow -zrelro -L/home/wwt/softap_ap6212a0_tinav2.1/out/astar-parrot/compile_dir/target/softap-0.0.1/ipkg-install/usr/lib -lsoftap -lssl /home/wwt/softap_ap6212a0_tinav2.1/out/astar-parrot/staging_dir/target/usr/lib/libssl.so: undefined reference to `ECDSA_sign' /home/wwt/softap_ap6212a0_tinav2.1/out/astar-parrot/staging_dir/target/usr/lib/libssl.so: undefined reference to `EC_POINT_copy' /home/wwt/softap_ap6212a0_tinav2.1/out/astar-parrot/staging_dir/target/usr/lib/libssl.so: undefined reference to `EC_KEY_set_public_key' /home/wwt/softap_ap6212a0_tinav2.1/out/astar-parrot/staging_dir/target/usr/lib/libssl.so: undefined reference to `EC_GROUP_free' /home/wwt/softap_ap6212a0_tinav2.1/out/astar-parrot/staging_dir/target/usr/lib/libssl.so: undefined reference to `EC_KEY_get0_public_key' /home/wwt/softap_ap6212a0_tinav2.1/out/astar-parrot/staging_dir/target/usr/lib/libssl.so: undefined reference to `EC_KEY_get0_private_key' /home/wwt/softap_ap6212a0_tinav2.1/out/astar-parrot/staging_dir/target/usr/lib/libssl.so: undefined reference to `EC_POINT_oct2point' /home/wwt/softap_ap6212a0_tinav2.1/out/astar-parrot/staging_dir/target/usr/lib/libssl.so: undefined reference to `EC_KEY_up_ref' /home/wwt/softap_ap6212a0_tinav2.1/out/astar-parrot/staging_dir/target/usr/lib/libssl.so: undefined reference to `EC_curve_nist2nid' /home/wwt/softap_ap6212a0_tinav2.1/out/astar-parrot/staging_dir/target/usr/lib/libssl.so: undefined reference to `EC_KEY_generate_key' /home/wwt/softap_ap6212a0_tinav2.1/out/astar-parrot/staging_dir/target/usr/lib/libssl.so: undefined reference to `EC_KEY_set_private_key' /home/wwt/softap_ap6212a0_tinav2.1/out/astar-parrot/staging_dir/target/usr/lib/libssl.so: undefined reference to `EC_GROUP_new_by_curve_name' /home/wwt/softap_ap6212a0_tinav2.1/out/astar-parrot/staging_dir/target/usr/lib/libssl.so: undefined reference to `EC_KEY_get0_group' /home/wwt/softap_ap6212a0_tinav2.1/out/astar-parrot/staging_dir/target/usr/lib/libssl.so: undefined reference to `EC_GROUP_method_of' /home/wwt/softap_ap6212a0_tinav2.1/out/astar-parrot/staging_dir/target/usr/lib/libssl.so: undefined reference to `EC_METHOD_get_field_type' /home/wwt/softap_ap6212a0_tinav2.1/out/astar-parrot/staging_dir/target/usr/lib/libssl.so: undefined reference to `EC_POINT_point2oct' /home/wwt/softap_ap6212a0_tinav2.1/out/astar-parrot/staging_dir/target/usr/lib/libssl.so: undefined reference to `EC_GROUP_get_curve_name' /home/wwt/softap_ap6212a0_tinav2.1/out/astar-parrot/staging_dir/target/usr/lib/libssl.so: undefined reference to `EC_KEY_get_conv_form' /home/wwt/softap_ap6212a0_tinav2.1/out/astar-parrot/staging_dir/target/usr/lib/libssl.so: undefined reference to `EC_KEY_free' /home/wwt/softap_ap6212a0_tinav2.1/out/astar-parrot/staging_dir/target/usr/lib/libssl.so: undefined reference to `EC_KEY_new' /home/wwt/softap_ap6212a0_tinav2.1/out/astar-parrot/staging_dir/target/usr/lib/libssl.so: undefined reference to `EC_GROUP_get_degree' /home/wwt/softap_ap6212a0_tinav2.1/out/astar-parrot/staging_dir/target/usr/lib/libssl.so: undefined reference to `EC_KEY_set_group' /home/wwt/softap_ap6212a0_tinav2.1/out/astar-parrot/staging_dir/target/usr/lib/libssl.so: undefined reference to `ECDSA_verify' /home/wwt/softap_ap6212a0_tinav2.1/out/astar-parrot/staging_dir/target/usr/lib/libssl.so: undefined reference to `EVP_PKEY_set1_EC_KEY' /home/wwt/softap_ap6212a0_tinav2.1/out/astar-parrot/staging_dir/target/usr/lib/libssl.so: undefined reference to `EC_POINT_free' /home/wwt/softap_ap6212a0_tinav2.1/out/astar-parrot/staging_dir/target/usr/lib/libssl.so: undefined reference to `EC_POINT_new' /home/wwt/softap_ap6212a0_tinav2.1/out/astar-parrot/staging_dir/target/usr/lib/libssl.so: undefined reference to `ECDH_compute_key' /home/wwt/softap_ap6212a0_tinav2.1/out/astar-parrot/staging_dir/target/usr/lib/libssl.so: undefined reference to `EC_KEY_dup' /home/wwt/softap_ap6212a0_tinav2.1/out/astar-parrot/staging_dir/target/usr/lib/libssl.so: undefined reference to `EC_KEY_new_by_curve_name' collect2: error: ld returned 1 exit status make[4]: *** [softap_test] Error 1 make[4]: Leaving directory `/home/wwt/softap_ap6212a0_tinav2.1/out/astar-parrot/compile_dir/target/softap-0.0.1/demo' make[3]: *** [/home/wwt/softap_ap6212a0_tinav2.1/out/astar-parrot/compile_dir/target/softap-0.0.1/.built] Error 2 make[3]: Leaving directory `/home/wwt/softap_ap6212a0_tinav2.1/package/allwinner/softap' make[2]: *** [package/allwinner/softap/compile] Error 2 make[2]: Leaving directory `/home/wwt/softap_ap6212a0_tinav2.1' make[1]: *** [/home/wwt/softap_ap6212a0_tinav2.1/out/astar-parrot/staging_dir/target/stamp/.package_compile] Error 2 make[1]: Leaving directory `/home/wwt/softap_ap6212a0_tinav2.1' make: *** [world] 错误 2 #### make failed to build some targets (17 seconds) #### rootroot@cm-System-Product-Name:/home/wwt/softap_ap6212a0_tinav2.1$ rootroot@cm-System-Product-Name:/home/wwt/softap_ap6212a0_tinav2.1$ rootroot@cm-System-Product-Name:/home/wwt/softap_ap6212a0_tinav2.1$ find . -name libssl.so ./package/allwinner/liballwinner/LIBRARY/EXTERNAL/lib32/linuxgnueabi/libssl.so ./package/allwinner/liballwinner/LIBRARY/EXTERNAL/lib32/lgnueabihf/libssl.so ./package/allwinner/liballwinner/LIBRARY/EXTERNAL/lib32/uclgnueabi/libssl.so ./package/allwinner/liballwinner/LIBRARY/EXTERNAL/lib32/lgnueabi/libssl.so ./package/allwinner/liballwinner/LIBRARY/EXTERNAL/lib32/muslgnueabi/libssl.so ./out/astar-parrot/compile_dir/target/liballwinner/LIBRARY/install/external/libssl.so ./out/astar-parrot/compile_dir/target/liballwinner/LIBRARY/install/lib/libssl.so ./out/astar-parrot/compile_dir/target/liballwinner/LIBRARY/EXTERNAL/lib32/linuxgnueabi/libssl.so ./out/astar-parrot/compile_dir/target/liballwinner/LIBRARY/EXTERNAL/lib32/lgnueabihf/libssl.so ./out/astar-parrot/compile_dir/target/liballwinner/LIBRARY/EXTERNAL/lib32/uclgnueabi/libssl.so ./out/astar-parrot/compile_dir/target/liballwinner/LIBRARY/EXTERNAL/lib32/lgnueabi/libssl.so ./out/astar-parrot/compile_dir/target/liballwinner/LIBRARY/EXTERNAL/lib32/muslgnueabi/libssl.so ./out/astar-parrot/compile_dir/target/liballwinner/ipkg-install/usr/lib/libssl.so ./out/astar-parrot/compile_dir/target/openssl-1.0.2h/libssl.so ./out/astar-parrot/compile_dir/target/openssl-1.0.2h/ipkg-install/usr/lib/libssl.so ./out/astar-parrot/staging_dir/target/usr/lib/libssl.so rootroot@cm-System-Product-Name:/home/wwt/softap_ap6212a0_tinav2.1$ 根据经验可以知道全志R16平台的tinav2.1系统的SDK里面自带的库:libssl有问题。(直接删除或者改名) ./package/allwinner/liballwinner/LIBRARY/EXTERNAL/lib32/muslgnueabi/libssl.so rootroot@cm-System-Product-Name:/home/wwt/softap_ap6212a0_tinav2.1$ rootroot@cm-System-Product-Name:/home/wwt/softap_ap6212a0_tinav2.1$ rootroot@cm-System-Product-Name:/home/wwt/softap_ap6212a0_tinav2.1$ cd package/allwinner/liballwinner/LIBRARY/EXTERNAL/lib32/muslgnueabi/ rootroot@cm-System-Product-Name:/home/wwt/softap_ap6212a0_tinav2.1/package/allwinner/liballwinner/LIBRARY/EXTERNAL/lib32/muslgnueabi$ ll 总用量 5688 drwxrwxr-x 3 rootroot rootroot 4096 11月 2 2016 ./ drwxrwxr-x 7 rootroot rootroot 4096 11月 2 2016 ../ -rwxrwxr-x 1 rootroot rootroot 135064 11月 2 2016 libaw_aacdec.so* -rwxrwxr-x 1 rootroot rootroot 33844 11月 2 2016 libaw_alacdec.so* -rwxrwxr-x 1 rootroot rootroot 170664 11月 2 2016 libaw_amrdec.so* -rwxrwxr-x 1 rootroot rootroot 76748 11月 2 2016 libaw_apedec.so* -rwxrwxr-x 1 rootroot rootroot 116336 11月 2 2016 libaw_atrcdec.so* -rwxrwxr-x 1 rootroot rootroot 69756 11月 2 2016 libaw_cookdec.so* -rwxrwxr-x 1 rootroot rootroot 55152 11月 2 2016 libaw_flacdec.so* -rwxrwxr-x 1 rootroot rootroot 77500 11月 2 2016 libaw_mp3dec.so* -rwxrwxr-x 1 rootroot rootroot 130672 11月 2 2016 libaw_oggdec.so* -rwxrwxr-x 1 rootroot rootroot 8100 11月 2 2016 libaw_plugin.so* -rwxrwxr-x 1 rootroot rootroot 59284 11月 2 2016 libaw_radec.so* -rwxrwxr-x 1 rootroot rootroot 68296 11月 2 2016 libaw_siprdec.so* -rwxrwxr-x 1 rootroot rootroot 70072 11月 2 2016 libaw_wavdec.so* -rwxrwxr-x 1 rootroot rootroot 87996 11月 2 2016 libcdc_adecoder_debug.so* -rwxrwxr-x 1 rootroot rootroot 35652 11月 2 2016 libcdc_adecoder.so* -rwxrwxr-x 1 rootroot rootroot 166808 11月 2 2016 libcdc_aencoder.so* -rwxrwxr-x 1 rootroot rootroot 1500820 11月 2 2016 libcrypto.so* drwxrwxr-x 2 rootroot rootroot 4096 11月 2 2016 lib_debug/ -rwxrwxr-x 1 rootroot rootroot 1179664 11月 2 2016 liblive555.so* -rwxrwxr-x 1 rootroot rootroot 14464 11月 2 2016 libpostprocess.so* -rwxrwxr-x 1 rootroot rootroot 4672 11月 2 2016 librw_data_api.so* -rwxrwxr-x 1 rootroot rootroot 341764 11月 2 2016 libssl.so* -rwxrwxr-x 1 rootroot rootroot 1282208 11月 2 2016 libxml2.so* -rwxrwxr-x 1 rootroot rootroot 80792 11月 2 2016 libz.so* rootroot@cm-System-Product-Name:/home/wwt/softap_ap6212a0_tinav2.1/package/allwinner/liballwinner/LIBRARY/EXTERNAL/lib32/muslgnueabi$ mv libssl.so libssl.so_bak rootroot@cm-System-Product-Name:/home/wwt/softap_ap6212a0_tinav2.1/package/allwinner/liballwinner/LIBRARY/EXTERNAL/lib32/muslgnueabi$ rootroot@cm-System-Product-Name:/home/wwt/softap_ap6212a0_tinav2.1/package/allwinner/liballwinner/LIBRARY/EXTERNAL/lib32/muslgnueabi$ rootroot@cm-System-Product-Name:/home/wwt/softap_ap6212a0_tinav2.1/package/allwinner/liballwinner/LIBRARY/EXTERNAL/lib32/muslgnueabi$ cd - /home/wwt/softap_ap6212a0_tinav2.1 rootroot@cm-System-Product-Name:/home/wwt/softap_ap6212a0_tinav2.1$ rootroot@cm-System-Product-Name:/home/wwt/softap_ap6212a0_tinav2.1$ make -j1 rootroot@cm-System-Product-Name:/home/wwt/softap_ap6212a0_tinav2.1$ pack -d 6、刷机之后,在串口终端中通过softap_test打开softap出错(查明是全志给的patch的路径的问题!) [ 16.536954] dhd_prot_ioctl : bus is down. we have nothing to do [ 16.543761] bcmsdh_oob_intr_unregister: Enter [ 16.548794] bcmsdh_oob_intr_unregister: irq is not registered [ 16.555292] dhd_txglom_enable: enable 0 [ 16.559734] dhd_bus_devreset: WLAN OFF DONE [ 16.564616] wifi_platform_set_power = 0 [ 16.568970] ======== PULL WL_REG_ON LOW! ======== [ 16.574416] [wifi_pm]: wifi power off [ 16.578581] dhdsdio_probe : the lock is released. [ 16.584007] dhd_module_init: Exit err=0 [ 16.591551] xt_time: kernel timezone is -0000 [ 17.648758] [mmc]: sdc2 set ios: clk 50000000Hz bm PP pm ON vdd 3.3V width 8 timing UHS-DDR50 dt B [ 17.662302] [mmc]: sdc2 set ios: clk 50000000Hz bm PP pm ON vdd 3.3V width 8 timing UHS-DDR50 dt B [ 17.678544] [mmc]: sdc2 set ios: clk 50000000Hz bm PP pm ON vdd 3.3V width 8 timing UHS-DDR50 dt B [ 17.850121] android_usb: already disabled [ 17.890241] adb_open [ 17.892807] adb_bind_config [ 17.896040] ep_matches, wrn: endpoint already claimed, ep(0xc068721c, 0xd7a980c0, ep1in-bulk) [ 19.785448] android_usb gadget: high-speed config #1: android BusyBox v1.24.1 () built-in shell (ash) _____ _ __ _ |_ _||_| ___ _ _ | | |_| ___ _ _ _ _ | | _ | || | | |__ | || || | ||_'_| | | | || | || _ | |_____||_||_|_||___||_,_| |_| |_||_|_||_|_| Tina is Based on OpenWrt! ---------------------------------------------- Tina Linux (Neptune, 57513AA3) ---------------------------------------------- root@TinaLinux:/# root@TinaLinux:/# root@TinaLinux:/# so softap_down softap_test softap_up sort root@TinaLinux:/# so softap_down softap_test softap_up sort root@TinaLinux:/# cd /bin/ root@TinaLinux:/bin# ll so* -rwxr-xr-x 1 root root 4095 Sep 14 19:08 softap_down -rwxr-xr-x 1 root root 4095 Sep 14 19:08 softap_test -rwxr-xr-x 1 root root 8191 Sep 14 19:08 softap_up root@TinaLinux:/bin# root@TinaLinux:/bin# root@TinaLinux:/bin# softap_test *************************** Start hostapd test! *************************** Start to reload firmware! Enter: wifi_get_fw_path function, fw_type=1,Eneter: wifi_change_fw_path, fwpath = lib/firmware/fw_bcm43438a0_apsta.bin. Softap fwReload - OkMessage is: OK Reload firmware finished! Start to set softap! Message is: OK Set softap finished! [ 75.613141] dhd_open: Enter d720d000 [ 75.617247] [ 75.617249] Dongle Host Driver, version 1.201.59.3 (r506368) [ 75.617254] Compiled in drivers/net/wireless/bcmdhd on Sep 14 2017 at 11:02:29 [ 75.633597] wl_android_wifi_on in 1 [ 75.637659] wl_android_wifi_on in 2: g_wifi_on=0 [ 75.642896] wifi_platform_set_power = 1 [ 75.647247] ======== PULL WL_REG_ON HIGH! ======== [ 75.652765] [wifi_pm]: wifi power on [ 75.960028] sdio_reset_comm(): [ 75.963526] [mmc]: sdc1 set ios: clk 50000000Hz bm PP pm ON vdd 3.3V width 4 timing SD-HS(SDR25) dt B [ 75.976104] [mmc]: sdc1 set ios: clk 50000000Hz bm PP pm ON vdd 3.3V width 4 timing SD-HS(SDR25) dt B [ 75.987627] [mmc]: sdc1 set ios: clk 150000Hz bm PP pm ON vdd 3.3V width 4 timing LEGACY(SDR12) dt B [ 75.998550] [mmc]: sdc1 set ios: clk 150000Hz bm PP pm ON vdd 3.3V width 4 timing LEGACY(SDR12) dt B [ 76.020809] mmc1: queuing unknown CIS tuple 0x80 (2 bytes) [ 76.028967] mmc1: queuing unknown CIS tuple 0x80 (3 bytes) [ 76.037137] mmc1: queuing unknown CIS tuple 0x80 (3 bytes) [ 76.047072] mmc1: queuing unknown CIS tuple 0x80 (7 bytes) [ 76.165734] [mmc]: sdc1 set ios: clk 150000Hz bm PP pm ON vdd 3.3V width 4 timing SD-HS(SDR25) dt B [ 76.176190] [mmc]: sdc1 set ios: clk 50000000Hz bm PP pm ON vdd 3.3V width 4 timing SD-HS(SDR25) dt B [ 76.186815] [mmc]: sdc1 set ios: clk 50000000Hz bm PP pm ON vdd 3.3V width 4 timing SD-HS(SDR25) dt B [ 76.197594] [ 76.197597] [ 76.197599] dhd_bus_devreset: == WLAN ON == [ 76.206013] F1 signature read @0x18000000=0x1540a9a6 [ 76.213284] F1 signature OK, socitype:0x1 chip:0xa9a6 rev:0x0 pkg:0x4 [ 76.221292] DHD: dongle ram size is set to 524288(orig 524288) at 0x0 [ 76.228727] dhdsdio_probe_init: set use_rxchain 1 from config.txt [ 76.235753] dhd_conf_read_config: Ignore config file /lib/firmware/config.txt [ 76.243796] dhd_conf_set_fw_name_by_chip: firmware_path=lib/firmware/fw_bcm43438a0_apsta.bin [ 76.253368] Final fw_path=lib/firmware/fw_bcm43438a0_apsta.bin [ 76.260041] Final nv_path=/lib/firmware/nvram.txt [ 76.265358] Final conf_path=/lib/firmware/config.txt [ 76.271554] dhdsdio_download_code_file: Open firmware file failed lib/firmware/fw_bcm43438a0_apsta.bin [ 76.282093] _dhdsdio_download_firmware: dongle image file download failed [ 76.289838] dhd_net_bus_devreset: dhd_bus_devreset: -35 [ 76.295753] dhd_prot_ioctl : bus is down. we have nothing to do [ 76.302529] dhd_net_bus_devreset: dhd_bus_devreset: -35 [ 76.308454] wifi_platform_set_power = 0 [ 76.312912] ======== PULL WL_REG_ON LOW! ======== [ 76.318233] [wifi_pm]: wifi power off [ 76.322408] wl_android_wifi_on: Failed [ 76.326758] dhd_open : wl_android_wifi_on failed (-35) [ 76.332573] dhd_stop: Enter d720d000 [ 76.336637] wl_android_wifi_off in 1 [ 76.340800] wl_android_wifi_off in 2: g_wifi_on=0 [ 76.346115] wl_android_wifi_off out [ 76.350093] dhd_stop: Exit [ 76.353290] dhd_open: Exit ret=-1 ifconfig: SIOCSIFFLAGS: Operation not permitted Start to start softap! Configuration file: /etc/wifi/ho[ 80.454347] dhd_open: Enter d720d000 stapd.conf [ 80.458611] [ 80.458613] Dongle Host Driver, version 1.201.59.3 (r506368) [ 80.458618] Compiled in drivers/net/wireless/bcmdhd on Sep 14 2017 at 11:02:29 [ 80.476003] wl_android_wifi_on in 1 [ 80.479971] wl_android_wifi_on in 2: g_wifi_on=0 [ 80.485214] wifi_platform_set_power = 1 [ 80.489657] ======== PULL WL_REG_ON HIGH! ======== [ 80.495082] [wifi_pm]: wifi power on SoftAP started successfullyMessage is: OK Start softap finished! [ 80.800038] sdio_reset_comm(): [ 80.803641] [mmc]: sdc1 set ios: clk 50000000Hz bm PP pm ON vdd 3.3V width 4 timing SD-HS(SDR25) dt B [ 80.816148] [mmc]: sdc1 set ios: clk 50000000Hz bm PP pm ON vdd 3.3V width 4 timing SD-HS(SDR25) dt B [ 80.827683] [mmc]: sdc1 set ios: clk 150000Hz bm PP pm ON vdd 3.3V width 4 timing LEGACY(SDR12) dt B [ 80.838604] [mmc]: sdc1 set ios: clk 150000Hz bm PP pm ON vdd 3.3V width 4 timing LEGACY(SDR12) dt B [ 80.860859] mmc1: queuing unknown CIS tuple 0x80 (2 bytes) [ 80.869016] mmc1: queuing unknown CIS tuple 0x80 (3 bytes) [ 80.877280] mmc1: queuing unknown CIS tuple 0x80 (3 bytes) [ 80.887030] mmc1: queuing unknown CIS tuple 0x80 (7 bytes) [ 81.005831] [mmc]: sdc1 set ios: clk 150000Hz bm PP pm ON vdd 3.3V width 4 timing SD-HS(SDR25) dt B [ 81.016222] [mmc]: sdc1 set ios: clk 50000000Hz bm PP pm ON vdd 3.3V width 4 timing SD-HS(SDR25) dt B [ 81.026711] [mmc]: sdc1 set ios: clk 50000000Hz bm PP pm ON vdd 3.3V width 4 timing SD-HS(SDR25) dt B [ 81.037496] [ 81.037499] [ 81.037502] dhd_bus_devreset: == WLAN ON == [ 81.045875] F1 signature read @0x18000000=0x1540a9a6 [ 81.053157] F1 signature OK, socitype:0x1 chip:0xa9a6 rev:0x0 pkg:0x4 [ 81.061161] DHD: dongle ram size is set to 524288(orig 524288) at 0x0 [ 81.068590] dhdsdio_probe_init: set use_rxchain 1 from config.txt [ 81.075623] dhd_conf_read_config: Ignore config file /lib/firmware/config.txt [ 81.083760] dhd_conf_set_fw_name_by_chip: firmware_path=lib/firmware/fw_bcm43438a0_apsta.bin [ 81.093240] Final fw_path=lib/firmware/fw_bcm43438a0_apsta.bin [ 81.099901] Final nv_path=/lib/firmware/nvram.txt [ 81.105228] Final conf_path=/lib/firmware/config.txt [ 81.111473] dhdsdio_download_code_file: Open firmware file failed lib/firmware/fw_bcm43438a0_apsta.bin [ 81.122017] _dhdsdio_download_firmware: dongle image file download failed [ 81.129672] dhd_net_bus_devreset: dhd_bus_devreset: -35 [ 81.135676] dhd_prot_ioctl : bus is down. we have nothing to do [ 81.142356] dhd_net_bus_devreset: dhd_bus_devreset: -35 [ 81.148373] wifi_platform_set_power = 0 [ 81.152740] ======== PULL WL_REG_ON LOW! ======== [ 81.158059] [wifi_pm]: wifi power off [ 81.162321] wl_android_wifi_on: Failed [ 81.166579] dhd_open : wl_android_wifi_on failed (-35) [ 81.172394] dhd_stop: Enter d720d000 [ 81.176548] wl_android_wifi_off in 1 [ 81.180623] wl_android_wifi_off in 2: g_wifi_on=0 [ 81.185942] wl_android_wifi_off out [ 81.189908] dhd_stop: Exit [ 81.193026] dhd_open: Exit ret=-1 Could not set interface wlan0 fl[ 81.196943] dhd_inetaddr_notifier_call: bus not ready, exit ags (UP): Operation not permitte[ 81.206128] dhd_open: Enter d720d000 d nl80211: Could not set interf[ 81.212702] ace 'wlan0' UP nl80211: deinit [ 81.212706] Dongle Host Driver, version 1.201.59.3 (r506368) ifname=wlan0 disabled_11b_rates=[ 81.212710] Compiled in drivers/net/wireless/bcmdhd on Sep 14 2017 at 11:02:29 0 [ 81.236958] wl_android_wifi_on in 1 [ 81.241176] wl_android_wifi_on in 2: g_wifi_on=0 [ 81.246400] wifi_platform_set_power = 1 [ 81.250760] ======== PULL WL_REG_ON HIGH! ======== [ 81.256266] [wifi_pm]: wifi power on [ 81.570028] sdio_reset_comm(): [ 81.573521] [mmc]: sdc1 set ios: clk 50000000Hz bm PP pm ON vdd 3.3V width 4 timing SD-HS(SDR25) dt B [ 81.586092] [mmc]: sdc1 set ios: clk 50000000Hz bm PP pm ON vdd 3.3V width 4 timing SD-HS(SDR25) dt B [ 81.597610] [mmc]: sdc1 set ios: clk 150000Hz bm PP pm ON vdd 3.3V width 4 timing LEGACY(SDR12) dt B [ 81.608512] [mmc]: sdc1 set ios: clk 150000Hz bm PP pm ON vdd 3.3V width 4 timing LEGACY(SDR12) dt B [ 81.630743] mmc1: queuing unknown CIS tuple 0x80 (2 bytes) [ 81.638905] mmc1: queuing unknown CIS tuple 0x80 (3 bytes) [ 81.647165] mmc1: queuing unknown CIS tuple 0x80 (3 bytes) [ 81.656911] mmc1: queuing unknown CIS tuple 0x80 (7 bytes) [ 81.775658] [mmc]: sdc1 set ios: clk 150000Hz bm PP pm ON vdd 3.3V width 4 timing SD-HS(SDR25) dt B [ 81.785943] [mmc]: sdc1 set ios: clk 50000000Hz bm PP pm ON vdd 3.3V width 4 timing SD-HS(SDR25) dt B [ 81.796508] [mmc]: sdc1 set ios: clk 50000000Hz bm PP pm ON vdd 3.3V width 4 timing SD-HS(SDR25) dt B [ 81.807280] [ 81.807283] [ 81.807285] dhd_bus_devreset: == WLAN ON == [ 81.815693] F1 signature read @0x18000000=0x1540a9a6 [ 81.822936] F1 signature OK, socitype:0x1 chip:0xa9a6 rev:0x0 pkg:0x4 [ 81.830931] DHD: dongle ram size is set to 524288(orig 524288) at 0x0 [ 81.838356] dhdsdio_probe_init: set use_rxchain 1 from config.txt [ 81.845386] dhd_conf_read_config: Ignore config file /lib/firmware/config.txt [ 81.853427] dhd_conf_set_fw_name_by_chip: firmware_path=lib/firmware/fw_bcm43438a0_apsta.bin [ 81.862999] Final fw_path=lib/firmware/fw_bcm43438a0_apsta.bin [ 81.869660] Final nv_path=/lib/firmware/nvram.txt [ 81.874988] Final conf_path=/lib/firmware/config.txt [ 81.881223] dhdsdio_download_code_file: Open firmware file failed lib/firmware/fw_bcm43438a0_apsta.bin [ 81.891670] _dhdsdio_download_firmware: dongle image file download failed [ 81.899411] dhd_net_bus_devreset: dhd_bus_devreset: -35 [ 81.905327] dhd_prot_ioctl : bus is down. we have nothing to do [ 81.912108] dhd_net_bus_devreset: dhd_bus_devreset: -35 [ 81.918034] wifi_platform_set_power = 0 [ 81.922493] ======== PULL WL_REG_ON LOW! ======== [ 81.927810] [wifi_pm]: wifi power off [ 81.932073] wl_android_wifi_on: Failed [ 81.936331] dhd_open : wl_android_wifi_on failed (-35) [ 81.942144] dhd_stop: Enter d720d000 [ 81.946298] wl_android_wifi_off in 1 [ 81.950371] wl_android_wifi_off in 2: g_wifi_on=0 [ 81.955686] wl_android_wifi_off out [ 81.959742] dhd_stop: Exit [ 81.962860] dhd_open: Exit ret=-1 ifconfig: SIOCSIFFLAGS: Operation not permitted nl80211 driver initialization failed. wlan0: interface state UNINITIALIZED->DISABLED wlan0: AP-DISABLED hostapd_free_hapd_data: Interface wlan0 wasn't started *************************** Hostapd test successed! *************************** root@TinaLinux:/bin# 因为softap_test的绝对路径是:/bin/softap_test。那么lib/firmware/fw_bcm43438a0_apsta.bin的路径就应该是:/bin/lib/firmware/fw_bcm43438a0_apsta.bin。 将目录/lib/firmware/fw_bcm43438a0_apsta.bin中的AP6212的库文件全部拷贝到:/bin/lib/firmware/fw_bcm43438a0_apsta.bin就可以通过softap_test正常打开softap了! root@TinaLinux:/bin# root@TinaLinux:/bin# mkdir -p lib/firmware/ root@TinaLinux:/bin# cd lib/firmware/ root@TinaLinux:/bin/lib/firmware# ll drwxr-xr-x 2 root root 1024 Sep 16 03:16 . drwxr-xr-x 3 root root 1024 Sep 16 03:16 .. root@TinaLinux:/bin/lib/firmware# cd /lib/firmware/ root@TinaLinux:/lib/firmware# ll drwxr-xr-x 2 root root 139 Sep 14 19:08 . drwxr-xr-x 10 root root 681 Sep 14 19:02 .. -rw-r--r-- 1 root root 26020 Sep 14 17:31 bcm43438a0.hcd -rw-r--r-- 1 root root 378595 Sep 14 17:31 fw_bcm43438a0.bin -rw-r--r-- 1 root root 309352 Sep 14 17:31 fw_bcm43438a0_apsta.bin -rw-r--r-- 1 root root 336323 Sep 14 17:31 fw_bcm43438a0_p2p.bin -rw-r--r-- 1 root root 902 Sep 14 17:31 nvram.txt root@TinaLinux:/lib/firmware# cp * /bin/lib/firmware/ root@TinaLinux:/lib/firmware# cd /bin/lib/firmware/ root@TinaLinux:/bin/lib/firmware# ll drwxr-xr-x 2 root root 1024 Sep 16 03:17 . drwxr-xr-x 3 root root 1024 Sep 16 03:16 .. -rw-r--r-- 1 root root 26020 Sep 16 03:17 bcm43438a0.hcd -rw-r--r-- 1 root root 378595 Sep 16 03:17 fw_bcm43438a0.bin -rw-r--r-- 1 root root 309352 Sep 16 03:17 fw_bcm43438a0_apsta.bin -rw-r--r-- 1 root root 336323 Sep 16 03:17 fw_bcm43438a0_p2p.bin -rw-r--r-- 1 root root 902 Sep 16 03:17 nvram.txt root@TinaLinux:/bin/lib/firmware# cd /bin/ root@TinaLinux:/bin# root@TinaLinux:/bin# root@TinaLinux:/bin# softap_test *************************** Start hostapd test! *************************** Start to reload firmware! Enter: wifi_get_fw_path function, fw_type=1,Eneter: wifi_change_fw_path, fwpath = lib/firmware/fw_bcm43438a0_apsta.bin. Softap fwReload - OkMessage is: OK Reload firmware finished! Start to set softap! Message is: OK Set softap finished! [ 190.043911] dhd_open: Enter d720d000 [ 190.048003] [ 190.048006] Dongle Host Driver, version 1.201.59.3 (r506368) [ 190.048010] Compiled in drivers/net/wireless/bcmdhd on Sep 14 2017 at 11:02:29 [ 190.064444] wl_android_wifi_on in 1 [ 190.068411] wl_android_wifi_on in 2: g_wifi_on=0 [ 190.073643] wifi_platform_set_power = 1 [ 190.078087] ======== PULL WL_REG_ON HIGH! ======== [ 190.083512] [wifi_pm]: wifi power on [ 190.390029] sdio_reset_comm(): [ 190.393528] [mmc]: sdc1 set ios: clk 50000000Hz bm PP pm ON vdd 3.3V width 4 timing SD-HS(SDR25) dt B [ 190.406118] [mmc]: sdc1 set ios: clk 50000000Hz bm PP pm ON vdd 3.3V width 4 timing SD-HS(SDR25) dt B [ 190.417559] [mmc]: sdc1 set ios: clk 150000Hz bm PP pm ON vdd 3.3V width 4 timing LEGACY(SDR12) dt B [ 190.428484] [mmc]: sdc1 set ios: clk 150000Hz bm PP pm ON vdd 3.3V width 4 timing LEGACY(SDR12) dt B [ 190.450739] mmc1: queuing unknown CIS tuple 0x80 (2 bytes) [ 190.458990] mmc1: queuing unknown CIS tuple 0x80 (3 bytes) [ 190.467164] mmc1: queuing unknown CIS tuple 0x80 (3 bytes) [ 190.477004] mmc1: queuing unknown CIS tuple 0x80 (7 bytes) [ 190.595621] [mmc]: sdc1 set ios: clk 150000Hz bm PP pm ON vdd 3.3V width 4 timing SD-HS(SDR25) dt B [ 190.606060] [mmc]: sdc1 set ios: clk 50000000Hz bm PP pm ON vdd 3.3V width 4 timing SD-HS(SDR25) dt B [ 190.616684] [mmc]: sdc1 set ios: clk 50000000Hz bm PP pm ON vdd 3.3V width 4 timing SD-HS(SDR25) dt B [ 190.627433] [ 190.627436] [ 190.627439] dhd_bus_devreset: == WLAN ON == [ 190.635854] F1 signature read @0x18000000=0x1540a9a6 [ 190.643122] F1 signature OK, socitype:0x1 chip:0xa9a6 rev:0x0 pkg:0x4 [ 190.651026] DHD: dongle ram size is set to 524288(orig 524288) at 0x0 [ 190.658542] dhdsdio_probe_init: set use_rxchain 1 from config.txt [ 190.665481] dhd_conf_read_config: Ignore config file /lib/firmware/config.txt [ 190.673620] dhd_conf_set_fw_name_by_chip: firmware_path=lib/firmware/fw_bcm43438a0_apsta.bin [ 190.683192] Final fw_path=lib/firmware/fw_bcm43438a0_apsta.bin [ 190.689763] Final nv_path=/lib/firmware/nvram.txt [ 190.695090] Final conf_path=/lib/firmware/config.txt [ 190.733434] NVRAM version: AP6212_NVRAM_V1.0_20140603 [ 190.742372] dhdsdio_write_vars: Download, Upload and compare of NVRAM succeeded. [ 190.804325] dhd_bus_init: enable 0x06, ready 0x06 (waited 0us) [ 190.811066] bcmsdh_oob_intr_register: Enter [ 190.815806] bcmsdh_oob_intr_register: HW_OOB enabled [ 190.821429] bcmsdh_oob_intr_register OOB irq=7 flags=414 [ 190.827623] bcmsdh_oob_intr_register: enable_irq_wake [ 190.833345] bcmsdh_oob_intr_register: enable_irq_wake failed with -6 [ 190.841211] dhd_conf_set_band: Set band 0 [ 190.848224] Firmware up: op_mode=0x0002, MAC=02:1a:11:f9:3d:89 [ 190.854908] dhd_conf_set_country: Set country CN, revision 0 [ 190.924854] Country code: CN (CN/0) [ 190.929416] dhd_conf_set_roam: Set roam_off 1 [ 190.940302] dhd_arp_offload_enable: failed to enabe ARP offload to 0, retcode = -23 [ 190.949649] dhd_arp_offload_set: failed to set ARP offload mode to 0x0, retcode = -23 [ 190.959035] Firmware version = wl0: Jun 6 2014 14:57:15 version 7.10.226.49 (r) FWID 01-cf4a5122 [ 190.969088] Driver: 1.201.59.3 (r506368) [ 190.969093] Firmware: wl0: Jun 6 2014 14:57:15 version 7.10.226.49 (r) FWID 01-cf4a5122 [ 190.983566] dhd_txglom_enable: enable 1 [ 190.987919] dhd_conf_set_disable_proptx: set disable_proptx 0 [ 190.996601] dhd_wlfc_init(): successfully enabled bdcv2 tlv signaling, 79 [ 191.004833] dhd_wlfc_init(): wlfc_mode=0x0, ret=-23 [ 191.011090] wl_android_wifi_on: Success [ 191.085709] dhd_open: Exit ret=0 Start to start softap! Configuration file: /etc/wifi/hostapd.conf nl80211: Could not re-add multic[ 195.098274] netdev_ifidx(5), chan_type(1) target channel(6) ast membership for vendor events: -2 (No such file or directory) [ 195.159332] Disconnect STA : ff:ff:ff:ff:ff:ff scb_val.val 3 Using interface wlan0 with hwaddr 02:1a:11:f9:3d:89 and ssid "Smart-AW-HOSTAPD" VLAN: vlan_set_name_type: SET_VLAN_NAME_TYPE_CMD name_type=2 failed: No error information SoftAP started successfullyMessage is: OK Start softap finished! wlan0: interface state UNINITIALIZED->ENABLED wlan0: AP-ENABLED *************************** Hostapd test successed! *************************** root@TinaLinux:/bin# root@TinaLinux:/bin# 7、查找/修改路径lib/firmware/fw_bcm43438a0_apsta.bin的位置,解决问题! rootroot@cm-System-Product-Name:/home/wwt/softap_ap6212a0_tinav2.1$ rootroot@cm-System-Product-Name:/home/wwt/softap_ap6212a0_tinav2.1$ rootroot@cm-System-Product-Name:/home/wwt/softap_ap6212a0_tinav2.1$ grep "lib/firmware/fw_bcm43438a0_apsta.bin" . -R grep: ./target/.git/svn: 没有那个文件或目录 grep: ./dl/.git/svn: 没有那个文件或目录 grep: ./scripts/.git/svn: 没有那个文件或目录 grep: ./toolchain/.git/svn: 没有那个文件或目录 grep: ./lichee/brandy/.git/svn: 没有那个文件或目录 grep: ./lichee/linux-3.4/.git/svn: 没有那个文件或目录 grep: ./.repo/manifests/.git/svn: 没有那个文件或目录 grep: ./tools/.git/packed-refs: 没有那个文件或目录 grep: ./tools/.git/svn: 没有那个文件或目录 ./package/allwinner/softap/src/include/wifi.h:#define WIFI_DRIVER_FW_PATH_AP "lib/firmware/fw_bcm43438a0_apsta.bin" grep: ./package/.git/svn: 没有那个文件或目录 grep: ./config/.git/svn: 没有那个文件或目录 grep: ./prebuilt/.git/svn: 没有那个文件或目录 grep: ./prebuilt/gcc/linux-x86/arm/toolchain-sunxi/toolchain/arm-openwrt-linux-muslgnueabi/lib/lib: 符号连接的层数过多 grep: ./prebuilt/gcc/linux-x86/arm/toolchain-sunxi/toolchain/lib64/lib: 符号连接的层数过多 grep: ./prebuilt/gcc/linux-x86/arm/toolchain-sunxi/toolchain/arm-openwrt-linux/lib/lib: 符号连接的层数过多 grep: ./prebuilt/gcc/linux-x86/arm/toolchain-sunxi/toolchain/lib/lib: 符号连接的层数过多 grep: ./prebuilt/gcc/linux-x86/arm/toolchain-sunxi/toolchain/lib32/lib: 符号连接的层数过多 grep: 警告: ./prebuilt/gcc/linux-x86/aarch64/toolchain-sunxi/toolchain/lib64/lib64: 嵌套目录循环 grep: ./prebuilt/gcc/linux-x86/aarch64/toolchain-sunxi/toolchain/lib64/lib: 符号连接的层数过多 grep: 警告: ./prebuilt/gcc/linux-x86/aarch64/toolchain-sunxi/toolchain/lib/lib64: 嵌套目录循环 grep: ./prebuilt/gcc/linux-x86/aarch64/toolchain-sunxi/toolchain/lib/lib: 符号连接的层数过多 grep: 警告: ./prebuilt/gcc/linux-x86/aarch64/toolchain-sunxi/toolchain/aarch64-openwrt-linux-musl/lib64/lib64: 嵌套目录循环 grep: ./prebuilt/gcc/linux-x86/aarch64/toolchain-sunxi/toolchain/aarch64-openwrt-linux-musl/lib64/lib: 符号连接的层数过多 grep: 警告: ./prebuilt/gcc/linux-x86/aarch64/toolchain-sunxi/toolchain/aarch64-openwrt-linux-musl/lib/lib64: 嵌套目录循环 grep: ./prebuilt/gcc/linux-x86/aarch64/toolchain-sunxi/toolchain/aarch64-openwrt-linux-musl/lib/lib: 符号连接的层数过多 grep: 警告: ./prebuilt/gcc/linux-x86/aarch64/toolchain-sunxi/toolchain/aarch64-openwrt-linux/lib64/lib64: 嵌套目录循环 grep: ./prebuilt/gcc/linux-x86/aarch64/toolchain-sunxi/toolchain/aarch64-openwrt-linux/lib64/lib: 符号连接的层数过多 grep: 警告: ./prebuilt/gcc/linux-x86/aarch64/toolchain-sunxi/toolchain/aarch64-openwrt-linux/lib/lib64: 嵌套目录循环 grep: ./prebuilt/gcc/linux-x86/aarch64/toolchain-sunxi/toolchain/aarch64-openwrt-linux/lib/lib: 符号连接的层数过多 grep: 警告: ./prebuilt/gcc/linux-x86/aarch64/toolchain-sunxi/toolchain/lib32/lib64: 嵌套目录循环 grep: ./prebuilt/gcc/linux-x86/aarch64/toolchain-sunxi/toolchain/lib32/lib: 符号连接的层数过多 grep: ./docs/.git/svn: 没有那个文件或目录 grep: ./build/.git/svn: 没有那个文件或目录 grep: 警告: ./out/astar-parrot/compile_dir/target/alsa-lib-1.1.0/include/alsa: 嵌套目录循环 grep: ./out/astar-parrot/compile_dir/target/rootfs/var/ccX0DZGY.s: 权限不够 grep: ./out/astar-parrot/compile_dir/target/rootfs/var/arjGlms3: 权限不够 grep: ./out/astar-parrot/compile_dir/target/rootfs/var/.xrdp/xrdp-Wpph9R: 权限不够 grep: ./out/astar-parrot/compile_dir/target/rootfs/var/.xrdp/xrdp-sesman-j8EDdT: 权限不够 grep: ./out/astar-parrot/compile_dir/target/rootfs/var/ccZVA9SY.s: 权限不够 grep: ./out/astar-parrot/compile_dir/target/rootfs/var/ccX0uKZX.s: 权限不够 grep: ./out/astar-parrot/compile_dir/target/rootfs/var/jack-sam: 权限不够 grep: ./out/astar-parrot/compile_dir/target/rootfs/var/cc61XiF1.s: 权限不够 grep: ./out/astar-parrot/compile_dir/target/rootfs/var/config-err-1dsmuu: 权限不够 grep: ./out/astar-parrot/compile_dir/target/rootfs/var/.X11-unix/X0: 没有那个设备或地址 grep: ./out/astar-parrot/compile_dir/target/rootfs/var/ccsCfxm0.s: 权限不够 grep: ./out/astar-parrot/compile_dir/target/rootfs/var/.ICE-unix/1629: 没有那个设备或地址 grep: ./out/astar-parrot/compile_dir/target/rootfs/etc/fstab: 没有那个文件或目录 grep: ./out/astar-parrot/compile_dir/target/rootfs/etc/resolv.conf: 没有那个文件或目录 grep: ./out/astar-parrot/compile_dir/target/rootfs/etc/localtime: 没有那个文件或目录 grep: ./out/astar-parrot/compile_dir/target/rootfs/etc/TZ: 没有那个文件或目录 匹配到二进制文件 ./out/astar-parrot/compile_dir/target/rootfs/lib/libsoftap.so ./out/astar-parrot/compile_dir/target/rootfs/usr/lib/opkg/info/ap6212-firmware.list:/lib/firmware/fw_bcm43438a0_apsta.bin grep: ./out/astar-parrot/compile_dir/target/linux-astar-parrot/iptables-1.4.21/ipkg-install/usr/bin/iptables-xml: 没有那个文件或目录 grep: ./out/astar-parrot/compile_dir/target/linux-astar-parrot/linux-3.4.39/.git/svn: 没有那个文件或目录 grep: ./out/astar-parrot/compile_dir/target/linux-astar-parrot/base-files/ipkg-sunxi/base-files/var/ccYUdHeN.s: 权限不够 grep: ./out/astar-parrot/compile_dir/target/linux-astar-parrot/base-files/ipkg-sunxi/base-files/var/ccwnGT98.s: 权限不够 grep: ./out/astar-parrot/compile_dir/target/linux-astar-parrot/base-files/ipkg-sunxi/base-files/var/arjGlms3: 权限不够 grep: ./out/astar-parrot/compile_dir/target/linux-astar-parrot/base-files/ipkg-sunxi/base-files/var/.xrdp/xrdp-Wpph9R: 权限不够 grep: ./out/astar-parrot/compile_dir/target/linux-astar-parrot/base-files/ipkg-sunxi/base-files/var/.xrdp/xrdp-sesman-j8EDdT: 权限不够 grep: ./out/astar-parrot/compile_dir/target/linux-astar-parrot/base-files/ipkg-sunxi/base-files/var/jack-sam: 权限不够 grep: ./out/astar-parrot/compile_dir/target/linux-astar-parrot/base-files/ipkg-sunxi/base-files/var/config-err-1dsmuu: 权限不够 grep: ./out/astar-parrot/compile_dir/target/linux-astar-parrot/base-files/ipkg-sunxi/base-files/var/ccKPHt0a.s: 权限不够 grep: ./out/astar-parrot/compile_dir/target/linux-astar-parrot/base-files/ipkg-sunxi/base-files/var/.X11-unix/X0: 没有那个设备或地址 grep: ./out/astar-parrot/compile_dir/target/linux-astar-parrot/base-files/ipkg-sunxi/base-files/var/ccTjmDl9.s: 权限不够 grep: ./out/astar-parrot/compile_dir/target/linux-astar-parrot/base-files/ipkg-sunxi/base-files/var/cchl8Q5Z.s: 权限不够 grep: ./out/astar-parrot/compile_dir/target/linux-astar-parrot/base-files/ipkg-sunxi/base-files/var/.ICE-unix/1629: 没有那个设备或地址 grep: ./out/astar-parrot/compile_dir/target/linux-astar-parrot/base-files/ipkg-sunxi/base-files/var/cc8cLhMk.s: 权限不够 grep: ./out/astar-parrot/compile_dir/target/linux-astar-parrot/base-files/ipkg-sunxi/base-files/var/cchrl5HM.s: 权限不够 grep: ./out/astar-parrot/compile_dir/target/linux-astar-parrot/base-files/ipkg-sunxi/base-files/etc/fstab: 没有那个文件或目录 grep: ./out/astar-parrot/compile_dir/target/linux-astar-parrot/base-files/ipkg-sunxi/base-files/etc/resolv.conf: 没有那个文件或目录 grep: ./out/astar-parrot/compile_dir/target/linux-astar-parrot/base-files/ipkg-sunxi/base-files/etc/localtime: 没有那个文件或目录 grep: ./out/astar-parrot/compile_dir/target/linux-astar-parrot/base-files/ipkg-sunxi/base-files/etc/TZ: 没有那个文件或目录 匹配到二进制文件 ./out/astar-parrot/compile_dir/target/softap-0.0.1/src/libsoftap.so ./out/astar-parrot/compile_dir/target/softap-0.0.1/src/include/wifi.h:#define WIFI_DRIVER_FW_PATH_AP "lib/firmware/fw_bcm43438a0_apsta.bin" 匹配到二进制文件 ./out/astar-parrot/compile_dir/target/softap-0.0.1/ipkg-sunxi/softap/lib/libsoftap.so 匹配到二进制文件 ./out/astar-parrot/compile_dir/target/softap-0.0.1/ipkg-install/usr/lib/libsoftap.so grep: ./out/astar-parrot/compile_dir/host/u-boot-2014.10/arch/sandbox/include/asm/arch: 没有那个文件或目录 grep: ./out/astar-parrot/staging_dir/target/rootfs/var/.xrdp/xrdp-Wpph9R: 权限不够 grep: ./out/astar-parrot/staging_dir/target/rootfs/var/.xrdp/xrdp-sesman-j8EDdT: 权限不够 grep: ./out/astar-parrot/staging_dir/target/rootfs/var/jack-sam: 权限不够 grep: ./out/astar-parrot/staging_dir/target/rootfs/var/ccOJeBXg.s: 权限不够 grep: ./out/astar-parrot/staging_dir/target/rootfs/var/ccx3i6ni.s: 权限不够 grep: ./out/astar-parrot/staging_dir/target/rootfs/var/config-err-1dsmuu: 权限不够 grep: ./out/astar-parrot/staging_dir/target/rootfs/var/ccyysPO4.s: 权限不够 grep: ./out/astar-parrot/staging_dir/target/rootfs/var/ccvMBZVn.s: 权限不够 grep: ./out/astar-parrot/staging_dir/target/rootfs/var/.X11-unix/X0: 没有那个设备或地址 grep: ./out/astar-parrot/staging_dir/target/rootfs/var/cc2RTnRj.s: 权限不够 grep: ./out/astar-parrot/staging_dir/target/rootfs/var/arXGbM2T: 权限不够 grep: ./out/astar-parrot/staging_dir/target/rootfs/var/.ICE-unix/1629: 没有那个设备或地址 grep: ./out/astar-parrot/staging_dir/target/rootfs/var/ccngUTgH.s: 权限不够 grep: ./out/astar-parrot/staging_dir/target/rootfs/var/ccbLfznO.s: 权限不够 grep: ./out/astar-parrot/staging_dir/target/rootfs/etc/fstab: 没有那个文件或目录 grep: ./out/astar-parrot/staging_dir/target/rootfs/etc/resolv.conf: 没有那个文件或目录 grep: ./out/astar-parrot/staging_dir/target/rootfs/etc/localtime: 没有那个文件或目录 grep: ./out/astar-parrot/staging_dir/target/rootfs/etc/TZ: 没有那个文件或目录 匹配到二进制文件 ./out/astar-parrot/staging_dir/target/rootfs/lib/libsoftap.so 匹配到二进制文件 ./out/astar-parrot/staging_dir/target/lib/libsoftap.so rootroot@cm-System-Product-Name:/home/wwt/softap_ap6212a0_tinav2.1$ W:\softap_ap6212a0_tinav2.1\package\allwinner\softap\src\include\wifi.h #ifndef WIFI_DRIVER_FW_PATH_AP #define WIFI_DRIVER_FW_PATH_AP "lib/firmware/fw_bcm43438a0_apsta.bin" #endif #ifndef WIFI_DRIVER_FW_PATH_P2P #define WIFI_DRIVER_FW_PATH_P2P "lib/firmware/fw_bcm43438a0_p2p.bin" #endif 修改为: #ifndef WIFI_DRIVER_FW_PATH_AP //#define WIFI_DRIVER_FW_PATH_AP "lib/firmware/fw_bcm43438a0_apsta.bin" #define WIFI_DRIVER_FW_PATH_AP "/lib/firmware/fw_bcm43438a0_apsta.bin" #endif #ifndef WIFI_DRIVER_FW_PATH_P2P //#define WIFI_DRIVER_FW_PATH_P2P "lib/firmware/fw_bcm43438a0_p2p.bin" #define WIFI_DRIVER_FW_PATH_P2P "/lib/firmware/fw_bcm43438a0_p2p.bin" #endif rootroot@cm-System-Product-Name:/home/wwt/softap_ap6212a0_tinav2.1$ make -j12 ONTROL/postinst-pkg; echo "insert_modules $modules" >> /home/wwt/softap_ap6212a0_tinav2.1/out/astar-parrot/staging_dir/target/rootfs/tmp-kmod-net-ap6212/CONTROL/postinst-pkg; chmod 0755 /home/wwt/softap_ap6212a0_tinav2.1/out/astar-parrot/staging_dir/target/rootfs/tmp-kmod-net-ap6212/CONTROL/postinst-pkg; fi SHELL= flock /home/wwt/softap_ap6212a0_tinav2.1/tmp/.root-copy.flock -c 'cp -fpR /home/wwt/softap_ap6212a0_tinav2.1/out/astar-parrot/staging_dir/target/rootfs/tmp-kmod-net-ap6212/. /home/wwt/softap_ap6212a0_tinav2.1/out/astar-parrot/staging_dir/target/rootfs/' rm -rf /home/wwt/softap_ap6212a0_tinav2.1/out/astar-parrot/staging_dir/target/rootfs/tmp-kmod-net-ap6212 touch /home/wwt/softap_ap6212a0_tinav2.1/out/astar-parrot/staging_dir/target/rootfs/stamp/.kmod-net-ap6212_installed if [ -f /home/wwt/softap_ap6212a0_tinav2.1/out/astar-parrot/staging_dir/target/pkginfo/linux.default.install.clean ]; then rm -f /home/wwt/softap_ap6212a0_tinav2.1/out/astar-parrot/staging_dir/target/pkginfo/linux.default.install /home/wwt/softap_ap6212a0_tinav2.1/out/astar-parrot/staging_dir/target/pkginfo/linux.default.install.clean; fi; echo "kmod-net-ap6212" >> /home/wwt/softap_ap6212a0_tinav2.1/out/astar-parrot/staging_dir/target/pkginfo/linux.default.install make[3]: Leaving directory `/home/wwt/softap_ap6212a0_tinav2.1/package/kernel/linux' make[2]: Leaving directory `/home/wwt/softap_ap6212a0_tinav2.1' make[1]: *** [/home/wwt/softap_ap6212a0_tinav2.1/out/astar-parrot/staging_dir/target/stamp/.package_compile] Error 2 make[1]: Leaving directory `/home/wwt/softap_ap6212a0_tinav2.1' Build failed - please re-run with -j1 to see the real error message make: *** [world] 错误 1 #### make failed to build some targets (8 seconds) #### rootroot@cm-System-Product-Name:/home/wwt/softap_ap6212a0_tinav2.1$ rootroot@cm-System-Product-Name:/home/wwt/softap_ap6212a0_tinav2.1$ rootroot@cm-System-Product-Name:/home/wwt/softap_ap6212a0_tinav2.1$ make -j1 #softap_test make -C /home/wwt/softap_ap6212a0_tinav2.1/out/astar-parrot/compile_dir/target/softap-0.0.1/demo/ ARCH="arm" AR="arm-openwrt-linux-muslgnueabi-ar" CC="arm-openwrt-linux-muslgnueabi-gcc" CXX="arm-openwrt-linux-muslgnueabi-g++" CFLAGS="-Os -pipe -march=armv7-a -mtune=cortex-a7 -mfpu=neon -fno-caller-saves -fno-plt -mfloat-abi=hard -Wformat -Werror=format-security -fstack-protector -D_FORTIFY_SOURCE=1 -Wl,-z,now -Wl,-z,relro" LDFLAGS="-L/home/wwt/softap_ap6212a0_tinav2.1/out/astar-parrot/staging_dir/target/usr/lib -L/home/wwt/softap_ap6212a0_tinav2.1/out/astar-parrot/staging_dir/target/lib -L/home/wwt/softap_ap6212a0_tinav2.1/prebuilt/gcc/linux-x86/arm/toolchain-sunxi/toolchain/usr/lib -L/home/wwt/softap_ap6212a0_tinav2.1/prebuilt/gcc/linux-x86/arm/toolchain-sunxi/toolchain/lib -znow -zrelro" CONFIG_PREFIX="/home/wwt/softap_ap6212a0_tinav2.1/out/astar-parrot/compile_dir/target/softap-0.0.1/ipkg-install" all make[4]: Entering directory `/home/wwt/softap_ap6212a0_tinav2.1/out/astar-parrot/compile_dir/target/softap-0.0.1/demo' arm-openwrt-linux-muslgnueabi-gcc -o softap_test softap_test.c -Os -pipe -march=armv
lichee_20170502_1607_全志R16的linux系统编译需要改动的文件_使用parrotv1.1的内核_没有外层目录.7z
rootroot@cm-System-Product-Name:/home/wwt/linux_r16$ tar zxvf lichee_parrotv1.1_20161202.tar.gz rootroot@cm-System-Product-Name:/home/wwt/linux_r16$ rootroot@cm-System-Product-Name:/home/wwt/linux_r16$ ll 总用量 10786992 drwx------ 4 rootroot rootroot 4096 5月 2 14:48 ./ drwxrwxrwx 18 rootroot rootroot 4096 5月 2 13:50 ../ -rwx------ 1 rootroot rootroot 8557328646 12月 2 16:08 android_parrotv1.1_20161202.tar.gz* drwxrwxr-x 7 rootroot rootroot 4096 12月 2 15:52 lichee/ -rwx------ 1 rootroot rootroot 2488523424 12月 2 16:15 lichee_parrotv1.1_20161202.tar.gz* drwxrwxr-x 8 rootroot rootroot 4096 5月 2 14:40 parrotv1p1_lichee/ rootroot@cm-System-Product-Name:/home/wwt/linux_r16$ rootroot@cm-System-Product-Name:/home/wwt/linux_r16$ rootroot@cm-System-Product-Name:/home/wwt/linux_r16$ rootroot@cm-System-Product-Name:/home/wwt/linux_r16$ rootroot@cm-System-Product-Name:/home/wwt/linux_r16$ cd lichee/ rootroot@cm-System-Product-Name:/home/wwt/linux_r16/lichee$ ll 总用量 36 drwxrwxr-x 7 rootroot rootroot 4096 12月 2 15:52 ./ drwx------ 4 rootroot rootroot 4096 5月 2 14:48 ../ drwxrwxr-x 8 rootroot rootroot 4096 12月 2 15:51 brandy/ drwxrwxr-x 15 rootroot rootroot 4096 12月 2 15:52 buildroot/ -r-xr-xr-x 1 rootroot rootroot 55 12月 2 15:52 build.sh* drwxrwxr-x 26 rootroot rootroot 4096 12月 2 15:52 linux-3.4/ -r--r--r-- 1 rootroot rootroot 232 12月 2 15:52 README drwxrwxr-x 6 rootroot rootroot 4096 12月 2 15:51 .repo/ drwxrwxr-x 7 rootroot rootroot 4096 12月 2 15:52 tools/ rootroot@cm-System-Product-Name:/home/wwt/linux_r16/lichee$ ./build.sh config Welcome to mkscript setup progress All available chips: 0. sun8iw5p1 Choice: 0 All available platforms: 0. android 1. dragonboard 2. linux 3. tina Choice: 2 All available kernel: 0. linux-3.4 Choice: 0 All available boards: 0. bell-one 1. evb 2. evb-20 3. evb-30 4. evb-rtl8723bs 5. sc3813r Choice: 3 rootroot@cm-System-Product-Name:/home/wwt/linux_r16/lichee$ ./build.sh KCONFIG_AUTOCONFIG=/home/wwt/linux_r16/lichee/out/sun8iw5p1/linux/common/buildroot/build/buildroot-config/auto.conf KCONFIG_AUTOHEADER=/home/wwt/linux_r16/lichee/out/sun8iw5p1/linux/common/buildroot/build/buildroot-config/autoconf.h KCONFIG_TRISTATE=/home/wwt/linux_r16/lichee/out/sun8iw5p1/linux/common/buildroot/build/buildroot-config/tristate.config BUILDROOT_CONFIG=/home/wwt/linux_r16/lichee/out/sun8iw5p1/linux/common/buildroot/.config /home/wwt/linux_r16/lichee/out/sun8iw5p1/linux/common/buildroot/build/buildroot-config/conf --silentoldconfig Config.in # # make dependencies written to .auto.deps # ATTENTION buildroot devels! # See top of this file before playing with this auto-preprequisites! # make[1]:正在离开目录 `/home/wwt/linux_r16/lichee/buildroot' You must install 'makeinfo' on your build machine makeinfo is usually part of the texinfo package in your distribution make: *** [dependencies] 错误 1 make:离开目录“/home/wwt/linux_r16/lichee/buildroot” ERROR: build buildroot Failed rootroot@cm-System-Product-Name:/home/wwt/linux_r16/lichee$ d/buildroot-config/conf.o /home/wwt/linux_r16/lichee/out/sun8iw5p1/linux/common/buildroot/build/buildroot-config/zconf.tab.o -o /home/wwt/linux_r16/lichee/out/sun8iw5p1/linux/common/buildroot/build/buildroot-config/conf rm /home/wwt/linux_r16/lichee/out/sun8iw5p1/linux/common/buildroot/build/buildroot-config/zconf.tab.c make[1]:正在离开目录 `/home/wwt/linux_r16/lichee/buildroot/package/config' # # configuration written to /home/wwt/linux_r16/lichee/out/sun8iw5p1/linux/common/buildroot/.config # make:离开目录“/home/wwt/linux_r16/lichee/buildroot” make:进入目录'/home/wwt/linux_r16/lichee/buildroot' /usr/bin/make -j6 O=/home/wwt/linux_r16/lichee/out/sun8iw5p1/linux/common/buildroot silentoldconfig make[1]: 正在进入目录 `/home/wwt/linux_r16/lichee/buildroot' GEN /home/wwt/linux_r16/lichee/out/sun8iw5p1/linux/common/buildroot/Makefile KCONFIG_AUTOCONFIG=/home/wwt/linux_r16/lichee/out/sun8iw5p1/linux/common/buildroot/build/buildroot-config/auto.conf KCONFIG_AUTOHEADER=/home/wwt/linux_r16/lichee/out/sun8iw5p1/linux/common/buildroot/build/buildroot-config/autoconf.h KCONFIG_TRISTATE=/home/wwt/linux_r16/lichee/out/sun8iw5p1/linux/common/buildroot/build/buildroot-config/tristate.config BUILDROOT_CONFIG=/home/wwt/linux_r16/lichee/out/sun8iw5p1/linux/common/buildroot/.config /home/wwt/linux_r16/lichee/out/sun8iw5p1/linux/common/buildroot/build/buildroot-config/conf --silentoldconfig Config.in # # make dependencies written to .auto.deps # ATTENTION buildroot devels! # See top of this file before playing with this auto-preprequisites! # make[1]:正在离开目录 `/home/wwt/linux_r16/lichee/buildroot' You must install 'makeinfo' on your build machine makeinfo is usually part of the texinfo package in your distribution make: *** [dependencies] 错误 1 make:离开目录“/home/wwt/linux_r16/lichee/buildroot” ERROR: build buildroot Failed rootroot@cm-System-Product-Name:/home/wwt/linux_r16/lichee$ rootroot@cm-System-Product-Name:/home/wwt/linux_r16/lichee$ rootroot@cm-System-Product-Name:/home/wwt/linux_r16/lichee$ rootroot@cm-System-Product-Name:/home/wwt/linux_r16/lichee$ sudo apt-get install texinfo [sudo] password for rootroot: 正在读取软件包列表... 完成 正在分析软件包的依赖关系树 正在读取状态信息... 完成 下列软件包是自动安装的并且现在不需要了: fakeroot libalgorithm-diff-perl libalgorithm-diff-xs-perl libalgorithm-merge-perl libfakeroot Use 'apt-get autoremove' to remove them. 将会安装下列额外的软件包: libencode-locale-perl libfile-listing-perl libfont-afm-perl libhtml-form-perl libhtml-format-perl libhtml-parser-perl libhtml-tagset-perl libhtml-tree-perl libhttp-cookies-perl libhttp-daemon-perl libhttp-date-perl libhttp-message-perl libhttp-negotiate-perl libintl-perl libio-html-perl liblwp-mediatypes-perl liblwp-protocol-https-perl libnet-http-perl libtext-unidecode-perl libwww-perl libwww-robotrules-perl libxml-libxml-perl libxml-namespacesupport-perl libxml-parser-perl libxml-sax-base-perl libxml-sax-expat-perl libxml-sax-perl 建议安装的软件包: libdata-dump-perl libintl-xs-perl libcrypt-ssleay-perl libauthen-ntlm-perl texinfo-doc-nonfree 下列【新】软件包将被安装: libencode-locale-perl libfile-listing-perl libfont-afm-perl libhtml-form-perl libhtml-format-perl libhtml-parser-perl libhtml-tagset-perl libhtml-tree-perl libhttp-cookies-perl libhttp-daemon-perl libhttp-date-perl libhttp-message-perl libhttp-negotiate-perl libintl-perl libio-html-perl liblwp-mediatypes-perl liblwp-protocol-https-perl libnet-http-perl libtext-unidecode-perl libwww-perl libwww-robotrules-perl libxml-libxml-perl libxml-namespacesupport-perl libxml-parser-perl libxml-sax-base-perl libxml-sax-expat-perl libxml-sax-perl texinfo 升级了 0 个软件包,新安装了 28 个软件包,要卸载 0 个软件包,有 737 个软件包未被升级。 需要下载 3,425 kB 的软件包。 解压缩后会消耗掉 13.0 MB 的额外空间。 您希望继续执行吗? [Y/n] y 获取:1 http://cn.archive.ubuntu.com/ubuntu/ trusty/main libencode-locale-perl all 1.03-1 [12.4 kB] 获取:2 http://cn.archive.ubuntu.com/ubuntu/ trusty/main libhttp-date-perl all 6.02-1 [10.4 kB] 获取:3 http://cn.archive.ubuntu.com/ubuntu/ trusty/main libfile-listing-perl all 6.04-1 [9,774 B] 获取:4 http://cn.archive.ubuntu.com/ubuntu/ trusty/main libfont-afm-perl all 1.20-1 [14.3 kB] 获取:5 http://cn.archive.ubuntu.com/ubuntu/ trusty/main libhtml-tagset-perl all 3.20-2 [13.5 kB] 获取:6 http://cn.archive.ubuntu.com/ubuntu/ trusty/main libhtml-parser-perl amd64 3.71-1build1 [98.2 kB] 获取:7 http://cn.archive.ubuntu.com/ubuntu/ trusty/main libio-html-perl all 1.00-1 [15.7 kB] 获取:8 http://cn.archive.ubuntu.com/ubuntu/ trusty/main liblwp-mediatypes-perl all 6.02-1 [21.7 kB] 获取:9 http://cn.archive.ubuntu.com/ubuntu/ trusty/main libhttp-message-perl all 6.06-1 [78.7 kB] 获取:10 http://cn.archive.ubuntu.com/ubuntu/ trusty/main libhtml-form-perl all 6.03-1 [23.5 kB] 获取:11 http://cn.archive.ubuntu.com/ubuntu/ trusty/main libhtml-tree-perl all 5.03-1 [215 kB] 获取:12 http://cn.archive.ubuntu.com/ubuntu/ trusty/main libhtml-format-perl all 2.11-1 [44.7 kB] 获取:13 http://cn.archive.ubuntu.com/ubuntu/ trusty/main libhttp-cookies-perl all 6.00-2 [23.3 kB] 获取:14 http://cn.archive.ubuntu.com/ubuntu/ trusty/main libhttp-daemon-perl all 6.01-1 [17.0 kB] 获取:15 http://cn.archive.ubuntu.com/ubuntu/ trusty/main libhttp-negotiate-perl all 6.00-2 [13.4 kB] 获取:16 http://cn.archive.ubuntu.com/ubuntu/ trusty/main libintl-perl all 1.23-1build1 [1,204 kB] 获取:17 http://cn.archive.ubuntu.com/ubuntu/ trusty/main libnet-http-perl all 6.06-1 [24.2 kB] 获取:18 http://cn.archive.ubuntu.com/ubuntu/ trusty/main libwww-robotrules-perl all 6.01-1 [14.1 kB] 获取:19 http://cn.archive.ubuntu.com/ubuntu/ trusty/main libwww-perl all 6.05-2 [146 kB] 获取:20 http://cn.archive.ubuntu.com/ubuntu/ trusty-updates/main liblwp-protocol-https-perl all 6.04-2ubuntu0.1 [7,644 B] 获取:21 http://cn.archive.ubuntu.com/ubuntu/ trusty/main libtext-unidecode-perl all 0.04-2 [115 kB] 获取:22 http://cn.archive.ubuntu.com/ubuntu/ trusty/main libxml-namespacesupport-perl all 1.11-1 [13.2 kB] 获取:23 http://cn.archive.ubuntu.com/ubuntu/ trusty/main libxml-sax-base-perl all 1.07-1 [21.5 kB] 获取:24 http://cn.archive.ubuntu.com/ubuntu/ trusty/main libxml-sax-perl all 0.99+dfsg-2ubuntu1 [64.6 kB] 获取:25 http://cn.archive.ubuntu.com/ubuntu/ trusty-updates/main libxml-libxml-perl amd64 2.0108+dfsg-1ubuntu0.1 [337 kB] 获取:26 http://cn.archive.ubuntu.com/ubuntu/ trusty/main libxml-parser-perl amd64 2.41-1build3 [294 kB] 获取:27 http://cn.archive.ubuntu.com/ubuntu/ trusty/main libxml-sax-expat-perl all 0.40-2 [11.5 kB] 获取:28 http://cn.archive.ubuntu.com/ubuntu/ trusty/main texinfo amd64 5.2.0.dfsg.1-2 [561 kB] 下载 3,425 kB,耗时 2秒 (1,303 kB/s) Selecting previously unselected package libencode-locale-perl. (正在读取数据库 ... 系统当前共安装有 213805 个文件和目录。) Preparing to unpack .../libencode-locale-perl_1.03-1_all.deb ... Unpacking libencode-locale-perl (1.03-1) ... Selecting previously unselected package libhttp-date-perl. Preparing to unpack .../libhttp-date-perl_6.02-1_all.deb ... Unpacking libhttp-date-perl (6.02-1) ... Selecting previously unselected package libfile-listing-perl. Preparing to unpack .../libfile-listing-perl_6.04-1_all.deb ... Unpacking libfile-listing-perl (6.04-1) ... Selecting previously unselected package libfont-afm-perl. Preparing to unpack .../libfont-afm-perl_1.20-1_all.deb ... Unpacking libfont-afm-perl (1.20-1) ... Selecting previously unselected package libhtml-tagset-perl. Preparing to unpack .../libhtml-tagset-perl_3.20-2_all.deb ... Unpacking libhtml-tagset-perl (3.20-2) ... Selecting previously unselected package libhtml-parser-perl. Preparing to unpack .../libhtml-parser-perl_3.71-1build1_amd64.deb ... Unpacking libhtml-parser-perl (3.71-1build1) ... Selecting previously unselected package libio-html-perl. Preparing to unpack .../libio-html-perl_1.00-1_all.deb ... Unpacking libio-html-perl (1.00-1) ... Selecting previously unselected package liblwp-mediatypes-perl. Preparing to unpack .../liblwp-mediatypes-perl_6.02-1_all.deb ... Unpacking liblwp-mediatypes-perl (6.02-1) ... Selecting previously unselected package libhttp-message-perl. Preparing to unpack .../libhttp-message-perl_6.06-1_all.deb ... Unpacking libhttp-message-perl (6.06-1) ... Selecting previously unselected package libhtml-form-perl. Preparing to unpack .../libhtml-form-perl_6.03-1_all.deb ... Unpacking libhtml-form-perl (6.03-1) ... Selecting previously unselected package libhtml-tree-perl. Preparing to unpack .../libhtml-tree-perl_5.03-1_all.deb ... Unpacking libhtml-tree-perl (5.03-1) ... Selecting previously unselected package libhtml-format-perl. Preparing to unpack .../libhtml-format-perl_2.11-1_all.deb ... Unpacking libhtml-format-perl (2.11-1) ... Selecting previously unselected package libhttp-cookies-perl. Preparing to unpack .../libhttp-cookies-perl_6.00-2_all.deb ... Unpacking libhttp-cookies-perl (6.00-2) ... Selecting previously unselected package libhttp-daemon-perl. Preparing to unpack .../libhttp-daemon-perl_6.01-1_all.deb ... Unpacking libhttp-daemon-perl (6.01-1) ... Selecting previously unselected package libhttp-negotiate-perl. Preparing to unpack .../libhttp-negotiate-perl_6.00-2_all.deb ... Unpacking libhttp-negotiate-perl (6.00-2) ... Selecting previously unselected package libintl-perl. Preparing to unpack .../libintl-perl_1.23-1build1_all.deb ... Unpacking libintl-perl (1.23-1build1) ... Selecting previously unselected package libnet-http-perl. Preparing to unpack .../libnet-http-perl_6.06-1_all.deb ... Unpacking libnet-http-perl (6.06-1) ... Selecting previously unselected package libwww-robotrules-perl. Preparing to unpack .../libwww-robotrules-perl_6.01-1_all.deb ... Unpacking libwww-robotrules-perl (6.01-1) ... Selecting previously unselected package libwww-perl. Preparing to unpack .../libwww-perl_6.05-2_all.deb ... Unpacking libwww-perl (6.05-2) ... Selecting previously unselected package liblwp-protocol-https-perl. Preparing to unpack .../liblwp-protocol-https-perl_6.04-2ubuntu0.1_all.deb ... Unpacking liblwp-protocol-https-perl (6.04-2ubuntu0.1) ... Selecting previously unselected package libtext-unidecode-perl. Preparing to unpack .../libtext-unidecode-perl_0.04-2_all.deb ... Unpacking libtext-unidecode-perl (0.04-2) ... Selecting previously unselected package libxml-namespacesupport-perl. Preparing to unpack .../libxml-namespacesupport-perl_1.11-1_all.deb ... Unpacking libxml-namespacesupport-perl (1.11-1) ... Selecting previously unselected package libxml-sax-base-perl. Preparing to unpack .../libxml-sax-base-perl_1.07-1_all.deb ... Unpacking libxml-sax-base-perl (1.07-1) ... Selecting previously unselected package libxml-sax-perl. Preparing to unpack .../libxml-sax-perl_0.99+dfsg-2ubuntu1_all.deb ... Unpacking libxml-sax-perl (0.99+dfsg-2ubuntu1) ... Selecting previously unselected package libxml-libxml-perl. Preparing to unpack .../libxml-libxml-perl_2.0108+dfsg-1ubuntu0.1_amd64.deb ... Unpacking libxml-libxml-perl (2.0108+dfsg-1ubuntu0.1) ... Selecting previously unselected package libxml-parser-perl. Preparing to unpack .../libxml-parser-perl_2.41-1build3_amd64.deb ... Unpacking libxml-parser-perl (2.41-1build3) ... Selecting previously unselected package libxml-sax-expat-perl. Preparing to unpack .../libxml-sax-expat-perl_0.40-2_all.deb ... Unpacking libxml-sax-expat-perl (0.40-2) ... Selecting previously unselected package texinfo. Preparing to unpack .../texinfo_5.2.0.dfsg.1-2_amd64.deb ... Unpacking texinfo (5.2.0.dfsg.1-2) ... Processing triggers for man-db (2.6.7.1-1) ... Processing triggers for doc-base (0.10.5) ... Processing 1 added doc-base file... 正在设置 libencode-locale-perl (1.03-1) ... 正在设置 libhttp-date-perl (6.02-1) ... 正在设置 libfile-listing-perl (6.04-1) ... 正在设置 libfont-afm-perl (1.20-1) ... 正在设置 libhtml-tagset-perl (3.20-2) ... 正在设置 libhtml-parser-perl (3.71-1build1) ... 正在设置 libio-html-perl (1.00-1) ... 正在设置 liblwp-mediatypes-perl (6.02-1) ... 正在设置 libhttp-message-perl (6.06-1) ... 正在设置 libhtml-form-perl (6.03-1) ... 正在设置 libhtml-tree-perl (5.03-1) ... 正在设置 libhtml-format-perl (2.11-1) ... 正在设置 libhttp-cookies-perl (6.00-2) ... 正在设置 libhttp-daemon-perl (6.01-1) ... 正在设置 libhttp-negotiate-perl (6.00-2) ... 正在设置 libintl-perl (1.23-1build1) ... 正在设置 libnet-http-perl (6.06-1) ... 正在设置 libwww-robotrules-perl (6.01-1) ... 正在设置 libtext-unidecode-perl (0.04-2) ... 正在设置 libxml-namespacesupport-perl (1.11-1) ... 正在设置 libxml-sax-base-perl (1.07-1) ... 正在设置 libxml-sax-perl (0.99+dfsg-2ubuntu1) ... update-perl-sax-parsers: Registering Perl SAX parser XML::SAX::PurePerl with priority 10... update-perl-sax-parsers: Updating overall Perl SAX parser modules info file... Creating config file /etc/perl/XML/SAX/ParserDetails.ini with new version 正在设置 libxml-libxml-perl (2.0108+dfsg-1ubuntu0.1) ... update-perl-sax-parsers: Registering Perl SAX parser XML::LibXML::SAX::Parser with priority 50... update-perl-sax-parsers: Registering Perl SAX parser XML::LibXML::SAX with priority 50... update-perl-sax-parsers: Updating overall Perl SAX parser modules info file... Replacing config file /etc/perl/XML/SAX/ParserDetails.ini with new version 正在设置 texinfo (5.2.0.dfsg.1-2) ... Running mktexlsr. This may take some time. ... done. 正在设置 libwww-perl (6.05-2) ... 正在设置 liblwp-protocol-https-perl (6.04-2ubuntu0.1) ... 正在设置 libxml-parser-perl (2.41-1build3) ... 正在设置 libxml-sax-expat-perl (0.40-2) ... update-perl-sax-parsers: Registering Perl SAX parser XML::SAX::Expat with priority 50... update-perl-sax-parsers: Updating overall Perl SAX parser modules info file... Replacing config file /etc/perl/XML/SAX/ParserDetails.ini with new version rootroot@cm-System-Product-Name:/home/wwt/linux_r16/lichee$ rootroot@cm-System-Product-Name:/home/wwt/linux_r16/lichee$ rootroot@cm-System-Product-Name:/home/wwt/linux_r16/lichee$ ./build.sh http://blog.csdn.net/linuxarmsummary/article/details/12775457 msgfmt包错误 makeinfo 包错误 e.o -MD -MP -MF .deps/execute.Tpo -c -o execute.o execute.c /usr/bin/gcc -std=gnu99 -I. -O2 -I/home/wwt/linux_r16/lichee/out/sun8iw5p1/linux/common/buildroot/host/include -I/home/wwt/linux_r16/lichee/out/sun8iw5p1/linux/common/buildroot/host/usr/include -MT exitfail.o -MD -MP -MF .deps/exitfail.Tpo -c -o exitfail.o exitfail.c In file included from clean-temp.h:22:0, from clean-temp.c:23: ./stdio.h:456:1: error: 'gets' undeclared here (not in a function) _GL_WARN_ON_USE (gets, "gets is a security hole - use fgets instead"); ^ mv -f .deps/exitfail.Tpo .deps/exitfail.Po /usr/bin/gcc -std=gnu99 -I. -O2 -I/home/wwt/linux_r16/lichee/out/sun8iw5p1/linux/common/buildroot/host/include -I/home/wwt/linux_r16/lichee/out/sun8iw5p1/linux/common/buildroot/host/usr/include -MT fatal-signal.o -MD -MP -MF .deps/fatal-signal.Tpo -c -o fatal-signal.o fatal-signal.c mv -f .deps/c-ctype.Tpo .deps/c-ctype.Po /usr/bin/gcc -std=gnu99 -I. -O2 -I/home/wwt/linux_r16/lichee/out/sun8iw5p1/linux/common/buildroot/host/include -I/home/wwt/linux_r16/lichee/out/sun8iw5p1/linux/common/buildroot/host/usr/include -MT fd-safer-flag.o -MD -MP -MF .deps/fd-safer-flag.Tpo -c -o fd-safer-flag.o fd-safer-flag.c mv -f .deps/c-stack.Tpo .deps/c-stack.Po make[4]: *** [clean-temp.o] Error 1 make[4]: *** Waiting for unfinished jobs.... mv -f .deps/execute.Tpo .deps/execute.Po mv -f .deps/fd-safer-flag.Tpo .deps/fd-safer-flag.Po mv -f .deps/fatal-signal.Tpo .deps/fatal-signal.Po mv -f .deps/gl_avltree_oset.Tpo .deps/gl_avltree_oset.Po make[4]: Leaving directory `/home/wwt/linux_r16/lichee/out/sun8iw5p1/linux/common/buildroot/build/host-m4-1.4.15/lib' make[3]: *** [all] Error 2 make[3]: Leaving directory `/home/wwt/linux_r16/lichee/out/sun8iw5p1/linux/common/buildroot/build/host-m4-1.4.15/lib' make[2]: *** [all-recursive] Error 1 make[2]: Leaving directory `/home/wwt/linux_r16/lichee/out/sun8iw5p1/linux/common/buildroot/build/host-m4-1.4.15' make[1]: *** [all] 错误 2 make[1]:正在离开目录 `/home/wwt/linux_r16/lichee/out/sun8iw5p1/linux/common/buildroot/build/host-m4-1.4.15' make: *** [/home/wwt/linux_r16/lichee/out/sun8iw5p1/linux/common/buildroot/build/host-m4-1.4.15/.stamp_built] 错误 2 make:离开目录“/home/wwt/linux_r16/lichee/buildroot” ERROR: build buildroot Failed rootroot@cm-System-Product-Name:/home/wwt/linux_r16/lichee$ rootroot@cm-System-Product-Name:/home/wwt/linux_r16/lichee$ rootroot@cm-System-Product-Name:/home/wwt/linux_r16/lichee$ rootroot@cm-System-Product-Name:/home/wwt/linux_r16/lichee$ find . -name stdio.in.h ./out/sun8iw5p1/linux/common/buildroot/build/host-m4-1.4.15/lib/stdio.in.h rootroot@cm-System-Product-Name:/home/wwt/linux_r16/lichee$ rootroot@cm-System-Product-Name:/home/wwt/linux_r16/lichee$ rootroot@cm-System-Product-Name:/home/wwt/linux_r16/lichee$ Z:\home\wwt\linux_r16\lichee\out\sun8iw5p1\linux\common\buildroot\build\host-m4-1.4.15\lib\stdio.in.h // 2017/5/2 14:13 wenyuanbo add!!!! //_GL_WARN_ON_USE (gets, "gets is a security hole - use fgets instead"); #if defined(__GLIBC__) && !defined(__UCLIBC__) && !__GLIBC_PREREQ(2, 16) _GL_WARN_ON_USE (gets, "gets is a security hole - use fgets instead"); #endif http://www.cnblogs.com/hjj801006/p/3988220.html 'gets' undeclared here (not in a function) rootroot@cm-System-Product-Name:/home/wwt/linux_r16/lichee$ rootroot@cm-System-Product-Name:/home/wwt/linux_r16/lichee$ ./build.sh make[3]: Leaving directory `/home/wwt/linux_r16/lichee/out/sun8iw5p1/linux/common/buildroot/build/host-autoconf-2.65/lib' Making install in doc make[3]: Entering directory `/home/wwt/linux_r16/lichee/out/sun8iw5p1/linux/common/buildroot/build/host-autoconf-2.65/doc' restore=: && backupdir=".am$$" && \ am__cwd=`pwd` && CDPATH="${ZSH_VERSION+.}:" && cd . && \ rm -rf $backupdir && mkdir $backupdir && \ if (/bin/sh /home/wwt/linux_r16/lichee/out/sun8iw5p1/linux/common/buildroot/build/host-autoconf-2.65/build-aux/missing --run makeinfo --version) >/dev/null 2>&1; then \ for f in autoconf.info autoconf.info-[0-9] autoconf.info-[0-9][0-9] autoconf.i[0-9] autoconf.i[0-9][0-9]; do \ if test -f $f; then mv $f $backupdir; restore=mv; else :; fi; \ done; \ else :; fi && \ cd "$am__cwd"; \ if /bin/sh /home/wwt/linux_r16/lichee/out/sun8iw5p1/linux/common/buildroot/build/host-autoconf-2.65/build-aux/missing --run makeinfo --no-split -I . \ -o autoconf.info autoconf.texi; \ then \ rc=0; \ CDPATH="${ZSH_VERSION+.}:" && cd .; \ else \ rc=$?; \ CDPATH="${ZSH_VERSION+.}:" && cd . && \ $restore $backupdir/* `echo "./autoconf.info" | sed 's|[^/]*$||'`; \ fi; \ rm -rf $backupdir; exit $rc conftest.c:14625: must be after `@defmac' to use `@defmacx' make[3]: *** [autoconf.info] Error 1 make[3]: Leaving directory `/home/wwt/linux_r16/lichee/out/sun8iw5p1/linux/common/buildroot/build/host-autoconf-2.65/doc' make[2]: *** [install-recursive] Error 1 make[2]: Leaving directory `/home/wwt/linux_r16/lichee/out/sun8iw5p1/linux/common/buildroot/build/host-autoconf-2.65' make[1]: *** [install] 错误 2 make[1]:正在离开目录 `/home/wwt/linux_r16/lichee/out/sun8iw5p1/linux/common/buildroot/build/host-autoconf-2.65' make: *** [/home/wwt/linux_r16/lichee/out/sun8iw5p1/linux/common/buildroot/build/host-autoconf-2.65/.stamp_host_installed] 错误 2 make:离开目录“/home/wwt/linux_r16/lichee/buildroot” ERROR: build buildroot Failed rootroot@cm-System-Product-Name:/home/wwt/linux_r16/lichee$ rootroot@cm-System-Product-Name:/home/wwt/linux_r16/lichee$ find . -name autoconf.texi ./out/sun8iw5p1/linux/common/buildroot/build/host-autoconf-2.65/doc/autoconf.texi rootroot@cm-System-Product-Name:/home/wwt/linux_r16/lichee$ Z:\home\wwt\linux_r16\lichee\out\sun8iw5p1\linux\common\buildroot\build\host-autoconf-2.65\doc\autoconf.texi @r{[}@var{\varname\}@r{]}@c (修改为:) @r{[}@var{\varname\}@r{]} @r{[}@var{\varname\} = @samp{\default\}@r{]}@c (修改为:) @r{[}@var{\varname\} = @samp{\default\}@r{]} http://blog.csdn.net/laohuang1122/article/details/44098291/ Ubuntu14.04编译Allwinner lichee 两个出错解决方法 rootroot@cm-System-Product-Name:/home/wwt/linux_r16/lichee$ rootroot@cm-System-Product-Name:/home/wwt/linux_r16/lichee$ ./build.sh libtool: install: ranlib /home/wwt/linux_r16/lichee/out/sun8iw5p1/linux/common/buildroot/host/usr/lib/libfakeroot.a libtool: finish: PATH="/home/wwt/linux_r16/lichee/out/sun8iw5p1/linux/common/buildroot/host/bin:/home/wwt/linux_r16/lichee/out/sun8iw5p1/linux/common/buildroot/host/usr/bin:/home/wwt/linux_r16/lichee/out/sun8iw5p1/linux/common/buildroot/external-toolchain/bin:/usr/local/sbin:/usr/local/bin:/usr/sbin:/usr/bin:/sbin:/bin:/usr/games:/usr/local/games:/home/cm/cm/R58/r58_new20161012/android/prebuilts/gcc/linux-x86/arm/arm-linux-androideabi-4.7/arm-linux-androideabi/bin:/home/cm/cm/R58/r58_new20161012/android/prebuilts/gcc/linux-x86/arm/arm-linux-androideabi-4.7/bin:/opt/jdk1.6.0_45/bin:/opt/jdk1.6.0_45/jre/bin:/sbin" ldconfig -n /home/wwt/linux_r16/lichee/out/sun8iw5p1/linux/common/buildroot/host/usr/lib ---------------------------------------------------------------------- Libraries have been installed in: /home/wwt/linux_r16/lichee/out/sun8iw5p1/linux/common/buildroot/host/usr/lib If you ever happen to want to link against installed libraries in a given directory, LIBDIR, you must either use libtool, and specify the full pathname of the library, or use the `-LLIBDIR' flag during linking and do at least one of the following: - add LIBDIR to the `LD_LIBRARY_PATH' environment variable during execution - add LIBDIR to the `LD_RUN_PATH' environment variable during linking - use the `-Wl,-rpath -Wl,LIBDIR' linker flag - have your system administrator add LIBDIR to `/etc/ld.so.conf' See any operating system documentation about shared libraries for more information, such as the ld(1) and ld.so(8) manual pages. ---------------------------------------------------------------------- test -z "/home/wwt/linux_r16/lichee/out/sun8iw5p1/linux/common/buildroot/host/usr/bin" || /bin/mkdir -p "/home/wwt/linux_r16/lichee/out/sun8iw5p1/linux/common/buildroot/host/usr/bin" /bin/sh ./libtool --mode=install /usr/bin/install -c 'faked' '/home/wwt/linux_r16/lichee/out/sun8iw5p1/linux/common/buildroot/host/usr/bin/faked' libtool: install: /usr/bin/install -c faked /home/wwt/linux_r16/lichee/out/sun8iw5p1/linux/common/buildroot/host/usr/bin/faked make[3]:正在离开目录 `/home/wwt/linux_r16/lichee/out/sun8iw5p1/linux/common/buildroot/build/host-fakeroot-1.9.5' make[2]:正在离开目录 `/home/wwt/linux_r16/lichee/out/sun8iw5p1/linux/common/buildroot/build/host-fakeroot-1.9.5' make[1]:正在离开目录 `/home/wwt/linux_r16/lichee/out/sun8iw5p1/linux/common/buildroot/build/host-fakeroot-1.9.5' rm -rf /home/wwt/linux_r16/lichee/out/sun8iw5p1/linux/common/buildroot/build/host-makedevs mkdir /home/wwt/linux_r16/lichee/out/sun8iw5p1/linux/common/buildroot/build/host-makedevs cp package/makedevs/makedevs.c /home/wwt/linux_r16/lichee/out/sun8iw5p1/linux/common/buildroot/build/host-makedevs cc -Wall -Werror -O2 /home/wwt/linux_r16/lichee/out/sun8iw5p1/linux/common/buildroot/build/host-makedevs/makedevs.c -o /home/wwt/linux_r16/lichee/out/sun8iw5p1/linux/common/buildroot/build/host-makedevs/makedevs /home/wwt/linux_r16/lichee/out/sun8iw5p1/linux/common/buildroot/build/host-makedevs/makedevs.c: In function ‘main’: /home/wwt/linux_r16/lichee/out/sun8iw5p1/linux/common/buildroot/build/host-makedevs/makedevs.c:374:6: error: variable ‘ret’ set but not used [-Werror=unused-but-set-variable] int ret = EXIT_SUCCESS; ^ cc1: all warnings being treated as errors make: *** [/home/wwt/linux_r16/lichee/out/sun8iw5p1/linux/common/buildroot/build/host-makedevs/makedevs] 错误 1 make:离开目录“/home/wwt/linux_r16/lichee/buildroot” ERROR: build rootfs Failed rootroot@cm-System-Product-Name:/home/wwt/linux_r16/lichee$ rootroot@cm-System-Product-Name:/home/wwt/linux_r16/lichee$ find . -name makedevs.c ./buildroot/package/makedevs/makedevs.c ./out/sun8iw5p1/linux/common/buildroot/build/host-makedevs/makedevs.c ./out/sun8iw5p1/linux/common/buildroot/build/busybox-1.18.3/miscutils/makedevs.c rootroot@cm-System-Product-Name:/home/wwt/linux_r16/lichee$ http://blog.csdn.net/laohuang1122/article/details/44098291/ Ubuntu14.04编译Allwinner lichee 两个出错解决方法 rootroot@cm-System-Product-Name:/home/wwt/linux_r16/lichee$ rootroot@cm-System-Product-Name:/home/wwt/linux_r16/lichee$ ./build.sh /local/bin:/usr/sbin:/usr/bin:/sbin:/bin:/usr/games:/usr/local/games:/home/cm/cm/R58/r58_new20161012/android/prebuilts/gcc/linux-x86/arm/arm-linux-androideabi-4.7/arm-linux-androideabi/bin:/home/cm/cm/R58/r58_new20161012/android/prebuilts/gcc/linux-x86/arm/arm-linux-androideabi-4.7/bin:/opt/jdk1.6.0_45/bin:/opt/jdk1.6.0_45/jre/bin"" >> /home/wwt/linux_r16/lichee/out/sun8iw5p1/linux/common/buildroot/build/_fakeroot.fs chmod a+x /home/wwt/linux_r16/lichee/out/sun8iw5p1/linux/common/buildroot/build/_fakeroot.fs /home/wwt/linux_r16/lichee/out/sun8iw5p1/linux/common/buildroot/host/usr/bin/fakeroot -- /home/wwt/linux_r16/lichee/out/sun8iw5p1/linux/common/buildroot/build/_fakeroot.fs rootdir=/home/wwt/linux_r16/lichee/out/sun8iw5p1/linux/common/buildroot/target table='target/generic/device_table.txt' Warning: skip syncing -d /home/wwt/linux_r16/lichee/out/sun8iw5p1/linux/common/buildroot/target /home/wwt/linux_r16/lichee/out/sun8iw5p1/linux/common/buildroot/images/rootfs.ext4 -N 1399 -b 42633 tune2fs 1.42.9 (4-Feb-2014) Creating journal inode: 完成 This filesystem will be automatically checked every 20 mounts or 0 days, whichever comes first. Use tune2fs -c or -i to override. e2fsck 1.42.9 (4-Feb-2014) 文件系统缺少UUID;正在生成一个。 Adding dirhash hint to 文件系统. /home/wwt/linux_r16/lichee/out/sun8iw5p1/linux/common/buildroot/images/rootfs.ext4: clean, 1009/1440 files, 38102/42633 blocks busybox directfb directfb-examples divine dosfstools e2fsprogs ethtool ext4-utils freetype fsck-msdos fuse-exfat libfuse i2c-tools input-tools iostat iperf iw jpeg libnl libpcap libpng memstat memtester ntfs-3g openssh openssl portmap strace stress sysstat szrz tcpdump tiobench tslib udev which wireless_tools wpa_supplicant zlib target-generic-hostname target-generic-issue target-generic-getty-busybox target-finalize target-purgelocales /home/wwt/linux_r16/lichee/out/sun8iw5p1/linux/common/buildroot/host/bin:/home/wwt/linux_r16/lichee/out/sun8iw5p1/linux/common/buildroot/host/usr/bin:/home/wwt/linux_r16/lichee/out/sun8iw5p1/linux/common/buildroot/host/usr/sbin/:/home/wwt/linux_r16/lichee/out/sun8iw5p1/linux/common/buildroot/external-toolchain/bin:/usr/local/sbin:/usr/local/bin:/usr/sbin:/usr/bin:/sbin:/bin:/usr/games:/usr/local/games:/home/cm/cm/R58/r58_new20161012/android/prebuilts/gcc/linux-x86/arm/arm-linux-androideabi-4.7/arm-linux-androideabi/bin:/home/cm/cm/R58/r58_new20161012/android/prebuilts/gcc/linux-x86/arm/arm-linux-androideabi-4.7/bin:/opt/jdk1.6.0_45/bin:/opt/jdk1.6.0_45/jre/bin make:离开目录“/home/wwt/linux_r16/lichee/buildroot” INFO: build rootfs OK. INFO: ---------------------------------------- INFO: build lichee OK. INFO: ---------------------------------------- rootroot@cm-System-Product-Name:/home/wwt/linux_r16/lichee$ rootroot@cm-System-Product-Name:/home/wwt/linux_r16/lichee$ rootroot@cm-System-Product-Name:/home/wwt/linux_r16/lichee$ ./build.sh pack INFO: packing firmware ... copying tools file copying configs file ./out/aultls32.fex ./out/aultools.fex ./out/cardscript.fex ./out/cardtool.fex ./out/diskfs.fex ./out/env_burn.cfg ./out/env.cfg ./out/image.cfg "./out/image_linux.cfg" -> "./out/image.cfg" ./out/split_xxxx.fex ./out/sys_config.fex ./out/sys_partition_dragonboard.fex ./out/sys_partition_dump.fex ./out/sys_partition.fex "./out/sys_partition_linux.fex" -> "./out/sys_partition.fex" ./out/sys_partition_private.fex ./out/sys_partition_tina.fex ./out/test_config.fex ./out/usbtool.fex ./out/usbtool_test.fex copying boot resource copying boot file packing for linux normal /home/wwt/linux_r16/lichee/tools/pack/pctools/linux/eDragonEx/ /home/wwt/linux_r16/lichee/tools/pack/out Begin Parse sys_partion.fex Add partion boot-resource.fex BOOT-RESOURCE_FEX Add partion very boot-resource.fex BOOT-RESOURCE_FEX FilePath: boot-resource.fex FileLength=453400Add partion env.fex ENV_FEX000000000 Add partion very env.fex ENV_FEX000000000 FilePath: env.fex FileLength=20000Add partion boot.fex BOOT_FEX00000000 Add partion very boot.fex BOOT_FEX00000000 FilePath: boot.fex FileLength=c5a000Add partion rootfs.fex ROOTFS_FEX000000 Add partion very rootfs.fex ROOTFS_FEX000000 FilePath: rootfs.fex FileLength=29a2400sys_config.fex Len: 0xf450 config.fex Len: 0x9ac8 split_xxxx.fex Len: 0x200 sys_partition.fex Len: 0xa80 boot0_nand.fex Len: 0x8000 boot0_sdcard.fex Len: 0x8000 u-boot.fex Len: 0xc4000 fes1.fex Len: 0x1fc0 usbtool.fex Len: 0x23000 aultools.fex Len: 0x26ead aultls32.fex Len: 0x238dd cardtool.fex Len: 0x14000 cardscript.fex Len: 0x6ea sunxi_mbr.fex Len: 0x10000 dlinfo.fex Len: 0x4000 arisc.fex Len: 0x2ed88 vmlinux.fex Len: 0x2c78baa boot-resource.fex Len: 0x453400 Vboot-resource.fex Len: 0x4 env.fex Len: 0x20000 Venv.fex Len: 0x4 boot.fex Len: 0xc5a000 Vboot.fex Len: 0x4 rootfs.fex Len: 0x29a2400 Vrootfs.fex Len: 0x4 BuildImg 0 Dragon execute image.cfg SUCCESS ! ----------image is at---------- /home/wwt/linux_r16/lichee/tools/pack/sun8iw5p1_linux_evb-30_uart0.img pack finish rootroot@cm-System-Product-Name:/home/wwt/linux_r16/lichee$
Linux下安装Android Studio Bumblebee:从KVM加速到SDK配置全攻略
在Linux上进行Android开发,环境搭建的成败往往取决于基础组件是否配置得当。KVM作为Linux内核级虚拟化方案,是模拟器流畅运行的关键技术,其原理是通过硬件辅助虚拟化提升执行效率。Gradle作为Android构建系统的核心,其版本与JDK的匹配程度直接影响编译成功率和速度。SDK工具链的完整性和许可配置,则决定了项目能否顺利编译与调试。这些概念共同构成了Linux Android开发的基础设施,适用于日常开发、自动化测试及CI/CD等场景。本文围绕这些底层技术讲解,结合Android Studi


