Linux Opencv编译提示找不到list [问题点数:20分]

Bbs1
本版专家分:0
结帖率 87.5%
Bbs1
本版专家分:0
Bbs1
本版专家分:0
Bbs1
本版专家分:0
Bbs1
本版专家分:0
Bbs1
本版专家分:20
Bbs1
本版专家分:0
linux 中OpenCV 的编译
linux下<em>Opencv</em>的简单程序:rn[code=C/C++]rn#include "highgui.h"rnusing namespace cv;rnrnint main (int argc, char const* argv[])rnrn Mat src;rn src=imread("lena.jpg");rn namedWindow("src");rn imshow("src",src);rn waitKey(0);rn return 0;rnrn[/code]rn<em>编译</em>方法:rn1、 g++ test.cpp `pkg-config opencv --libs --cflags opencv` <em>编译</em>没问题,正确。也能够执行rn2、 g++ `pkg-config opencv --libs --cflags opencv` test.cpp <em>编译</em>错误,不成功。rn错误<em>提示</em>:rnrntmp/ccI1amzW.o: In function `main':rntest.cpp:(.text+0x5e): undefined reference to `cv::imread(std::basic_string, std::allocator > const&, int)'rntest.cpp:(.text+0xcf): undefined reference to `cv::namedWindow(std::basic_string, std::allocator > const&, int)'rntest.cpp:(.text+0xfa): undefined reference to `cv::_InputArray::_InputArray(cv::Mat const&)'rntest.cpp:(.text+0x131): undefined reference to `cv::imshow(std::basic_string, std::allocator > const&, cv::_InputArray const&)'rntest.cpp:(.text+0x153): undefined reference to `cv::waitKey(int)'rn/tmp/ccI1amzW.o: In function `cv::Mat::~Mat()':rntest.cpp:(.text._ZN2cv3MatD2Ev[_ZN2cv3MatD5Ev]+0x2b): undefined reference to `cv::fastFree(void*)'rn/tmp/ccI1amzW.o: In function `cv::Mat::operator=(cv::Mat const&)':rntest.cpp:(.text._ZN2cv3MataSERKS0_[cv::Mat::operator=(cv::Mat const&)]+0xf2): undefined reference to `cv::Mat::copySize(cv::Mat const&)'rn/tmp/ccI1amzW.o: In function `cv::Mat::release()':rntest.cpp:(.text._ZN2cv3Mat7releaseEv[cv::Mat::release()]+0x3b): undefined reference to `cv::Mat::deallocate()'rncollect2: ld 返回 1rnrn请指点。
linux 中OpenCV 的编译
linux下<em>Opencv</em>的简单程序:rnC/C++ codern[code=C/C++]rn#include "highgui.h"rnusing namespace cv;rnrnint main (int argc, char const* argv[])rnrn Mat src;rn src=imread("lena.jpg");rn namedWindow("src");rn imshow("src",src);rn waitKey(0);rn return 0;rnrn[/code]rnrn<em>编译</em>方法:rn1、 g++ test.cpp `pkg-config opencv --libs --cflags opencv` <em>编译</em>没问题,正确。也能够执行rn2、 g++ `pkg-config opencv --libs --cflags opencv` test.cpp <em>编译</em>错误,不成功。rn错误<em>提示</em>:rnrntmp/ccI1amzW.o: In function `main':rntest.cpp:(.text+0x5e): undefined reference to `cv::imread(std::basic_string, std::allocator > const&, int)'rntest.cpp:(.text+0xcf): undefined reference to `cv::namedWindow(std::basic_string, std::allocator > const&, int)'rntest.cpp:(.text+0xfa): undefined reference to `cv::_InputArray::_InputArray(cv::Mat const&)'rntest.cpp:(.text+0x131): undefined reference to `cv::imshow(std::basic_string, std::allocator > const&, cv::_InputArray const&)'rntest.cpp:(.text+0x153): undefined reference to `cv::waitKey(int)'rn/tmp/ccI1amzW.o: In function `cv::Mat::~Mat()':rntest.cpp:(.text._ZN2cv3MatD2Ev[_ZN2cv3MatD5Ev]+0x2b): undefined reference to `cv::fastFree(void*)'rn/tmp/ccI1amzW.o: In function `cv::Mat::operator=(cv::Mat const&)':rntest.cpp:(.text._ZN2cv3MataSERKS0_[cv::Mat::operator=(cv::Mat const&)]+0xf2): undefined reference to `cv::Mat::copySize(cv::Mat const&)'rn/tmp/ccI1amzW.o: In function `cv::Mat::release()':rntest.cpp:(.text._ZN2cv3Mat7releaseEv[cv::Mat::release()]+0x3b): undefined reference to `cv::Mat::deallocate()'rncollect2: ld 返回 1rnrn请指点。
针对arm,opencv编译完成后执行时提示不到库情况;
针对arm,opencv<em>编译</em>完成后执行时<em>提示</em><em>找</em><em>不到</em>库情况; Shared library: [../../lib/libopencv_core.so]解决办法 1.配置好<em>编译</em>器等路径; 2.进入opencv ,新建build目录,然后vi toolchain.cmake; 3.拷贝如下: set( CMAKE_SYSTEM_NAME <em>Linux</em> )   set( CMAKE_SYSTE
在运行darknet.sln时出现opencv2/highgui/highgui_c.h: No such file or directory
首先确认darknet.sln是Release且x64运行的 其次,查看下工程属性(解决方案资源管理器——》darknet——》右键——》属性): C/C++——》常规——》附加包含目录:将你下载好的opencv目录放进来,我的是D:\YOLOv3\opencv340\opencv\build\include 链接器——》常规——》附加库目录:我的是D:\YOLOv3\opencv340\open...
darknet-yolov3中python接口中image传输w和h的过程
首先,python接口darknet.py中detect函数如下: def detect(net, meta, image, thresh=.5, hier_thresh=.5, nms=.45): im = load_image(image, 0, 0) num = c_int(0) pnum = pointer(num) predict_image(net,...
[MO]opencv包含头文件出错的粗略解读
<em>Opencv</em>新手遇到的问题很多问题之一就是#include opencv头文件的时候经常会出错。程序明明就很简单,一个稍懂opencv的人都知道程序没有错误,但是一<em>编译</em>就是一大堆错误,就是<em>找</em><em>不到</em>头文件。 fatal error C1083: 无法打开包括文件:“cv.h”: N
caffe编译提示opencv错误
在<em>编译</em>caffe的时候,<em>提示</em>如下的opencv错误: 这个错误其实在<em>编译</em>caffe的时候经常会有遇到,解决的办法非常简单,在Makefile.config中修改配置文件 这类小问题分享出来,希望给新手一些帮助。
G++ 编译提示不到头文件
G++ <em>编译</em><em>提示</em><em>找</em><em>不到</em>头文件 可是头文件明明就和CPP文件在同一文件夹下 。rn图示如下rn[img=http://img.my.csdn.net/uploads/201204/10/1334039114_1508.jpg][/img]
求救:编译提示不到PCH文件
按书上例子建立工程制作对话框,完后<em>编译</em><em>提示</em>说<em>找</em><em>不到</em>.pch文件,rn请问是什么原因?如何解决? 谢谢!rn
编译提示 不到 pkfuncs.h 文件
谁有此文件,能传给我一个么?rn据说这个文件在 platform builder里有,一般的sdk里不包含, 可是连platform builder的下载都很难<em>找</em>rnrn请发到 yuedong_2008@hotmail.com 谢谢rn
jthread-1.3.1编译提示不到configure???
a.从http://research.edm.uhasselt.be下载jthread-1.3.1.ziprnb.解压缩,进入jthread-1.3.1目录,目录文件如下:rn ChangeLog cmake CMakeLists.txt doc LICENSE.MIT pkgconfig README.TXT src TODOrn rnc.按教程,执行./configure发现,<em>提示</em>错误:rn -bash: ./configure: 没有那个文件或目录rnrnd.检查发现在目录下没有configure命令?rnrn奇怪大家文档都说简单的:rn ./configurern ./makern ./make installrnrn怎么到我这,./configure就不行呢??
linux编译动态&静态opencv
动态:               mkdir build_shared               cd build_shared               cmake ..               make               sudo make install        静态:               mkdir build_static
Linux编译opencv程序
在linux上<em>编译</em>opencv的方法大致有两种,一种是直接按照c/c++程序那样在命令行<em>编译</em>,只是在<em>编译</em>时要包含进opencv动态链接库.另一种是用Cmake的方法.命令行:zoegreen@zoegreen-Lenovo-IdeaPad-Y470:~/robot$ g++ test.cpp -o test `pkg-config --cflags --libs opencv`这里我们用到了一个工具
Anaconda下python安装opencv提示不到指定的模块
在Anaconda下安装opencv库的时候,<em>提示</em>Traceback most recent call last File stdin line 1 in module ImportError:DLL load failed:<em>找</em><em>不到</em>指定的模块。百度一下会发现很多同学遇到这样的问题,同样我也遇到了。 1,首先确保有vs环境:Visual C++ Redistributable for Visual...
Cmake编译opencv不到QT_QMAKE_EXECUTABLE选项
Qt 5.9.0rn<em>Opencv</em> 3.4.0rnCMake<em>编译</em>就是<em>找</em><em>不到</em>QT_QMAKE_EXECUTABLE选项,求高手指点rn[img=https://img-bbs.csdn.net/upload/201801/30/1517287541_489153.png][/img]
win7 cmake 编译 opencv 提示变量未定义
如图所示:rnrn[img=https://img-bbs.csdn.net/upload/201609/09/1473427422_525387.jpg][/img]rnrn[img=https://img-bbs.csdn.net/upload/201609/09/1473427490_94806.jpg][/img]rnrn[img=https://img-bbs.csdn.net/upload/201609/09/1473427584_955586.jpg][/img]
list在codeblocks和vs2013中编译提示不同
代码如下: #include #include using namespace std; int main(void) { <em>list</em> l; for (int i = 0; i < 4; i++) { l.push_back(i); } <em>list</em>::iterator it = l.begin(); it--; return 0; } 在codeblocks下<em>编译</em>
程序编译提示不到头文件的解决方法
在编写的源程序中,使用cmake进行<em>编译</em>,<em>提示</em>OpenNI.h:no such file or directory 我安装的openNI安装在/opt目录下,在home目录下的.bashrc文件中已经添加了系统环境变量 export OPENNI2_INCLUDE=”/opt/OpenNI/OpenNI-<em>Linux</em>-x64-2.2/Include” export OPENNI2_REDIS
提示不到文件,但是编译通过。。。
1.<em>提示</em><em>找</em><em>不到</em>文件,但是<em>编译</em>通过。一般是配置工程时,头文件路径没有定义完整。 2.在keil左侧的项目管理中鼠标右键单击该文件并选择“Options for File &quot;xxx.c&quot;”,然后在对话框中勾选“include in target build”,要让其对勾变为黑色,默认是灰色。然后再<em>编译</em>即可。                                              ...
编译WCE工程时提示不到SHMENUBARINFO
rt,请问可能是什么原因?rn我用的是evc 4.0 sp3.
编译servlet类总是提示不到包???
<em>编译</em>servlet类总是<em>提示</em><em>找</em><em>不到</em>包!!!!????rn可是我已经将Tomcat\common\lib\servlet.jar包含在CLASSPATH中了啊???rn为什么还是不行呢????
有dcu文件,编译提示不到pas
<em>编译</em>别人的程式<em>提示</em><em>找</em><em>不到</em>pas文件,有dcu文件rn能正常<em>编译</em>吗?rn
为什么vc2008编译提示不到msvcr90d.dll
网上下载的例子,libusb-win32-src-1.1.14.0,debug,release下都<em>提示</em>这个错误,很多网上的解决方法都试过了,好像都不行,再次请教
Fedora20下编译vlc时,提示不到live555
在Fedora20下,其实我已经将vlc播放器<em>编译</em>成功了,但是跑起来后才发现是不支持播放rtsp网络流的。后来去看了下./configure时的日志,发现<em>提示</em>"No package 'live555'",我觉得跟这个有关系。rn所以我又下载并安装了live555,但是这个安装过程并不会安装.pc文件(事实上源码中也不存在*.pc文件,我已经搜索过了)。rnrn所以在<em>编译</em>vlc时,执行"./configure ...."时还是<em>提示</em>"No package 'live555'",我知道是因为在PKG_CONFIG_PATH所指的路径中未<em>找</em>到相关的*.pc文件,但是这个live555安装时就是没有.pc文件,那我又怎么办呢,难道手工建立?rnrn希望做过这个工作的朋友能提供点思路,还是我的live555版本的问题呢?我下的版本是http://www.live555.com/liveMedia/public/live555-latest.tar.gz,应该算是最新版了。我另外也看过去年下过的一个版本,也是没有.pc文件的。rnrnPS: 我<em>编译</em>vlc时已经成功安装了qt4, qt4-devel, ffmpeg, live555等依赖库!rnrnrn
编译symbian程序提示smsetdlg.h不到
这个需要一些头文件smsetdlg.h等,网上的下载地址已经失效了~~rnrn哪位朋友有这个的包,能给我个下载地址~~rnrn谢谢~~
一进行编译提示不到dll?
我用的是C++Builder 6.0,一进行<em>编译</em>就<em>提示</em><em>找</em><em>不到</em>borlndmm.dll,但我用搜索却能在C++Builder的CBuilder6\Bin目录内搜到,请问这是怎么回事?有没有什么解决的方法?
C++Builder 2007编译的时候提示不到STLPMT.LIB
完整的log是 [ILINK32 Error] Fatal: Unable to open file 'STLPMT.LIB'rn请问该如何解决啊rn请达人帮忙
include一个.h文件,编译提示不到.
一个别人写的工程,目录结构如下:rn/──────────────rn├─includern│ └─ortprn│ └─ortp.hrn└─srcrn └─testsrn ├─win_receiverrn │ └─RTPReceiver.cpprnrn在RTPReceiver.cpp文件中有以下语句:#includern用vs2005<em>编译</em>,为何<em>提示</em><em>找</em><em>不到</em>这个头文件?rnrn是不是需要在一些地方设置?
编译好的可执行文件提示 nmfast.bpl 不到??????
<em>编译</em>好的可执行文件<em>提示</em> nmfast.bpl <em>找</em><em>不到</em>??????可是我哪里都<em>找</em><em>不到</em>这个包文件??谁知道这是那个控件的包文件???rnrnrn谢谢了!rn
windows 下makefile 编译提示不到头文件怎么办?
我的一个cpp里#include,<em>编译</em>的时候<em>提示</em>:rnfatal error C1083: Cannot open include file: 'windows.h': No such file or directory,rnrn这个头文件已经包含在环境路径里了,nmake不会自己<em>找</em>吗?rnrn我又如何能让它<em>找</em>到这个文件呢?
CMake 编译项目时提示不到依赖项
<em>编译</em>项目时使用 CMake,当<em>编译</em>复杂时也容易出错,因此记录下以便后续参考: 项目 quic 基本情况: quic 依赖 boringssl 的 ssl、crypto 等,因此在 quic 的 CMakeLists.txt 中添加: add_subdirectory( relative/path/to/boringssl ) add_library( ... $&amp;amp;amp;lt;TARGET_O...
c++编译提示:系统不到指定路径
一、      错误:系统<em>找</em><em>不到</em>制定文件 原因分析:<em>编译</em>成功后,要启动之前编好的*.exe程序,系统<em>找</em><em>不到</em>路径,所以<em>提示</em>路径出错。   解决办法步骤: 1.1在工程Properities属性打开,如图1 1.2依次点击Configuration Properties——General——Ouput Directory 在Gerneral选项中的Ouput Dir
编译android源码,提示不到arm-linux-androideabi-gcc.
我是这样<em>编译</em>的:rnroot@mimixi666-virtual-machine:/my/source/android4.0# make initrn但是出错rnrn[color=#FF0000]/bin/bash: prebuilt/linux-x86/toolchain/arm-linux-androideabi-4.4.x/bin/arm-linux-rnandroideabi-gcc: 没有那个文件或目录rn/bin/bash: prebuilt/linux-x86/toolchain/arm-linux-androideabi-4.4.x/bin/arm-linux-rnandroideabi-gcc: 没有那个文件或目录rn/bin/bash: prebuilt/linux-x86/toolchain/arm-linux-androideabi-4.4.x/bin/arm-linux-rnandroideabi-gcc: 没有那个文件或目录rn/bin/bash: bison: 未<em>找</em>到命令[/color]============================================rnPLATFORM_VERSION_CODENAME=RELrnPLATFORM_VERSION=4.0.1rnTARGET_PRODUCT=fullrnTARGET_BUILD_VARIANT=engrnTARGET_BUILD_TYPE=releasernTARGET_BUILD_APPS=rnTARGET_ARCH=armrnTARGET_ARCH_VARIANT=armv7-arnHOST_ARCH=x86rnHOST_OS=linuxrnHOST_BUILD_TYPE=releasernBUILD_ID=ITL41Drn============================================rnprebuilt/linux-x86/toolchain/arm-linux-androideabi-4.4.x/bin/arm-linux-androideabi-gcc -rnmthumb-interwork -Ibionic/libc/private -DCRT_LEGACY_WORKAROUND -Ibionic/libc/private -o rnout/target/product/generic/obj/lib/crtbegin_static.o -c bionic/libc/arch-rnarm/bionic/crtbegin_static.Srn/bin/bash: prebuilt/linux-x86/toolchain/arm-linux-androideabi-4.4.x/bin/arm-linux-rnandroideabi-gcc: 没有那个文件或目录rnmake: *** [out/target/product/generic/obj/lib/crtbegin_static.o] 错误 [url=]127[/url]rn[color=#FF0000]rn但是下面明明有吖。。[/color]root@mimixi666-virtual-machine:/my/source/android4.0/prebuilt/linux-x86/toolchain/arm-rnlinux-androideabi-4.4.x/bin# lsrnarm-linux-androideabi-addr2line arm-linux-androideabi-gprofrnarm-linux-androideabi-ar arm-linux-androideabi-ldrnarm-linux-androideabi-as arm-linux-androideabi-ld.bfdrnarm-linux-androideabi-c++ arm-linux-androideabi-ld.goldrnarm-linux-androideabi-c++filt arm-linux-androideabi-nmrnarm-linux-androideabi-cpp arm-linux-androideabi-objcopyrnarm-linux-androideabi-g++ arm-linux-androideabi-objdumprn[color=#FF0000]arm-linux-androideabi-gcc[/color] arm-linux-androideabi-ranlibrnarm-linux-androideabi-gcc-4.4.3 arm-linux-androideabi-readelfrnarm-linux-androideabi-gccbug arm-linux-androideabi-runrnarm-linux-androideabi-gcov arm-linux-androideabi-sizernarm-linux-androideabi-gdb arm-linux-androideabi-stringsrnarm-linux-androideabi-gdbtui arm-linux-androideabi-striprnrn到底哪里错了??rn和我系统有关系吗??rn我是64位的虚拟机ubuntu的,而镜像也是64位的。。rnrn
编译java文件的时候提示不到“import javax.servlet.ServletConfig”
我的classpath的配置rn.;c:\j2sdk1.4.0-rc\bin;c:\j2sdk1.4.0-rc\lib\tools.jar;c:\j2sdk1.4.0-rc\lib\dt.jar;c:\j2sdk1.4.0-rc\lib\servlet.jar;rnrn高手解决!!!!!!!!!!!!!!
delphi xe10 编译提示armlinuxandroideabild.exe不到
[img=https://img-bbs.csdn.net/upload/201512/25/1451015128_424597.png][/img]rnrn[DCC Error] E2597 D:\DelphiXE10\RADStudio10\RADStudio10\Extra\PlatformSDKs\android-ndk-r9c\toolchains\arm-linux-androideabi-4.6\prebuilt\windows\bin\arm-linux-androideabi-ld.exe: error: cannot find -lgnustl_staticrnrnrn<em>编译</em>xe10项目时,<em>提示</em>这个文件<em>找</em><em>不到</em>,但是这个路径下是有这个文件的。求大神解答。。这是为什么。。怎么解决啊?!
dos编译Java程序时提示不到符号”
其实就是类名、方法名等写错了,仔细检查一下。。。
EnumProcesses(),编译的时候提示不到Psapi.h??????
BOOL EnumProcesses(rn DWORD* lpidProcess,rn DWORD cb,rn DWORD* cbNeededrn);rnrn这个函数需要Psapi.h,但是我<em>找</em>遍vc目录都没有呀,是不是我还有什么没有安装呀??rn
编译过滤器类,提示不到类?
E:\j2sdk1.4.2\librn有servlet.jar2.2rn<em>编译</em>时说赵<em>不到</em>类,为什么?
为什么编译不了?提示不到bao包.
请问各位大侠,在servlet文件中有spring bao.jar包.为什么<em>编译</em>不了?<em>提示</em><em>找</em><em>不到</em>bao包.rn是要在系统变量中加入什么吗?我下了整个spring framekwork就是知要放到哪?rnpackage servlet;rnrnimport java.io.IOException;rnimport java.io.PrintWriter;rnimport java.util.Date;rnrnimport javax.servlet.ServletException;[color=#FF0000][/color]rnimport javax.servlet.http.HttpServlet;rnimport javax.servlet.http.HttpServletRequest;rnimport javax.servlet.http.HttpServletResponse;rnrn[color=#FF0000]import dao.DataCourse;[/color]rnrnrnpublic class AddCourseForm extends HttpServlet rnrn /**rn * Destruction of the servlet. rn */rn public void destroy() rn super.destroy();
编译Wince6.0内核,提示不到soc_cfg.h
如题,我用s3c6410的板子,<em>编译</em>Wince6.0内核的时候,有如下错误信息:rn BUILD: [01:0000000149:ERRORE] c:\wince600\platform\smdk6410\src\inc\bsp_cfg.h(20) : fatal error C1083: Cannot open include file: 'soc_cfg.h': No such file or directoryrnrn 不知道各位是否遇到类似的情况,请赐教,谢谢!
NDK环境编译提示不到 AttachCurrentThread
在jni.h的头文件里<em>找</em>到 rnrn/*rn * C++ version.rn */rnstruct _JavaVM rn const struct JNIInvokeInterface* functions;rnrn#if defined(__cplusplus)rn jint DestroyJavaVM()rn return functions->DestroyJavaVM(this); rn jint AttachCurrentThread(JNIEnv** p_env, void* thr_args)rn return functions->AttachCurrentThread(this, p_env, thr_args); rn jint DetachCurrentThread()rn return functions->DetachCurrentThread(this); rn jint GetEnv(void** env, jint version)rn return functions->GetEnv(this, env, version); rn jint AttachCurrentThreadAsDaemon(JNIEnv** p_env, void* thr_args)rn return functions->AttachCurrentThreadAsDaemon(this, p_env, thr_args); rn#endif /*__cplusplus*/rn;rnrnrn这说明只支持c ++. 不支持c ? rn
使用mysql++编译提示不到mysql_version.h
#if defined(MYSQLPP_MYSQL_HEADERS_BURIED)rn# include rn#elsern# include rn#endifrnrnrnc:\mysql++\include\common.h(124) : fatal error C1083: Cannot open include file: 'mysql_version.h': No such file or directory
VS2005 编译live555提示不到msvcirt.lib???
我已经按照网上的帖子设置了rnLINK_OPTS_0 = $(linkdebug) msvcrt.librnrn但是<em>编译</em>到最后还是<em>提示</em>:rnLINK : fatal error LNK1181: cannot open input file 'msvcrt.lib'rnNMAKE : fatal error U1077: '"C:\Program Files\Mircrosoft Visual Studio 8\VC\BIN\link.EXE"' : return code '0x49d'rnStop.rnrn大家说说是怎么回事呢?rn此时除了testProgs与WindowsAudioInputDevice还没有<em>编译</em>出lib外,其他的都已经生成了lib.rnrn
标签的编译问题!提示不到
我的classpath环境变量设置为rnD:\Tomcat 5.0\common\lib;D:\j2sdk1.4.2\lib\jsp-api.jar;D:\j2sdk1.4.2\lib\servlet-api.jarrnrnD:\j2sdk1.4.2\lib下有jsp-api.jar文件了。rnrn
编译java源文件时,提示软件包不到
classpath是:I:\;I:\com\bruceeckel\tools;I:\c05\dessert;I:\com\bruceeckel\tools\debug;I:\com\bruceeckel\utilrn<em>编译</em>的源文件:rn//: Dinner.java(位于I:)rn// Uses the libraryrnrnimport c05.dessert.*;rnrnpublic class Dinner rn public Dinner() rn System.out.println("Dinner constructor");rn rn public static void main(String[] args) rn Cookie x = new Cookie();rn //! x.foo(); // Can't accessrn rn ///:~rnrn<em>编译</em>时出现错误:rnDinner。java:4: 软件包 co5.dessert 不存在rnimport co5.dessert.*;rnrnDinner。java:11: 无法访问Cookiern错误的类文件:I:\c05\dessert\Cookie.classrn类文件包含错误的类:c05.dessert.Cookiern。。。。。rnrnrnrn(//: Cookie.java(位于I:\c05\dessert)rn// Creates a libraryrnrnpackage c05.dessert;rnrnpublic class Cookie rn public Cookie() rn System.out.println("Cookie constructor");rn rn void foo() System.out.println("foo"); rn ///:~)rnrn求大虾救命?rn
编译提示不到unit2.FMX,有什么原因?
555555555555, 初次使用XE7,就遇到这样的问题 以前是d6.
Ubuntu 14.04 提示编译工具链 不到
NDK <em>编译</em>工具链 是32位,放在 64 位 Ubuntu 14.04 下,<em>提示</em>不能<em>找</em>到工具链 gcc、g++ 等,需要安装32位兼容库,即ia32-libs -, 命令行   sudo apt-get install lib32z1 lib32ncurses5 lib32bz2-1.0 后就可以了
为什么vc2008编译提示不到msvcr90d.dll?
网上搜的说,在project属性里把manifest tool里use FAT32就可以了rnrn但是我改了却还是不行呀,我的VS2008是装在C盘的,默认安装的rnrnC盘是FAT格式的,和这个有关系吗?rnrn在网上也搜到这个:把运行符号(StratDebugging 绿色三角)后面框里的Debug改为Release就可以了rnrn这样的确是可以了,但是一般是在得不debug下的啊,到debug下为什么不可以呢,我以前用2005的时候是可以的啊rnrn就是在<em>编译</em>和连接的时候都可以,就是在运行的时候出问题了,我截个图上来给大家看看,请知道如何解决的朋友帮我看看rnrn[img=http://hiphotos.baidu.com/zgjxwl/pic/item/4c6b4e17e4b4de1bc83d6def.jpg][/img]
IDEA编译项目一直提示不到符号”
<em>编译</em>项目一直<em>提示</em> 重<em>编译</em>、重新导入、送svn上重新下载、更换jdk版本都尝试过还是不行,最后<em>找</em>到了一个解决办法 在<em>提示</em>的类上,右击选择  recompile即可  ...
为什么编译提示不到CRecordset类
先建立了一个单文本文档工程,没有选择支持数据库,后来因需要,想连接数据库表,通过class wizard建立了一个继承于CRecordset的类并关联了一张表,但<em>编译</em>时<em>提示</em>,error C2504: 'CRecordset' : base class undefined。 难道刚开始创建工程时没选择支持数据库,后面就不能再关联了吗???
关于组件编译之后提示不到的问题
作一个界面,notebook<em>编译</em>一下之后,在PAS文件TYPe下面没有了,同时在object treeview和object inspecter中都分别<em>提示</em> Tnotebook,但是在PAS的TYPE下加Notebook1: TNotebook;也加不进去,DFM文件中有这个组件的明细,不知还要在那里改和加,<em>编译</em>没有问题,一运行就<em>提示</em>“class Tnotebook not found”,不知怎样才能解决,省的我重新作这个界面,
编译qt-x11-opensource-src-4.5.0.tar.bz2提示qtcore/configure.h不到
vmware+redhat9rn求各路高手支招。谢谢
ndk编译C++,提示不到头文件
android NDK开发程序的时候总<em>提示</em><em>找</em><em>不到</em>头文件(ndk-build error: string: No such file or directory)怎么解决啊。
编译好的文件提示nmfast.bpl不到??????
<em>编译</em>好的可执行文件<em>提示</em> nmfast.bpl <em>找</em><em>不到</em>??????可是我哪里都<em>找</em><em>不到</em>这个包文件??谁知道这是那个控件的包文件???rnrnrn谢谢了!
提示不到不到MSVBVM60.DLL
为什么我做的一个小软件在我自己机上运行(WIN2000)什么问题都没有,在一个朋友机上运行就<em>提示</em>“<em>找</em><em>不到</em><em>找</em><em>不到</em>MSVBVM60.DLL”,然后我把我的MSVBVM60.DLL拷到和那个软件一个目录下就又能运行了,而其他的朋友有的有同样问题,有的没有,这是为什么?
编译opencv
关于中途关机再make出现错误处理只需删除出现错误部分的*.o中间文件,重新make
opencv编译
1.勾选opencv_enable_notfree 2.再次<em>编译</em>,直至没有红色 选
opencv 编译
open c v<em>编译</em>过程fatal error: 'vgg_generated_120.i' file not found
OpenCV编译
从官网(http://opencv.org/downloads.html)上下载: opencv-3.2.0-vc14.exe 安装解压到D:\OpenCV cmake: 勾选 BUILD_opencv_world ,将只会生成opencv_world320.dll 也可以不勾选 BUILD_opencv_world ,会生成 opencv_core320.dll opencv_fla
编译OpenCV
不记得是什么时候用的一条<em>编译</em>命令 cmake -D CMAKE_BUILD_TYPE=RELEASE -D CMAKE_INSTALL_PREFIX=/usr/local -D WITH_TBB=ON -D BUILD_NEW_PYTHON_SUPPORT=ON -D WITH_V4L=ON -D WITH_QT=OFF -D WITH_OPENGL=ON .....
codeblocks使用vc2005编译wxwidgets提示编译不到
我在codeblocks->project->build options->debug->compiler settings->#defines中设置了WIN32 __DEBUG __WXMSW__ __WXDEBUG__ __UNICODE __WINDOWS __NOPCH,<em>编译</em>却出错了rn__DEBUGrnc1xx : fatal error C1083: Cannot open source file: '__DEBUG': No such file or directoryrn__WXMSW__rnc1xx : fatal error C1083: Cannot open source file: '__WXMSW__': No such file or directoryrn__WXDEBUG__rnc1xx : fatal error C1083: Cannot open source file: '__WXDEBUG__': No such file or directoryrn__UNICODErnc1xx : fatal error C1083: Cannot open source file: '__UNICODE': No such file or directoryrn__WINDOWSrnc1xx : fatal error C1083: Cannot open source file: '__WINDOWS': No such file or directoryrn__NOPCHrnc1xx : fatal error C1083: Cannot open source file: '__NOPCH': No such file or directoryrn
linux中结合opencv编译c++代码
linux中结合opencv<em>编译</em>c++代码
Linux 编译基于Opencv的C++项目
背景:在linux下使用cmake<em>编译</em>C++项目,其中使用的到opencv,有两种方法 1、项目中只有简单的一个源码文件,直接使用命令,这个没有亲测,仅是记录 gcc Test.c -o Test `pkg-config --cflags --libs opencv` 2、使用cmake<em>list</em>文件进行<em>编译</em> 我尝试过直接在cmake<em>list</em>文件中设置 opencv的include和lib...
在linux环境下 编译opencv (C++)工程
工程目录如图所示 首先需要<em>编译</em>生成三个.o结尾的文件 执行以下三个<em>编译</em>命令  g++ -c CalculateStem.cpp  -o CalculateStem.o -I/usr/local/include/ -lraspicam -lraspicam_cv -lopencv_core -lopencv_highgui  -lopencv_imgcodecs  g++ -c C
菜鸟Linux之旅——安装CMAKE and 编译OpenCV
菜鸟<em>Linux</em>之旅——安装CMAKE and <em>编译</em>OpenCV 本人<em>Linux</em>新手一枚,学习能力也不强,写博客纯属为了提高自己的学习效率。欢迎大家互相学习,不喜误喷,小女在此谢过了。第一篇技术博客,就先写今天师兄教的——安装CMAKE和<em>编译</em>OpenCV . 安装CMAKE 点击左下角的菜单,选择“终端”,下面这张图我红色框框框出来的的那个图标就是(快捷键ctrl+alt+t 就是!amazing...
Linux学习笔记(十一) -- Opencv库的编译和安装
1.<em>Opencv</em>简介 什么是<em>Opencv</em>? OpenCV是一个基于BSD许可(开源)发行的跨平台计算机视觉库,可以运行在<em>Linux</em>、Windows、Android和Mac OS操作系统上。它轻量级而且高效——由一系列 C 函数和少量 C++ 类构成,同时提供了Python、Ruby、MATLAB等语言的接口,实现了图像处理和计算机视觉方面的很多通用算法。 应用领域 1、人机互动 2、物体...
求助linux 中 opencv 在arm 下编译
用2.95.3<em>编译</em>了opencv1.0 静态库rn之后发现用3.32,3.4之类<em>编译</em>应用程序的会出现所有的函数都undefined referencern只能还用2.95.3<em>编译</em>应用程序,在使用jpeg png 支持的时候会有很多相关的undefined reference,去出了jpeg 和png等等之后,还残留一个undefined reference 不知道怎么回事,/usr/local/lib /libhighgui.a(loadsave.o):???'__static_initialization_and_destruction_0'?:rnloadsave.o(.text+0xc34): undefined reference to `cvSetImageIOFunctions'
Linux环境下如何编译和运行opencv程序
使用opencv\sources\samples\c目录下提供的build_all.sh脚本,可以直接<em>编译</em>所有的.c和.cpp文件#!/bin/shif [ $# -gt 0 ] ; then base=`basename $1 .c` echo "compiling $base" gcc -ggdb `pkg-config opencv --cflags --libs` $
Linux环境编译OpenCV的应用程序方法
示范代码://test.cpp #include #include #include using namespace cv;int main(int argc, char **argv) { IplImage *img = cvLoadImage(argv[1]); if (NULL == img) { printf("Load
linux使用g++编译opencv程序出错了
opencv<em>编译</em>安装完成后,使用cmake<em>编译</em>程序的方法可以<em>编译</em>通过,但是使用g++<em>编译</em>的方法就<em>提示</em>错误,<em>找</em><em>不到</em>libhdf5.so.101,还有一大堆未定义的引用,怎么解决[img=https://forum.csdn.net/PointForum/ui/scripts/csdn/Plugin/001/face/1.gif][/img]rn[img=https://img-bbs.csdn.net/upload/201804/20/1524181902_164397.png][/img]
linux运行时提示不到某个so
有时候通过linux<em>编译</em>安装一些程序会有类似这样的错误<em>提示</em>: 写道 yunpeng@yunpeng-duitang:/duitang/dist/sys/zookeeper-3.4.5/src/c$ cli_mt localhost:2181cli_mt: error while loading shared libraries: libzookeeper_mt.so.2: cannot op...
不到 nvidia.ko"">linux 装显卡驱动提示"不到 nvidia.ko"
./NVIDIA-<em>Linux</em>-x86-100.14.06-pkg1.run --kernel-source-path=/usr/src/kernels/2.6.18-8.el5-i686/rn也不行,错误信息为:rnrnrnERROR: Unable to load the kernel module 'nvidia.ko'. This happens mostrn frequently when this kernel module was built against the wrong orrn improperly configured kernel sources, with a version of gcc that differsrn from the one used to build the target kernel, or if a driver such asrn rivafb/nvidiafb is present and prevents the NVIDIA kernel module fromrn obtaining ownership of the NVIDIA graphics device(s).rn rn Please see the log entries 'Kernel module load error' and 'Kernelrn messages' at the end of the file '/var/log/nvidia-installer.log' forrn more information.rnrn版本为:linux 企业版5.0rnHEADER.rpm已装rnkernel.rpm已装rnrn有高人知道为什么吗rnrnrn现在不装显卡驱动,在文本模式下 startx 直接就黑屏了
Linux 执行文件时提示不到动态库
确保动态库已经安装<em>编译</em>完成<em>找</em>到其所在路径,find / -name &quot;libboost_regex.so.1.66.0&quot;sudo vim /etc/ld.so.conf该文件添加一行 即上述路径  /usr/local/boost/libsudo /sbin/ldconfig...
linux代码编译不到符号问题
代码都<em>编译</em>通过,没有任何错误,链接的时候一堆undefiled的符号,首先拷贝这些符号,整个workspace一顿grep,如果是源码文件中定义的符号,好说,多半是在.h文件里面赋值初始化了,然后其他地方用到的时候没有extern或者应该.h文件中只做声明,在对应的.cpp文件中赋值定义分配空间,这样在其他地方引用的时候就不会有事了。 <em>编译</em>d工程,用到了c库b和a库, 可惜,gre
linux编译不到apr问题解决办法
在linux中apr是非常常用的一个东西了,但有时你会发现apr编辑安装时<em>提示</em>configure: WARNING: APR not found错误了,下面小编就为各位介绍解决办法。 linux很多地方<em>编译</em>的时候都会用到apr 如果<em>找</em><em>不到</em>apr就会报错 configure: WARNING: APR not found The Apache Portable Runtime (APR)
cmake 不到opencv路径
win10上 cmake一个包报错<em>找</em><em>不到</em>.cmake文件 OpenCVConfig.cmake opencv-config.cmake 百度了一下是我安装opencv的时候没有安装在默认路径 而是自己指定了路径(因为公司之前给我的电脑内存小 这种东西我都习惯单独安装在D盘) <em>找</em>到自己安装的位置 然后加到DOPenCV_DIR后面 输入: cmake -DOpenCV_DIR=“D:\coding...
不到opencv的.so文件
[img=https://img-bbs.csdn.net/upload/201703/29/1490771980_372977.png][/img]运行一个用opencv写的程序时,报错: error while loading shared libraries: libopencv_aruco.so.3.2: cannot open shared object file: No such file or directory。然后ldd查看程序相关的动态函数库,发现少了很多opencv的.so文件,上网<em>找</em>了一下,这些.so应该都在库里的啊,<em>编译</em>安装完怎么没有?
opencv不到路径
安装opencv库后总是<em>找</em><em>不到</em>路径,可能寻<em>找</em>opencv库的方式不一样 cmake_minimum_required( VERSION 2.8 ) project( imageBasics ) # 添加c++ 11标准支持 set( CMAKE_CXX_FLAGS &quot;-std=c++11&quot; ) # 寻<em>找</em>OpenCV库 set(<em>Opencv</em>_DIR /home/li/opencv-3.1.0...
linux g++编译提示少pthread库
最近g++<em>编译</em>一个log4cpp的使用demo,总<em>提示</em>少<em>找</em><em>不到</em>pthread的函数接口,加了-lpthread也无法解决。 最终通过加-pthread解决该问题,注意-pthread没有l。通过检查log4cpp的makefile文件,发现内部添加了-pthread命令,在<em>编译</em>demo时加上-pthread即可。
linux list
linux <em>list</em>
编译提示
为什么在<em>编译</em>一些程序时总会<em>提示</em>:rn"Note: *.java uses or overrides a deprecated API."rn还请各位高手予以解答?rn非常感谢!!!
为什么在其他机子运行opencv程序会提示不到cxcore100.dll?
本机没问题, 机子是没有安装vc6的 rnrnrn就一个简单的例子 也这样
Linux下,海思SDK编译器,在opencv编译出错,提示wchar.h不到
[img=https://img-bbs.csdn.net/upload/201501/27/1422367201_529555.png][/img]rnopencv版本为2.3.1,使用的是海思SDK中的<em>编译</em>器,在对opencv<em>编译</em>时<em>提示</em>上述错误。rn有没有人遇到过?求指导
魔改Cmake系列:编译caffe的时候不到OpenCV
可能的原因是你<em>编译</em>的用的是比如是vs2010,然后生成文件所在的文件目录就变成了vc11,而你在需要<em>编译</em>其他东西的时候,比如caffe的时候你用的是vs2013,那么此时应该是vc12,这个时候就蛋疼了,cmake<em>找</em><em>不到</em>opencv了。咋办? E:\opencv3\buildtemp\install下的OpenCVConfig.cmake   if(MSVC_VERSION EQUAL 140
ubuntu中用qtcreator搭建opencv工程,编译提示不到lopencv_imgcodecs
opencv_imgcodecs only exists in opencv3, not opencv2.4(where all of its functionality is in highgui)也就是说opencv版本的问题
ZED windows下用cmake编译出现不到opencv解决
  回到安装ZED_SDK包下的依赖文件,打开里面的opencv文件,再打开x64文件,如果是ZED2.5版本的SDK里面应该只有v14也就是支持vs2015的,但是由于我是安装的是vs2013的,所以这就是出错的原因了,版本不兼容! 因此解决方案是到opencv下载opencv3.1.0的版本,提取build里面的x64的vc12文件到zed_sdk的那个依赖文件夹下面的opencv...
使用cmake编译opencv时 编译器总不到
因为要使用CUDA+opencv 在使用cmake3.4.3以及最新版<em>编译</em>opencv的时候配置总出错rn错误提醒一直是rnCMake Error at CMakeLists.txt:93 (project):rn No CMAKE_CXX_COMPILER could be found.rnrnrnrnCMake Error at CMakeLists.txt:93 (project):rn No CMAKE_C_COMPILER could be found.rnrnrnrnCUDA的路径 环境变量,opencv的都配置好了 不知道到底是什么问题?[img=https://img-bbs.csdn.net/upload/201610/17/1476702327_288502.jpg][/img]
linux下编译opencv程序
我操...linux系统。。。让我疯了,,写好了又手贱没了。。 会出现<em>找</em><em>不到</em>opencv的情况,原因是在/usr/local/pkgconfig下面的opencv.pc缺少露路劲,加上opencv2的路劲即可: pkg-config --cflags --libs opencv查看,已经加进去露 这个时候参考另外一篇asm的日志里面的方法,我操懒得写第三编露。。
屏幕录像专家6.0的破解版下载。我经过长时间验证,真的很不错。下载
这个是公认最好的屏幕录像工具,大家可以试下,中间不卡死,而且是破解版的。 相关下载链接:[url=//download.csdn.net/download/niehaibin403/2303202?utm_source=bbsseo]//download.csdn.net/download/niehaibin403/2303202?utm_source=bbsseo[/url]
要会的java程序下载
要会的java程序 相关下载链接:[url=//download.csdn.net/download/fyihdg/4440717?utm_source=bbsseo]//download.csdn.net/download/fyihdg/4440717?utm_source=bbsseo[/url]
拓维美容美发管理系统(2013更新版)_v5.072_正版软件.zip下载
美发 会员系统 免费 破解版 2013 最新 相关下载链接:[url=//download.csdn.net/download/oxuyanbin/4945557?utm_source=bbsseo]//download.csdn.net/download/oxuyanbin/4945557?utm_source=bbsseo[/url]
相关热词 c# stream 复制 android c# c#监测窗口句柄 c# md5 引用 c# 判断tabtip 自己写个浏览器程序c# c# 字符串变成整数数组 c#语言编程写出一个方法 c# 转盘抽奖 c#选中treeview
我们是很有底线的