求教:AndroidStdio中错误: 程序包android.annotation不存在 [问题点数:40分]

Bbs1
本版专家分:29
版主
Blank
红花 2013年11月 硬件/嵌入开发大版内专家分月排行榜第一
Blank
黄花 2014年7月 硬件/嵌入开发大版内专家分月排行榜第二
Blank
蓝花 2013年10月 硬件/嵌入开发大版内专家分月排行榜第三
2013年6月 硬件/嵌入开发大版内专家分月排行榜第三
2013年3月 硬件/嵌入开发大版内专家分月排行榜第三
结帖率 91.45%
Bbs5
本版专家分:3499
Blank
黄花 2014年5月 移动开发大版内专家分月排行榜第二
v7包解决importandroid.support.annotation.RequiresApi
v7包解决importandroid.support.annotation.RequiresApi
完整的android.support.annotation
完整的android.support.annotation.jar包含Nullable、Keep、XmlRes、TransitionRes、WorkerThread等共49个类
深入浅出Android Support Annotation
如果你之前遇到过在方法参数前面有@NonNull的情况却不知道它是干什么的,这篇文章将解答你的疑问。
编译打包安卓apk报错:软件包 org.cocos2dx.lib 不存在
第一次编译打包安卓apk时报出很多错,其中有一个:软件包 org.cocos2dx.lib <em>不存在</em> 于是乎我在网上查找解决方法看到这一段话: 复制 ***\cocos2dx\platform\android\java\src\ (***为cocos2d-x更目录) 到你android项目中的src文件夹中 尝试了一下,成功解决了问题。
gradle编译报错:程序包javax.annotation不存在
问题描述: 采用gradle命令编译(gradle build)时,报如下<em>错误</em>: XXXXXXXXXX.java:11: <em>错误</em>: <em>程序包</em>javax.annotation<em>不存在</em> import javax.annotation.Nullable; 解决方案: build.gradle文件中增加如下依赖: compile 'com.google.code.findbugs:jsr305:2.0...
Android studio 错误: 程序包 不存在
问题: 这个问题比较有针对性,可能你也报的是这个<em>错误</em>,但是我的解决方法并不适合你主模块引用了module A作为lib,但是在module A中有的类不能混淆,比如javaBean类等解决:先确定已经设置了module的依赖关系,请看这里 主module下的build.gradle 里有这样类似的代码 dependencies { compile project(‘:module A’)
apk打包中程序包R不存在的问题
一个工程中有src下有2个packaget,com,org 当com中的代码没有import org.cocos2dx.lua.R; 就会出现 <em>错误</em>: <em>程序包</em>R<em>不存在</em> 把import语句加上去解决问题
错误: 程序包R不存在" 的解决方法">【Android】 新建项目 "错误: 程序包R不存在" 的解决方法
如果新建一个Android项目,修改资源、包名等多种信息后,报『<em>错误</em>: <em>程序包</em>R<em>不存在</em>』的<em>错误</em>。这种情况下,问题多出在包名。 尤其在.java文件中没有明确写『import **.R』时,IDE目测会去当前java文件的同包名找R; 这种情况下, 可以在该文件中写明『import 包名(AndroidManifest中的).R; 』,然后再build; 另一种方法,如果这种文件少,也可先把报错的
Android程序报错:程序包org.apache.http不存在——Android 6.0已经不支持HttpClient
Android Studio 2.1中使用 Android SDK 6.0(API 23),加载融云Demo时,报错: 解决办法: Android 6.0(api 23)已经不支持HttpClient了,在build.gradle中 加入 useLibrary 'org.apache.http.legacy'就可以了,如图:
android studio编译提示错误:android Error:(21, 19) 错误: 程序包R不存在
点击“Build”"Clean Project",再次编译没有<em>错误</em>了。针对各种情况而定,这是本人在出现上述报错时,这样就解决问题。这只是作为参考。
Android 报错 “程序包R不存在...!”
Android 报错 “<em>程序包</em>R<em>不存在</em>…” 场景 在编译完cocos2d 安卓包后报错,报错信息如下: 原因 包名<em>错误</em>。上图中LoginUtils.java源文件是由另一个工程copy过来的, 里面保留了上个工程的信息“import org.cocos2dx.taijimajiang.R;”, 当前工程信息为“import org.cocos2dx.guiZhouMaJiang...
错误: 程序包com.***.databinding不存在
***.java Error: <em>错误</em>: <em>程序包</em>com.***.databinding<em>不存在</em> Error: <em>错误</em>: 找不到符号 符号: 类 ***Binding 位置: 类 ***Activity 网上有各种各样的 方法 但是我的都不行 ,最后解决了来总结一下网络上的方法 总结一下 复制一下 1.拉倒报错最下面,看哪里出了问题,解决即可 2.换了
Gradle编译提示(module相互依赖): 程序包XXX不存在
两个或多个Module相互依赖的情况下,例如主Module A依赖于Module B作为library,出现<em>程序包</em><em>不存在</em><em>错误</em>解决:作为library的Module B中的类不能被混淆,将Module B中release —— minifyEnabled设为false即可 ,如: release { minifyEnabled false proguardF...
程序包javax.annotation不存在"错误">解决:Dagger2使用过程中的"程序包javax.annotation不存在"错误
Dagger2 <em>程序包</em>javax.annotation<em>不存在</em>
Android Studio中新增整体的activity类文件,重新编译后提示“程序包R不存在”解决
问题描述: 做新功能模块开发,新增两个写好的activity类文件,资源文件和jave都整合好了,最后 Rebuild Project的时候编译的message里面出现“<em>程序包</em>R<em>不存在</em>”提示 解决办法: 需要在在新增的类文件中分别去 import R: import com.qiniu.pili.droid.rtcstreaming.demo.R;
Android Studio中新增文件夹并新建Activity时,编译后提示“程序包R不存在”解决
开始看到网上的各种方法都不是很好用,最后看到一种方法,其实超级简单,直接加进来就行了。 比如我的工程中每个activity中都有 package com.example.chen.bluetestapplication.ListView;类似的,Listview是我的Listview.activity中的。没有R包是吧,直接复制com.example.chen.bluetestapplica...
Maven打包 错误: 程序包org.junit不存在
最近开发的项目要部署到云服务器上,因此需要打个War放上去,但在打包的时候输出以下<em>错误</em>信息:[ERROR] /Users/aven/Documents/workspace/share/src/test/java/com/weixiao/share/test/TestMyBatis.java:[8,16] <em>错误</em>: <em>程序包</em>org.junit<em>不存在</em> [ERROR] /Users/aven/Documen
android学习笔记(8)-程序包R不存在
项目在编译过程中提示:<em>程序包</em>R<em>不存在</em>,MainActivity中R处报错,alt+enter快速导入包,发现导入的包是<em>错误</em>的。检查AndroidManifest.xml文件package的属性值因为是复制过来的<em>错误</em>的包名,修改后重新编译项目启动成功。
错误: 程序包android.support.v4.app不存在
import eclipes ADT项目工程后,报如下<em>错误</em>: <em>程序包</em>android.support.v4.app<em>不存在</em> <em>错误</em>原因:缺少android.support.v4.app 依赖包 解决方法: 1、File->Project Structure->app->Dependences->Add Library Dependency 添加后进行Gradle Sync 问题解
程序包com.sun.image.codec.jpeg不存在 的解决办法
maven编译
java编译错误程序包不存在
出错:Error:(3, 27) java: <em>程序包</em>com.aliyun.odps.udf<em>不存在</em> 解决: maven settings.xml配置有问题
错误:程序包javax.servlet不存在;错误:程序包javax.servlet.http不存在问题解决办法
在编译servlet程序的时候提示javax.servlet和javax.servlet.http<em>不存在</em>,原因是CLASSPATH路径找不到servlet相关的包,所以会提示<em>错误</em>。 到javax目录下看是否有servlet相关包 发现并没有,说明jdk1.7本身是不自带servlet相关包的。这时,如果服务器上安装了有tomcat,可到tomcat安装路径下的lib目录找到se
异常:程序包org.apache.http不存在 的问题解析
异常:Error:(19, 23) <em>错误</em>: <em>程序包</em>org.apache.http<em>不存在</em> Error:(20, 23) <em>错误</em>: <em>程序包</em>org.apache.http<em>不存在</em> Error:(21, 23) <em>错误</em>: <em>程序包</em>org.apache.http<em>不存在</em> Error:(22, 30) <em>错误</em>: <em>程序包</em>org.apache.http.client<em>不存在</em> Error:(23, 38) <em>错误</em>: <em>程序包</em>org.
Error 错误 程序包 databinding不存在
http://blog.csdn.net/myterabithia/article/details/53516831 http://blog.csdn.net/rodulf/article/details/50573487 网上找到的大部分是以上两种问题造成的,找了半天了,还是没有找到,一个个修改记录的xml文件去找,还是没有找到问题。 记得以往自己的调试经验,用eclipse开发工具导入别
程序包android.support.v7.app不存在的解决办法
1.<em>错误</em>原因: 因为没有成功引入v7的包,所以会报这个<em>错误</em> 2.<em>错误</em>体现: 报错找不到包或者报错style.xml找不到什么什么主题,根本原因如上。 3.为何<em>错误</em>: 为何会导入不成功,我当时毫无操作就报错了,怪我吗? 4.解决方案: 1.在Modules里的Dependencies中手动加上v7的包,几乎没用 2.Build中rebuild也是没用 3.File菜单中lnvalidate cach...
ant编译时报错:程序包junit.framework不存在
代码附带率测试的时候,需要用ant编译工程,但编译不通过,报<em>程序包</em>junit.framework<em>不存在</em>的错;   可是直接运行junit测试的时候没有任何问题。 最后发现将junit的jar包复制到ANT_HOME的lib目录下就能正常编译了。 原因上网查了下看到这段描述: In order for code completion in eclipse to function you m
编译时提示软件包javax.servlet.http不存在,如何解决
本文讲解Java编译时提示软件包javax.servlet.http<em>不存在</em>的解决方法。
Java初级 你有遇到过 错误: 程序包****不存在
在学习Java中的package的时候遇到一个这样的问题           今天在做Java例子的时候遇到一个这样的问题:<em>错误</em>: <em>程序包</em>com.bjsxt.java140<em>不存在</em>         如图:                 这个例子涉及到了两个java文件:          一个是Cat.java:           package com.bjsxt.java
解决maven编译错误程序包com.sun.xml.internal.ws.spi不存在
当maven项目里面有用到JDK内部的一些类,接口(如:com.sun.xml.internal.ws.spi.ProviderImpl)等的时候,用maven编译一般会出现如下<em>错误</em> [INFO] BUILD FAILURE [INFO] ------------------------------------------------------------------------ [INFO]
APK错误:Error:(23, 25) 错误: 程序包R不存在
转载自: https://blog.csdn.net/testcs_dn/article/details/53515793
eclipse 错误 程序包不存在
将<em>程序包</em>所在的项目,右键,然后run as ,maven install
Android程序报“程序包org.apache.http不存在”的原因和解决办法
问题描述最近做Android项目用到网络请求,结果碰到“<em>程序包</em>org.apache.http<em>不存在</em>”的问题,但是以前的项目用同样的网络请求没有问题。 原因在Android Studio开发项目时,Android6.0(API:23)开始不支持HttpClient了。解决办法在app的build.gradle添加如下代码android { useLibrary 'org.apache.htt
程序包不存在 错误解决方法
本人用的Blue J 编译器  public ImageResource makeGray(ImageResource inImage){ //I make a blank image of the same size ImageResource outImage = new ImageResource(inImage.getWidth(),inImage.getH...
java编译错误程序包javax.servlet不存在javax.servlet.*
今天在关于servlet的编译中出现了一下小小的<em>错误</em>,如图所示:          <em>程序包</em>javax.servlet<em>不存在</em>,并且<em>程序包</em>javax.servlet.http<em>不存在</em>等<em>错误</em>。我查阅了一下资料由于servlet和JSP不是java平台j2se(标准版)的一部分,而是j2EE的一部分,因此必须告知编译器servlet的位置。      解决方案如下:     1.注意大小写的问题。s
ant 软件包 *** 不存在
想自动编译JAVA文件。使用ANT的build.xml,但是在运行始终出现ant 软件包 *** <em>不存在</em> 然而我把对应的LIB放在哪个目录的话都不好用。在网上查找的解决方案XML代码: XML代码:
程序包不存在"问题的解决">Maven install 报错"程序包不存在"问题的解决
概述 在mvn clean install时,控制台各种报错,大概有: * .java:[8,52] <em>程序包</em>com.xxx<em>不存在</em> * .java:[98,27] 找不到符号 符号: 类 XXX 位置: 类XXX * [ERROR] COMPILATION ERROR : Caused by: org.apache.maven.plugin.compiler.Compilati...
【debug】maven已解决程序包org.junit不存在
在使用maven过程中,出现了以下<em>错误</em> org.apache.maven.plugins:maven-compiler-plugin:2.5.1:testCompile (default-testCompile) on project support: Compilation failure: Compilation failure: [ERROR] E:\workspace\support\...
Android Studio编译时报错,提示Error:(4, 23) 错误: 程序包org.apache.http不存在的解决
在将Eclipse项目导入到Android Studio中时,可能会报如下<em>错误</em>。import java.util.Locale; import org.apache.http.Header; import org.apache.http.protocol.HTTP;Error:(4, 23) <em>错误</em>: <em>程序包</em>org.apache.http<em>不存在</em> Error:(5, 32) <em>错误</em>: <em>程序包</em>org.ap...
Java命令行编译文件时出现的错误,找不到符号或软件包不存在
习惯了eclipse的自动编译,Java命令行编译、执行文件只会最基础的部分,就是对单文件的编译和执行,而且不包含任何外部JAR包。但有时候你还非得用命令行,会碰到一些问题,博主这里给出几种常见的问题及解决方法。 首先介绍了一下相对路径和绝对路径的概念,对本文实验环境进行详细得介绍,主要解决了三个问题,问题一:找不到符号或软件包<em>不存在</em>,问题二:JAR包怎么引入,问题三:指定class文件存放位置。
错误: 程序包org.apache.log4j不存在问题处理
将maven中依赖修改如下:          log4j          log4j          1.2.15                                    javax.mail              mail                                      javax.jms            
APK报错:错误: 程序包com.android.volley不存在
file-&gt;project structure-&gt;Dependencies 点+符号,添加相关包 解决问题
R文件丢失以及包不存在的解决方法
导入百度demo时候发现R文件<em>错误</em>,并且各种异常<em>错误</em>,百度了很多方法都不管用: 这是百度的方法: 情况一: 千万不要重启Eclipse、也不自己创建R.java 类文件 右击你的工程(项目)——>Android Tools——>Fix Project Properties 将会再次创建出R文件
Android开发:Error:(3, 17) 错误: 程序包org.junit不存在
编译项目的时候某个module突然出现了<em>错误</em>: Error:(3, 17) <em>错误</em>: <em>程序包</em>org.junit<em>不存在</em>后来对比发现时误删除了build.gradle的 dependencies { compile fileTree(dir: 'libs', include: ['*.jar']) compile 'com.android.support:appcompat-v
生成javadoc 报错软件包不存在
生成javadoc  报错软件包<em>不存在</em>的修改方法:在.classpath文件加入
使用Ant打包时出现程序包javax.servlet.http不存在错误
使用Ant打包时出现<em>程序包</em>javax.servlet.http<em>不存在</em>的<em>错误</em>
IDEA中如何解决程序包javax.servlet不存在
1.首先选择file 2.再选择file目录下的Project Structure 3.选择Modules这个选项,再选择到你的项目中,点击绿色的“+”号 4.然后选择Library...这个选项   5.若配置了tomcat服务器,则会有tomcat这个选项  最后在点击Apply后点击ok,就好了 若你没有配置tomcat的话.....告辞! ( 哎,没有配置好的...
正确解决程序包com.sun.image.codec.jpeg不存在的方法
正解:POM依赖中添加 &amp;lt;dependency&amp;gt;             &amp;lt;groupId&amp;gt;jdk.tools&amp;lt;/groupId&amp;gt;             &amp;lt;artifactId&amp;gt;jdk.tools&amp;lt;/artifactId&amp;gt;             &amp;lt;version&amp;gt;1.8&amp;lt;/version&amp;gt;          
程序包org.apache.http不存在,解决方式
类里提示爆红import org.apache.http.HttpEntity; import org.apache.http.HttpResponse; import org.apache.http.StatusLine; import org.apache.http.client.HttpClient; import org.apache.http.client.methods.HttpGet;
win8远程桌面出现安全包不存在错误
win8初次使用远程桌面报安全包<em>不存在</em>
maven 运行package 命令是报 错误: 程序包org.junit不存在
<em>错误</em>信息:[ERROR] COMPILATION ERROR : [INFO] -------------------------------------------------------------[ERROR] /D:/study/workspace-lej/a/src/test/java/com/lejpro/test/EmpDaoTest.java:[6,17] <em>程序包</em>org.junit...
maven 构建时 错误: 程序包netscape.javascript不存在
暂时找不出问题来源
Error:(23, 25) 错误: 程序包R不存在
创建项目后,运行项目时Gradle Build 窗口却显示<em>错误</em>:<em>程序包</em>R<em>不存在</em>通常情况下是不会出现这个<em>错误</em>的。我是怎么遇到这个<em>错误</em>的呢?第一次创建项目,company Domain我使用的是:aven.com,但是创建过程在卡在了Building 'Calculator' Gradle Project info这个过程中,于是我选择了“Cancel”第二次创建项目,我还是使用相同的项目名称和项目路
android gradle插件编译时的一个小问题,程序包不存在
最近在写android gradle的插件,之前编译可以通过的工程突然爆出<em>错误</em>: ****.java:6: <em>错误</em>:<em>程序包</em>****<em>不存在</em> 仔细看了下build.gradle,发现是dependencies下的compile files 依赖配置错了,代码更新后,指向本地某个jar包的路径错了 感觉遇到这种问题,还是要踏踏实实的先仔细检查基本配置,不要想太多虚无缥缈的原因,mark下~
dos命令下执行命令报错 错误程序包org.dom4j.jar不存在 错误:找不到符号处理
<em>错误</em>:<em>程序包</em>org.dom4j.jar<em>不存在</em> <em>错误</em>:找不到符号处理
【转】程序包com.sun.image.codec.jpeg不存在 问题的完美解决
转载自:http://my.oschina.net/zb0423/blog/86507  maven下面编译失败,失败提示信息为:<em>程序包</em>com.sun.image.codec.jpeg<em>不存在</em>  这个类文件的位置在jre/lib/rt.jar  而我们设置的java_home下面的lib/dt.jar中没有这个文件,导致编译失败。通过配置maven-compiler-plugin插件可
java 程序包不存在
在学习Java中的package的时候遇到一个这样的问题           今天在做Java例子的时候遇到一个这样的问题:<em>错误</em>: <em>程序包</em>com.bjsxt.java140<em>不存在</em>         如图:                  这个例子涉及到了两个java文件:          一个是Cat.java:           [ja
软件包 不存在 问题 解决方法
1.classpath 2.lib路径出现空格 3.buildpath
java:程序包XXXX不存在
使用idea导入maven项目,编译时报错: java:<em>程序包</em>XXXX<em>不存在</em>
Error处理:遇见引入ViewPager包,编译不报错,运行报错ViewPager不存在问题
遇见引入ViewPager包,编译不报错,运行报错ViewPager<em>不存在</em>问题 今天遇到一个比较奇怪的问题:导入android.support.v4.view.ViewPager包,引入ViewPager,编译不报错,运行报错ViewPager<em>不存在</em>问题。 由于工程的Target是Android2.3平台,而且代码是从之前的一个原有包里导入的。想加如一个viewpager.添加过程一切顺利
IDEA错误: 程序包org.apache.log4j不存在问题处理
将maven中依赖修改如下: 以前maven的pom.xml文档中是写这个报错的: &amp;amp;amp;amp;lt;dependency&amp;amp;amp;amp;gt; &amp;amp;amp;amp;lt;groupId&amp;amp;amp;amp;gt;log4j&amp;amp;amp;amp;lt;/groupId&amp;amp;amp;amp;gt; &amp;amp;amp;amp;lt;artifactId&amp;amp
软件包 junit.framework 不存在的解决方法
执行build.xml,出现<em>错误</em>如下: "软件包 junit.framework <em>不存在</em>" 可我的JUnit运行没问题啊,查询答案如下: In order for code completion in eclipse to function you must make sure that junit.jar is on your build classpath. You should be abl
react-native踩过的坑
包管理添加新的第三方包总会遇到各种问题,不是版本不对就是运行不起来,记录下遇到的问题:Error: Cannot find module ‘xxx’module.js:340 throw err; ^ Error: Cannot find module 'xxx'这个问题若不是没引用包就是需要关联下依赖:npm install -dMainApplication.java:5: <em>错误</em>: <em>程序包</em>xxx
一点一点学maven(11)——Eclipse开发Maven项目提示:程序包org.junit不存在解决方案
1、产生的问题:maven项目执行单元测试可以正常执行,但是执行maven命令test,则报一下异常:org.apache.maven.plugins:maven-compiler-plugin:2.5.1:testCompile (default-testCompile) on project support: Compilation failure: Compilation failure: [
IDEA--如何解决Java:程序包xxxx不存在
前言 有时候我们在导入程序之后,系统会给出<em>错误</em>提示:Java:<em>程序包</em>xxxx<em>不存在</em>,现在我这里有一招,就是使用IDEA自动导入Java<em>程序包</em>,这也是IDEA的一大优点。 内容 当出现如题所示的<em>错误</em>时候,不用着急,这是因为配置Java的<em>程序包</em>这块出现了<em>错误</em>,同时可能你还没有设置让IDEA自动加载Jar包,才会报出这种<em>错误</em>的。解决方式如下: File—&amp;gt;Setting—&amp;gt;Build...
关于程序包不存在问题
javac -classpath  可以指定类路径 来编译java文件 比如 javac -classpath **\servlet-api.jar **.java 来编译某个java文件 要是需要指定多个路径呢? 答案是在linux上多个路径分隔符就是:而windows中多个路径分隔符就是; 比如 javac -cp classes;C:\Tomcat\lib\s
使用databinding 运行项目报 程序包com.***databinding不存在
今天,使用databinding时 运行项目报com.***databinding <em>不存在</em>,所有的自动生成类 都报错 检查了一边xml和java代码 均没有问题 找了好久 才发现原因 原因是: 我使用路由框架Arouter,在定义服务接口的时候加了private修饰 <em>错误</em>示例: @Autowired private IUserModuleSer...
ant 软件包不存在报错 解决方法
原文摘自:[url]http://www.bwxxkj.com/a/jishuzhongxin/kaiyuanruanjian/2012/0307/80847.html[/url] 什么是天才!我想,天才就是勤奋的成果。下午写了一个ant脚本,筹算让ant主动将项目中须要的类编译一下。 Eclipse中编译没有任何题目,然则一运行ant脚本就报错,很多第三方的jar包<em>不存在</em>或者干脆找不到,...
Error: 程序包org.apache.http不存在 原因及解决方法
  AS中该加的第三方类库都在build.gradle中配置好了,但是还是会报 Apache.Http 类的包<em>不存在</em>,且在compile或implementation中找不到Http的库。 原因:   是Android6.0之后,SDK就不再支持HTTPClient,仅保留了几个类,推荐使用HTTPURLConnection类,因为他可以通过透明压缩和响应减少网络的使用并最大限度的降低电量...
关于解决android studio各种疑难杂症系列---- 程序包org.apach.http.protocol不存在
报错见图: 此问题为:工程,原因是Android M 起默认移除了Apache HTTP:  解决方案:添加以下依赖,重新使用已经deprecated 的apache http 包: 解决方法一:在当前项目的build.gradle里边加上如下语句 android { useLibrary 'org.apache.http.legacy' } 解决方法二:直接在工程
错误: 程序包com.xx.xxxx.xxx不存在
主模块引用了module A作为lib,但是在module A中有的类不能混淆,比如javaBean类等 解决: 先确定已经设置了module的依赖关系,请看这里 主module下的build.gradle 里有这样类似的代码 dependencies { compile project(‘:module A’) } 在作为lib的module的build.gradle中将relea...
Java命令行编译文件时出现的错误,找不到符号或软件包不存在等对应代码
习惯了eclipse的自动编译,Java命令行编译、执行文件只会最基础的部分,就是对单文件的编译和执行,而且不包含任何外部JAR包。但有时候你还非得用命令行,会碰到一些问题,博主这里给出几种常见的问题及解决方法。问题一:找不到符号或软件包<em>不存在</em>,问题二:JAR包怎么引入,问题三:指定class文件存放位置
java报错:java:xxx包不存在
就是java加载的类<em>不存在</em> 解决的办法: 把项目的MavenProject打开,点击clean,再点击run,就可以运行了,分析其原因,之前点击了clean,再点击install,生成了<em>错误</em>的target,清除target之后重新生成就ok了。...
Axis客户端程序编译时找不到包问题 软件包org.apache.axis.client 不存在
刚开始以为是环境配置有问题,按照下面的配置方法配置了一遍结果还是不能编译成功。AXISHOME,AXISLIB,AXISCLASSPATH,TOMCAT_HOME都已配置,包括下面所说的将tomcat的servlet.jar添加到系统classpath后面,结果还是不能编译总是报上面的<em>错误</em>。最后想起来在配置servlet时需要将servlet-api.jar commons-fileupload-...
程序包 javax.servlet 不存在 解决办法
From:http://shuhui018125.blog.163.com/blog/static/77110502008102525238433/ 编译一个包含有javax.servlet包的java文件, package chapter4; import java.io.IOException; import java.io.PrintWriter; import
Maven项目编译显示:程序包org.junit不存在错误
 检查junit所用依赖是否为最新版本,如果不是最新版本会包<em>程序包</em>org.junit<em>不存在</em><em>错误</em>。 到网址查找http://mvnrepository.com/  输入junit查找   &amp;lt;dependencies&amp;gt;     &amp;lt;dependency&amp;gt;             &amp;lt;groupId&amp;gt;junit&amp;lt;/groupId&amp;gt;          ...
使用Jsoup时报错,提示Jsoup相关类不存在
在实际开发时,会出现使用Jsoup时报错,提示Jsoup相关类<em>不存在</em>!分析原因,是SDK和ADT版本的原因。解决这样的问题,如果你想使用Jsoup解析HTML,我的建议是在项目下建立一个包,包名为libs,然后将下载的Jsoup的jar包粘贴到libs包下,然后再将libs包下的jar包添加到项目中。 交流探讨到我的新浪微博:http://weibo.com/tianrui1990
Android frameworks添加资源后编译报错:找不到添加的内部资源 com.android.internal.R
问题描述: Android开发中常常需要添加一些私有资源,如定义一些字符串 framework/base/core/res/res/values/strings.xml "double 4-core" 编译会报错: frameworks/base/core/java/android/widget/TextView.java:4519: error: cannot fi
Java中,你遇到的错误程序包不存在
1:在学习Java中的package的时候遇到一个这样的问题先编译Cat.java文件: package com.cxue; public class Cat { } 再编译Dog.java文件: public class Dog { public static void main(String[] args){ Cat c = new Cat(); } }编译
【Maven】Maven打包失败,程序包com.sun.deploy.net不存在
1.问题用Maven打包的时候,失败,<em>程序包</em>com.sun.deploy.net<em>不存在</em>;2.代码[ERROR] Failed to execute goal org.apache.maven.plugins:maven-compiler-plugin:3.1:compile (default-compile) on project fxrj-admin: Compilation failure: C
[Android Studio导入第三方类库方法] Error:(19, 23) 错误: 程序包org.apache.http不存在
本文主要参考以下链接: http://m.blog.csdn.net/blog/BoxRice/48575027 https://drakeet.me/android-studio http://www.cnblogs.com/neozhu/p/3458759.html   <em>错误</em>: Error:(19, 23) <em>错误</em>: <em>程序包</em>org.apache.http<em>不存在</em>  原因:发现Andro
程序包xxx不存在 问题的完美解决
1、问题?项目打包报错; <em>程序包</em>com.sun.image.codec.jpeg<em>不存在</em>; 2、原因 尚不明确;由于jdk升级问题。才出现的,可能jdk6就不会出现;初步怀疑jdk的问题; 3、解决方案 通过配置maven-compiler-plugin插件可以解决此问题。   &amp;lt;plugin&amp;gt; &amp;lt;groupId&amp;gt;org.apa...
org.apache.http不存在的问题
Android sdk 22 以后删除了httpClient的jar包,如果您的项目较老,请使用以下引用:useLibrary 'org.apache.http.legacy'或者下载:httpclient.jar否则会出现以下<em>错误</em>: Error:(8, 23) <em>错误</em>: <em>程序包</em>org.apache.http<em>不存在</em> Error:(38, 9) <em>错误</em>: 找不到符号 符号: 类 Header 位置:
Maven项目编译显示:程序包org.junit不存在
如果在使用 mvn clean install 命令时出现此<em>错误</em>,首先要检查 pom 文件的对应依赖是否作用域是否限定。比如 junit junit ${junit.version}</v
热修复引入包错误修复
问题描述: 解决思路 1.本地引入 2.尝试恢复代码到上一个分支 3.怀疑gradle配置问题 4.参考官方demo。 引发的其他问题: 问题描述: 之前编译热修复的项目都好好的,今天在编译的时候,发现提示 Error:(3, 37) <em>错误</em>: <em>程序包</em>com.tencent.tinker.loader.app<em>不存在</em> 隐约觉得是我所使用的热修复sdk,bugly有更新,而这...
解决java编译错误程序包javax.servlet不存在javax.servlet.*)
先把Tomcat下的lib文件夹里面的servlet-api.jar路劲添加到classpath下,然后再把servlet-api.jar拷贝到JDK路劲的jre\lib\ext文件夹下即可。
IDEA编译报错“程序包XXX不存在
pchat-center子模块要导入 pchat-user 的jar包 pchat-center的pom文件如下: pchat-center子模块包依赖了pchat-user子模块包 代码如下: 代码没显示任务异常,没有标红显示。 maven编译结果如下: 明明引入了pchat-user包,而且显示成功引入了,maven本地库也有这个jar包 <em>错误</em>原因是pchat...
程序包android.support.multidex不存在解决方案
如题,我遇到这个问题是这样的,升级了as到2.3后,在6.0以上的系统打包就会遇到这个问题,但是在6.0以下的系统打包没问题,解决方案如下: 在build.gradle文件里加上compile 'com.android.support:multidex:1.0.1'即可!!!
maven junit.framework不存在问题解决
问题 在使用maven进行一个工程的编译,已加入junit包的依赖,编译的时候却总是报“junit.framework<em>不存在</em>”<em>错误</em>。 pom.xml中junit包加入如下: junit junit 4.12 test 解决 试了N多方法,包括加入junit-dep包,依然解决不了问题,后来在加ju
AndroidStudio开发中出现程序包org.apache.http不存在的问题
1、出现的情况在eclipse 或 Android Studio开发中,设置 Android SDK 的编译版本为23时,且使用了httpClient相关类的库项目:如android-async-http等等,会出现一些类找不到的<em>错误</em>。2、原因Android 6.0(api 23) SDK,不再提供 org.apache.http.*(只保留几个类)。3、解决方法在libs中加入 org.apach
程序包org.apache.http不存在
下载链接:http://download.csdn.net/detail/u010213127/8490911 commons-codec-1.6.jar commons-logging-1.1.1.jar fluent-hc-4.2.5.jar httpclient-4.2.5.jar httpclient-cache-4.2.5.jar httpcore-4.2.4.jar
android studio gradle 错误 找不到程序包 符号
问题:android studio gradle <em>错误</em> 找不到<em>程序包</em> 符号 解决:原因是library工程的build.gradle含有release,只要把其注释即可 buildTypes { release { minifyEnabled true proguardFiles 'proguard-project.txt' signingConfig signingConfigs.m
程序包xxx不存在,找不到符号
使用mvn命令打包时发现<em>程序包</em>xxx<em>不存在</em>,找不到符号。发现是因为maven编译时只加载maven库中的jar包,而手动添加到lib下的包maven无法自动加载。 解决办法: 在pom.xml文件中添加配置: org.apache.maven.plugins</g
程序包oracle.jdbc.driver不存在 的解决办法
C:\Users\user>javac -encoding utf-8 des.java des.java:87: <em>错误</em>: <em>程序包</em>oracle.jdbc.driver<em>不存在</em> DriverManager.registerDriver(new oracle.jdbc.driver.OracleDriver()); ^ des.java:107: <em>错误</em>: <em>程序包</em>oracle.jdbc.drive
ant 打包时,软件包 javax.servlet.http 不存在解决方法
把servlet-api.jar拷贝到jdk安装目录下jre\lib\ext\,重新使用ant -f build.xml 命令打包即可.
程序包org.apache.http不存在的解决方法
当在ecplise中的代码转到Android studio 中开发的时候之前的代码会报错<em>错误</em>提示Error:(7, 23) <em>错误</em>: <em>程序包</em>org.apache.http<em>不存在</em> Error:(8, 36) <em>错误</em>: <em>程序包</em>org.apache.http.client.utils<em>不存在</em> Error:(76, 52) <em>错误</em>: 找不到符号 符号: 类 NameValuePair 位置: 类 Netwo
Intellij IDEA配置maven项目中出现的“程序包org.junit不存在错误
今天在创建springboot时出现“<em>程序包</em>org.junit<em>不存在</em>”<em>错误</em>,具体表现在 测试 @Test都找不到包在网上查了下将,说是去掉scope就行[java] view plain copy  [java] view plain copy&amp;lt;dependency&amp;gt;             &amp;lt;groupId&amp;gt;junit&amp;lt;/groupId&amp;gt;           ...
不存在"的解决">javac编译出现“找不到符号”和"软件包不存在"的解决
一      如下图;目录下三个java文件;javac单独编译前2个成功,第三个时出现“找不到符号”; 因为第三个会用到前两个;要一次性输入所有java文件;或者 javac *.java;如图的下部,编译成功;产生了3个class文件; 二 javac编译servlet下所有文件,出现 软件包<em>不存在</em>,49个<em>错误</em>; 三  查看classpath环境变量
Maven多模块打包报错程序包不存在
Failed to execute goal org.apache.maven.plugins:maven-compiler-plugin:3.1:compile (default-compile) on project client: Compilation failure: Compilation failure: [16,11] 找不到符号 解决方法添加插件: &amp;lt;build&amp;gt; ...
程序包org.junit不存在的解决方案
原因:个人考虑产生此<em>错误</em>的原因是因为Eclipse中对于测试和开发的鉴定不明?Intellij中没有<em>错误</em>,因为Intellij对项目的管理就是同Maven结构的。解决方案:原来的junit的scope是test,可以将它注释后作为临时的解决方案: &amp;lt;dependency&amp;gt; &amp;lt;groupId&amp;gt;junit&amp;lt;/groupId&amp;gt; ...
在VC6.0中用GDI+调用png图片实现半透明渐变的特效窗口下载
在VC6.0中用GDI+调用png图片实现半透明渐变的特效窗口 相关下载链接:[url=//download.csdn.net/download/hai_zi/170190?utm_source=bbsseo]//download.csdn.net/download/hai_zi/170190?utm_source=bbsseo[/url]
visual basic完全自学宝典下载
很烦人啊,还要打20个字,晕啊啊啊啊啊啊啊啊 相关下载链接:[url=//download.csdn.net/download/ai540881/2071275?utm_source=bbsseo]//download.csdn.net/download/ai540881/2071275?utm_source=bbsseo[/url]
使用临界区对象(CriticalSeciton)实现线程同步下载
使用临界区对象(CriticalSeciton)实现线程同步。MFC工程 相关下载链接:[url=//download.csdn.net/download/tgyea/2282472?utm_source=bbsseo]//download.csdn.net/download/tgyea/2282472?utm_source=bbsseo[/url]
文章热词 机器学习教程 Objective-C培训 交互设计视频教程 颜色模型 设计制作学习
相关热词 mysql关联查询两次本表 native底部 react extjs glyph 图标 微信小程序包你说开发教程 学习java容易犯的错误
我们是很有底线的