opencv安装问题 [问题点数:40分]

Bbs1
本版专家分:20
结帖率 40%
Bbs1
本版专家分:0
用MinGW编译opencv时出错解决办法:(gcc 7.1.0 and cmake 3.9.0)->出错提示: windres.exe: unknown option -- W
环境Windows 7 x64 按照网上的教程安装qt和<em>opencv</em>的过程中,对<em>opencv</em>-3.4.0源码进行编译时,出现如下错误   &amp;gt; make [ 2%] Built target zlib [ 5%] Built target libtiff [ 8%] Built target libjpeg [ 16%] Built target libwebp [ 19%] B...
用CMake配置项目出错,求指导
1、错误代码: include_directories given empty-string as include directory. cmake语句:include_directories("${
使用cmake搭建CodeBlocks+OpenCV3.2环境时,mingw32-make出现的问题
-
make[2]: *** [modules/core/CMakeFiles/opencv_core.dir/src/system.cpp.o] 错误 1
编译<em>opencv</em>3.4.10时出现 /<em>opencv</em>-2.4.10/modules/core/src/system.cpp:280:10: 错误: ‘asm’中操作数约束不一致 在全局域: cc1plus: 警告: 无法识别的命令行选项“-Wno-unnamed-type-template-args” [默认启用] cc1plus: 警告: 无法识别的命令行选项“-Wno-delete-
初涉opencv——opencv安装问题
安装,测试<em>opencv</em>
关于opencv安装问题
我在vc.6下面安装<em>opencv</em>就是装不上去,我是按照安装文档进行安装的,1:安装openv  2配置window 环境变量 3全局设置 4项目设置  但是我运行<em>opencv</em>下面自带的例子的时候就是运行不了,提示cv110.dll没有找到.rn补充: 我上网查看了一下 有的人在配置好了以后你要执行_make文件,生成相应的lib,和dll文件  我是新手请大家帮帮我吧!!
ubuntu opencv 安装问题
<em>opencv</em> 安装make的时候出现如下错误:rn/usr/lib/libgstreamer-0.10.so.0: undefined reference to `xmlOutputBufferCreateFile@LIBXML2_2.4.30'rn/usr/lib/libgstreamer-0.10.so.0: undefined reference to `xmlNodeGetContent@LIBXML2_2.4.30'rn/usr/lib/libgstreamer-0.10.so.0: undefined reference to `xmlNewChild@LIBXML2_2.4.30'rn/usr/lib/libgstreamer-0.10.so.0: undefined reference to `xmlNewDocNode@LIBXML2_2.4.30'rn/usr/lib/libgstreamer-0.10.so.0: undefined reference to `xmlParseCharEncoding@LIBXML2_2.4.30'rn/usr/lib/libgstreamer-0.10.so.0: undefined reference to `xmlParseFile@LIBXML2_2.4.30'rn/usr/lib/libgstreamer-0.10.so.0: undefined reference to `xmlSearchNsByHref@LIBXML2_2.4.30'rn/usr/lib/libgstreamer-0.10.so.0: undefined reference to `xmlFindCharEncodingHandler@LIBXML2_2.4.30'rn/usr/lib/libgstreamer-0.10.so.0: undefined reference to `xmlSaveFormatFileTo@LIBXML2_2.4.30'rn/usr/lib/libgstreamer-0.10.so.0: undefined reference to `xmlParseMemory@LIBXML2_2.4.30'rn/usr/lib/libgstreamer-0.10.so.0: undefined reference to `xmlFree@LIBXML2_2.4.30'rn/usr/lib/libgstreamer-0.10.so.0: undefined reference to `xmlDocGetRootElement@LIBXML2_2.4.30'rn/usr/lib/libgstreamer-0.10.so.0: undefined reference to `xmlFreeDoc@LIBXML2_2.4.30'rn/usr/lib/libgstreamer-0.10.so.0: undefined reference to `xmlNewNs@LIBXML2_2.4.30'rn/usr/lib/libgstreamer-0.10.so.0: undefined reference to `xmlNewDoc@LIBXML2_2.4.30'rncollect2: ld returned 1 exit statusrnmake[2]: *** [bin/<em>opencv</em>_test_calib3d] Error 1rnmake[1]: *** [modules/calib3d/CMakeFiles/<em>opencv</em>_test_calib3d.dir/all] Error 2rnmake: *** [all] Error 2rn求高手帮助?
CUDA 和opencv安装问题
CUDA 和<em>opencv</em><em>安装问题</em>
【小白求助】Qt下的OpenCV安装问题
本人新手,最近研究Qt。准备做计算机视觉方面的东西,选择了OpenCV。不废话,网上找到安装方法,如下:rn===============================rn在Qt Creator中使用OpenCV库 (Windows 7系统下编译成功)rnrn  编译OpenCV2.0rnrn  1  下载tdm-mingw-1.908.0-4.4.1-2并安装,安装完毕添加bin到系统路径。rnrn  2   安装Opencv2.0 windows版本rnrn  3   安装CMakernrn  4  打开CMake,配置源码与目标路径,选择MinGW Makefiles,生成目标Makefilernrn  5   进入设置好的目标路径,make,直至生成所有的库rnrn配置Qt Creatorrnrn  Qt开发的程序一般需要借助qmake生成makefile文件。由于qmake在解析路径的时候不能识别空格, 因此需要确保OpenCV的安装路径中不能包含空格(C:\Program Files\OpenCV是不行的)。rnrn  在创建工程文件的时候(这里假设为hello.pro,后缀为pro),向工程中添加以下语句:rnrnINCLUDEPATH +=  D:\Qt\OpenCV-2.0.0\include\<em>opencv</em> rnLIBS +=  D:\Qt\OpenCV-2.0.0\lib\libcv200.dll.a\rn        D:\Qt\OpenCV-2.0.0\lib\libcxcore200.dll.a\rn        D:\Qt\OpenCV-2.0.0\lib\libml200.dll.a\rn        D:\Qt\OpenCV-2.0.0\lib\libcvaux200.dll.a\rn        D:\Qt\OpenCV-2.0.0\lib\libhighgui200.dll.a rnrn  这样,在Qt中就可以使用Opencv 2.0 了。rn========================================rn现在有两个问题,这方法是在windows7下的,第五步说make...不知如何make?(高手不要见笑,这方面接触不多,真不懂)rn第二个问题,在.pro中添加,这些文件在安装完OpenCV的时候就有,有什么不同。直接添加为什么编译不了?rnrnrn请高手帮我解决啊~~
opencv的安装
先下载到1.<em>opencv</em>和2.<em>opencv</em>_contrib,直接放在系统目录下 然后开始安装: sudo apt-get install build-essential sudo apt-get install cmake git pkg-config libgtk2.0-dev libavcodec-dev libavformat-dev libswscale-dev sudo ap
linux安装opencv时make出错
Built target libwebp Built target <em>opencv</em>_test_core_pch_dephelp Built target <em>opencv</em>_core_pch_dephelp
codeblocks-MinGW-4.8.1+opencv3.0+cmake遇到的问题及解决办法
首先设置环境变量,包含mingw的一些路径,minGW路径为E:\CodeBlocks\MinGW Include :E:\CodeBlocks\MinGW\include; Lib:E:\CodeBlocks\MinGW\lib; Path:E:\CodeBlocks\MinGW\bin;E:\CodeBlocks\MinGW\libexec\gcc\mingw32\4.8.1;E:\Co
在ubuntu下配置opencv,cmake成功了,而make时候报错
-
linux安装opencv是make出错
-
树莓派编译OpenCV时libgtk2.0-dev安装问题
新手使用树莓派,需要安装OpenCV环境,当然需要自己编译OpenCV了。这就很尴尬啊,不会啊。 为了搭建,熬了几个晚上。碰到问题也是一一的解决。 其中推荐两个教程。这是国外一个教程,做的真是好用。编译一定去看下,过程超详细,就是慢慢看英文挺郁闷的,这里介绍了树莓派下编译OpenCV3.1+python2.7/3.1的过程。假如感觉不行可以看中文教程,没有那个详细,能用,但是容易出错。有这两个
安装问题
在安装redhat linux7.1时,可以正常安装,但安装完后启动linux时不能启动,在读取硬盘引导记录时出错,在屏幕上显示"LI"后就不启动?rn
安装问题
安装linux Redhat6.1 显卡和显示器总是配不好rn显卡trident 9880rn显示器 hp D8894arn用xconfigurator 配置时列表里都没有.rn我该怎末办?rn
安装问题!
配置 rnpIII 733 rn内存 256rn硬盘 80Grnrn系统 win2000serverrnrn已有sql2000 打算再装个Oracle9i 不知道可不可以啊!!会不会有什么冲突啊!?
opencv recipe for target 'all' failed解决
<em>opencv</em> recipe for target 'all' failed解决
安装opencv3.2.0 cmake出现 CMakeFiles/Makefile2:1264: recipe for target 'modules/cudev/test/CMakeFiles/o
问题:CMakeFiles/<em>opencv</em>_test_cudev.dir/<em>opencv</em>_test_cudev_generated_test_arithm_func.cu.o:在函数‘testing::internal::TypeParameterizedTest&amp;lt;SqrtTest, testing::internal::TemplateSel&amp;lt;SqrtTest_GpuMat_Test&amp;g...
'modules/cudalegacy/CMakeFiles/opencv_cudalegacy.dir/all' failed
2018年02月03日 22:56:20阅读数:300 在编译安装<em>opencv</em>3.1时可能会报错modules/cudalegacy/CMakeFiles/<em>opencv</em>_cudalegacy.dir/build.make:290: recipe for target ‘modules/cudalegacy...
我用Cmake编译opencv3.0一直在97%的地方出错,万能的大神们,求救啊
这是97%之后的 In file included from C:/Python/include/Python.h:8:0, from C:\<em>opencv</em>\sources\modules\python
opencv安装,cmake完成,make的时候,报错/usr/include/c++/6.2.1/cmath:45:23: 致命错误:math.h
错误代码如下: Generating precomp.hpp.gch/<em>opencv</em>_core_bulid.gch In file included from /home/chenjianwen/ope
(更新v2018.1.24版)Opencv Qt 学习笔记(一)安装qt opencv 环境Win7(cmake3.9.1和Opencv3.3.0)
开始配置: 1.下载所需工具: (1) Qt: https://download.qt.io/official_releases/ (2) OpenCV: http://<em>opencv</em>.org/ (3) CMake: http://www.cmake.org/cmake/resources/software.html 2.安装Qt ;(记得添加环境变量F:\C++\
Caffe+Kubuntu16.04_X64+CUDA 8.0配置
前言:         经过尝试过几次Caffe,theano,MxNet之后,很长时间没有进行caffe的更新,此次在Ubuntu16.04下安装Caffe,折腾了一天时间,终于安装成功。        既然使用了最新版本,必然使用最新版本的CUDA,且只有CUDA8.0给了ubuntu16.04支持。
为什么我在linux系统PC端编译OpenCV,用的是cmake-gui,make到这个地方的时候就总是报错过不去
Building CXX object modules/highgui/CMakeFiles/<em>opencv</em>_highgui.dir/src/window_QT.o /home/fl/tool/Ope
用cmake编译Opencv2.3.1到ARM上面总是出错
我用的交叉编译工具是arm-linux-gnueabihf-4.7.3每次编译到Linking CXX shared library ../../lib/lib<em>opencv</em>_core.so 就会报错
安装问题
现在到分区的时候了,不知道该选哪一个,我是从硬盘安装的,C盘为2000系统,D盘有6。5G,为FAT32格式,想把LINUX放在这里,我选D盘,然后选删除,是不是?然后下面有“新增”,“修改”,“删除”,“RAID”,“确定”,“上一步”,这几个项,现在要做的是把D盘搞成EXT3格式,然后再分一个SWAP区出来?如何操作?
centos7 make[2]: *** [modules/highgui/CMakeFiles/opencv_highgui.dir/src/grfmt_jpeg2000.cpp.o] 错误 1
问题描述: [plain] view plain copy [ 17%] Building CXX object modules/highgui/CMakeFiles/<em>opencv</em>_highgui.dir/src/grfmt_jpeg2000.cpp.o   In file included from /usr/include/jasper/j
Linux 安装OpenCV2.4.11 make的时候报错
Generating core.cpp Generating imgproc.cpp Generating objdetect.cpp File "/<em>opencv</em>/<em>opencv</em>-2.4.11/mod
cmake配置opencv的时候出现的错误及解决方法
cmake 配置<em>opencv</em>的时候出现的错误: -- Detected version of GNU GCC: 54 (504) -- Found ZLIB: /usr/lib/i386-linux-gnu/libz.so (found suitable version &amp;quot;1.2.8&amp;quot;, minimum required is &amp;quot;1.2.3&amp;quot;) -- Could NOT find TIFF (m...
linux安装opencv,执行cmake .报错
-
cc1plus: warning: command line option ‘-Wstrict-prototypes’ is valid for C/ObjC but not for C++
输入pip install pyv8报错Collecting pyv8 Using cached PyV8-0.5.zip Building wheels for collected packages: pyv8 Running setup.py bdist_wheel for pyv8 ... error Complete output from command /home/as/an
CMake出现问题(在安装opencv时)
我按照http://blog.csdn.net/msq19895070/article/details/24477575 这篇博客进行交叉编译<em>opencv</em>,前边安装各种依赖库的时候都没有问题,就是在进
Configuring incomplete, errors occurred
yum install -y gcc yum install -y gcc-c++
安装opencv+qt+cmake时出现的问题
https://blog.csdn.net/sinat_36264666/article/details/73200739 跟着这篇教程安装时出现的问题 1,各个软件的版本不是太对应,会出现问题 2,打开cmake时,没用管理员模式会出现错误 3,命令行时,不用管理员模式会出现错误 后来3又出现了新的问题 大概是报出了这种错误: mingw32-make[2]: *** [modul...
OpenCV使用CMake和MinGW-w64的编译安装
前言 之前写过的一篇博文:OpenCV使用CMake和MinGW的编译安装及其在Qt配置运行 是使用 32 位的 MinGW 在 Windows 下编译 OpenCV 生成 32 位的 dll。 而这篇博文是使用 64 位的 MinGW 编译 OpenCV 生成 64 位的 dll。 因为博主没有 64 位 qmake,所以没勾选 WITH_QT 编译好的 OpenCV(MinGW 版...
使用pycharm进行opencv编程时代码无法自动补全问题
win+R进入命令行窗口,输入以下代码即可: pip install <em>opencv</em>-python pip install <em>opencv</em>-contrib-python pip install pytesseract
安装问题?
在Linux安装过程中,出现 rn./configurernmakernmake installrnrn分别是什么意思,请解释一下?rn
ubuntu编译opencv3.4.1遇到 [modules/imgcodecs/CMakeFiles/opencv_imgcodecs.dir/all] 错误 2
记录一下ubuntu编译<em>opencv</em>3.4.1遇到问题 重新编译了一下<em>opencv</em>3.4.1遇[modules/imgcodecs/CMakeFiles/<em>opencv</em>_imgcodecs.dir/all] 错误 2 需要安装这个包   libopenexr-dev
编译ROS的package包出错,提示recipe for target 'all' failed
最近在学习ROS机器人操作系统,尝试自己新建node,发现编译始终不通过贴出问题代码/usr/lib/gcc/x86_64-linux-gnu/5/../../../x86_64-linux-gnu/crt1.o: In function `_start': (.text+0x20): undefined reference to `main' collect2: error: ld return...
makefile老是报“recipe for target xxx”错误,不妨先看看编码是否正确
编写内核模块,make出错。在排除了makefile语法错误,路径错误之后,依然显示“recipe for target xxx”的错误信息时,也许你该怀疑一下你makefile所用的编码了。(如果你的makefile是直接从网上复制来的,先在window下,用写字板看看是否有乱码吧,“空格”的乱码很有可能就是你错误的罪魁祸首) ---------以下是我的悲惨经历,写给大家,尤其是和我一样的新
makefile老是报“recipe for target xxx”错误,不妨先看看编码有空格
makefile老是报“recipe for target xxx”错误,不妨先看看编码是否正确 2015年11月06日 15:49:50 阅读数:61306 编写内核模块,make出错。在排除了makefile语法错误,路径错误之后,依然显示“recipe for target xxx”的错误信息时,也许你该怀疑一下你makefile所用的编码了。(如果你的makefile是直接从网上复制...
Makefile:295: recipe for target 'perlmodules' failed
chmod a+x net-snmp-config touch net-snmp-config-x make: Entering directory '/home/du/code/snmp/net-s
编译内核 make modules_install时总是报错
root@ubuntu:/usr/src/linux-5.0# make modules_install INSTALL arch/x86/crypto/aegis128-aesni.ko At ma
编译ss5时出错Makefile:32: recipe for target 'ss5' failed
-
请教各位大神,cygwin下makefile中的recipe for target 'all' failed是什么原因?
Makefile: CC=gcc TARGET=tdd.exe OBJ=*.o SRC=ledDriver/ledDriverTest.c\ ledDriver/ledDriverTestRunner
Makefile:xxx: recipe for target xxx failed +【顺带搞懂了】如何忽略makefile执行过程中的某些命令的错误而得以继续运行
http://www.crifan.com/make_makefile_recipe_for_target_failed_omit_error_while_executing_makefile/ 在Cygwin中,执行makefile,其中调用hhc从hhp文件生成chm文件。 结果最后一步出错: ? 1 2 3 4 5
【caffe install】recipe for target 'xxx' failed
配置caffe的时候,老是出现这样的问题。 刚开始以为自己哪里参数没有修改。后来细看error,发现只是路径错了。 问题: -- Install configuration: "" -- Installing: /usr/local/lib/libgflags.a CMake Error at cmake_install.cmake:36 (file):   file INSTALL
[7]_编译内核错误提示2:recipe for target 'kernel/timeconst.h' failed 和 "mkimage" command not found - U-Boot
recipe for target 'kernel/timeconst.h' failed "mkimage" command not found - U-Boot images will not be built
很感谢这篇文张【已解决】Makefile:xxx: recipe for target xxx failed +【顺带搞懂了】如何忽略makefile执行过程中的某些命令的错误而得以继续运行
转载自http://www.crifan.com/make_makefile_recipe_for_target_failed_omit_error_while_executing_makefile/ 【问题】 在Cygwin中,执行makefile,其中调用hhc从hhp文件生成chm文件。 结果最后一步出错: Administrator@K470 /cygd
OpenCV-2.4.2 安装三步曲
注意:本人未使用  ffmpeg 的全部依赖库,比如AAC 音频编码库(libfaac-dev),MP3 编码库(ibmp3lame-dev),具体的配置为: ./configure --enable-shared --enable-gpl --enable-version3 --enable-nonfree --enable-x11grab --enable-libx264 --enable-
Makefile:160: recipe for target 'all' failed (Ubuntu 16.06 + Opencv3.2)解决办法
前言之前一直用的<em>opencv</em> 好好的,今天安装了anaconda之后,python中的<em>opencv</em>不能用了,即便是拷贝cv2.so之后也是不能用,问题如下:根本原因安装anaconda之后,很多默认的编译器都变成了anaconda自带的了,比如python和gcc等。那么系统中的python安装的东西自然是用不了的,刚开始没发现这个问题,一怒之下就把<em>opencv</em>给卸载了,当发现这个问题的时候,已经
linux安装opencv时make又出错
-
Makefile:138: recipe for target 'all' failed make: *** [all] Error 2
ROS中出现这种情况,看下是不是功能包中的路径没有设置好,打开该功能包的CMakeLists.txt,编辑 ## Specify additional locations of header files ## Your package locations should be listed before other locations include_directories(   #include...
Makefile:160: recipe for target 'all' failed(ubuntu16.04+opencv3.4+gcc5.4.0)
安装并编译的步骤如下 1、 Download OpenCV 3.4.0 from https://github.com/<em>opencv</em>/<em>opencv</em>/archive/3.4.0.zip wget https://github.com/<em>opencv</em>/<em>opencv</em>/archive/3.4.0.zip 2、 Unzip it and create a build folder: sudo...
解决ubuntu 下opencv与cuda冲突的问题
Error 1 Error 2
安装问题..
想学C#.rn怎么安装我都不知,rn.net有7张盘,是不是要全装.rnrn这问题太弱..勿笑
java对xml 增,删,改下载
java操作XML very good very strong 相关下载链接:[url=//download.csdn.net/download/pppyang/2228209?utm_source=bbsseo]//download.csdn.net/download/pppyang/2228209?utm_source=bbsseo[/url]
Javascript银行家算法下载
用Javascript实现的银行家算法,支持动态设置资源数、进程数,可以随机生成资源分配和需求,也可对随机生成进行更改。 相关下载链接:[url=//download.csdn.net/download/dying318/3989090?utm_source=bbsseo]//download.csdn.net/download/dying318/3989090?utm_source=bbsseo[/url]
C#程序员参考手册下载
《C#程序员参考手册》是一本详细讲解c#开发语言的书籍。很适合初学者,帮助做好基础工作。一共28章 相关下载链接:[url=//download.csdn.net/download/george_lijz/5665385?utm_source=bbsseo]//download.csdn.net/download/george_lijz/5665385?utm_source=bbsseo[/url]
相关热词 c#检测非法字符 c#双屏截图 c#中怎么关闭线程 c# 显示服务器上的图片 api嵌入窗口 c# c# 控制网页 c# encrypt c#微信网页版登录 c# login 居中 c# 考试软件
我们是很有底线的