大神救命啊,老是出现undefined reference 但是又找不到错误的原因 [问题点数:40分]

Bbs1
本版专家分:0
结帖率 0%
Bbs8
本版专家分:30206
Blank
黄花 2014年9月 C/C++大版内专家分月排行榜第二
2010年6月 Linux/Unix社区大版内专家分月排行榜第二
Blank
蓝花 2010年7月 Linux/Unix社区大版内专家分月排行榜第三
Bbs6
本版专家分:6469
报错:from .. import deform_conv_cuda
运行mmdetection的测试程序时,报错: File "/home/abing/anaconda3/lib/python3.6/site-packages/mmdet-0.6rc0+85c30cc py3.6.egg/mmdet/ops/dcn/functions/deform_conv.py", line 5, in from .. import deform_conv_cuda 解决办...
CUDA9.0环境mmdetection V0.5.7安装(踩坑)
直接上干货,CUDA9.0版本对应的pytorch是0.4.1,使用其他版本pytorch不支持,一定要安装0.4.1版本,github上的mmdetection安装对应CUDA9.0的在branch0.4.1里,但是注意!!!!!!!!!!github上不知道为什么,pytorch0.4.1分支里的少一些文件我安装了好几次进到提示少deform_conv_cuda等文件,又对比主分支才发现少了很...
/opt/ros/kinetic/lib/x86_64-linux-gnu/libopencv_imgcodecs3.so.3.3.1:对‘TIFFReadRGBAStrip@LIBTIFF_4.0’
/opt/ros/kinetic/lib/x86_64-linux-gnu/libopencv_imgcodecs3.so.3.3.1:对‘TIFFReadRGBAStrip@LIBTIFF_4.0’未定义的引用 /opt/ros/kinetic/lib/x86_64-linux-gnu/libopencv_imgcodecs3.so.3.3.1:对‘TIFFReadDirectory@LIBTI...
为什么已经包含头文件了,还出现undefined reference
为什么已经包含头文件T1.h了,编译的时候还<em>出现</em>: E:\project\ACR3901U-S1\ACR3901\AppBin/../FSL/KSL/TPDU_Common/TPDU_Common.
undefined definition reference to XXX
关于QT creater 中编辑报错 <em>undefined</em> definition <em>reference</em> to XXX 的小小总结。 1.在Qt中自定义了类classname,想要使用Qt自带的信号与槽机制,所以必须要将classname继承于QObject。 class classname : public QObject { Q_OBJECT public:
ROSBUG:libopencv_imgcodecs3.so.3.3.1: undefined reference to `TIFFReadDirectory@LIBTIFF_4.0`
ROS安装完后会安装一个opencv,但是自己也安装了一个opencv, 于是可能这两个opencv可能就产生了冲突。ROS默认调用的是自带的opencv。 解决办法: 查<em>找</em>libopencv_imgcodecs3.so.3.3.1依赖的库: ldd /opt/ros/kinetic/lib/x86_64-linux-gnu/libopencv_imgcodecs3.so.3.3.1 输出: l...
ros程序编译中出现的问题
roscore引用Python的yaml时<em>出现</em>格式问题 Ubuntu16.04本身就有Python2.7和Python3.5的版本,我安装caffe时安装了anaconda。所以环境中就有多个版本。 ros在运行内核时,本身调用的Python2.7的程序。但是由于环境变量PYTHONPATH的设置问题,调用yaml是从Python3.6的包中寻<em>找</em>的,这样就<em>出现</em>了格式<em>错误</em>。修改的方法是/etc/b...
小记:ROS中写死opencv版本的坑
对于报错:‘/opt/ros/kinetic/lib/x86_64-linux-gnu/libopencv_imgcodecs3.so.3.3.1:对‘TIFFReadRGBAStrip@LIBTIFF_4.0’未定义的引用’ 记录下opencv版本管控的命令和方法,参考https://blog.csdn.net/xunan003/article/details/82144924 pkg-co...
【安装Caffe】
make all这一步<em>出现</em>的文艺,目前没有<em>找</em>到解决办法 LD -o .build_release/lib/libcaffe.so.1.0.0 CXX tools/extract_features.cpp CXX/LD -o .build_release/tools/extract_features.bin .build_release/lib/libcaffe.so: <em>undefined</em> ref...
undefined reference to `png_init_filter_functions_neon'
参考:https://sourceforge.net/p/libpng/bugs/230/https://github.com/opencv/opencv/issues/7600报错:<em>undefined</em> <em>reference</em> to `png_init_filter_functions_neon'交叉编译 opencv3.3.1 ffmpeg libpng修改${HOME}/opencv-3.3.1/...
[caffe安装失败问题解决]Undefined reference to ‘__cudaPopCallConfiguration’
ubuntu16.04,按照网上好多教程一步步安装caffe时(安装cuda10.0),在sudo make all -j8报错如下: Undefined <em>reference</em> to ‘__cudaPopCallConfiguration’ Undefined <em>reference</em> to ‘__cudaPushCallConfiguration’ 在网上查了好久也没<em>找</em>到<em>原因</em>,google半天在g...
求助关于CUDA环境配置的问题
大家好。我之前使用了开勇的wizard建立工程,很顺利。 但是现在我要在一个大项目里的某个文件建立CUDA的编译和运行环境。 我按照http://blog.csdn.net/booksky508/ar
kinetic版本ros安装find_object_2d编译报错libopencv_imgcodecs3.so.3.3.1:对‘TIFFReadRGBAStrip@LIBTIFF_4.0’
Ubuntu16.04、kinetic版本在ros中下载安装find_object_2d的包,编译时报错 主要的<em>原因</em>是我系统上安装的是opencv3.4.4的版本,ros自带的是opencv3.3.1,应该有了版本冲突: opt/ros/kinetic/lib/x86_64-linux-gnu/libopencv_imgcodecs3.so.3.3.1:对‘TIFFReadRGBAStrip...
caffe 编译/usr/local/lib/libopencv_highgui.so: undefined reference to `TIFFReadRGBAStrip@LIBTIFF_4.0'
caffe编译<em>出现</em> /usr/local/lib/libopencv_highgui.so: <em>undefined</em> <em>reference</em> to `TIFFReadRGBAStrip@LIBTIFF_4.0' 或者 /lib/libcaffe.so.1.0.0-rc5: <em>undefined</em> symbol: ZN2cv8imencodeERKNSt7__cxx1112basic_stringIc
在编译caffe中遇到问题集锦
1.编译时候<em>出现</em> make: * [.build_release/examples/siamese/convert_mnist_siamese_data.bin] Error 1 /usr/local/lib/libopencv_imgcodecs.so: <em>undefined</em> <em>reference</em> to TIFFReadDirectory@LIBTIFF_4.0' /usr/local/lib/
编译caffe时遇到的undefined reference to的问题
在ubantu16.04版本的linux系统中编译caffe时遇到两个<em>undefined</em> <em>reference</em> to的路径问题,在尝试多个方法后,总结解决方法: 1.<em>undefined</em> <em>reference</em> to `google::protobuf::Message::InitializationErrorString() const'  即: 方法一:caffe的预装软件protobuff版
错误总结】LaTex Warning: citation undefined
在编译文档的时候<em>出现</em>了: LaTeX Warning: Citation &amp;quot;*****&amp;quot; on page y <em>undefined</em> on input line * 解决办法 使用 pdflatex 编译 之后使用 bibtex 编译 之后在使用 pdflatex 编译两次 可以之后可以使用bibtex 编译一次 Xelatex 编译两次。解决问题...
win 10 mmdetection 配置
-----2019-7-22 更新 mmdetection 维护人员看来很用心啊,已经适配到了最新的pytorch 1.1 并且修改了编译的方式,看来是要官方支持Windows了,但是目前win下有两个bug 。 sigmoid_focal_loss 和 mask 那个层的编译有问题。官方作者在github 上已经给予了回复。貌似是torch的bug 目前如果想用的话,只能先注释掉相关的代码...
ROS与Python3
本博客总结在Ubuntu16.04中使用ROS和Python3环境时会遇到的一些问题及注意事项。
undefined symbol 无法编译通过 请教高手
程序是个VC输出的汇编代码,没有加SEH时,可以直接用ml编译 但是加了就编译不了了,不知道为什么,代码如下 PUBLIC ?entry@@YAXXZ ; entry EXTRN __SEH_epil
解决问题:LaTex在参考文献Reference中加入网址时出现编译错误
有时候,当我们在Reference中加入一个网址时,编译的时候<em>出现</em> Missing '$' before '}'之类的<em>错误</em>。 这是因为网址中<em>出现</em>了类似 link_link 的内容,解决方式很简单,将上述内容改为 link\_link 编译即可通过。 ...
交叉编译opencv3.2.0
交叉编译opencv3.2.0后连接<em>出现</em>: libopencv_imgcodecs.so: <em>undefined</em> <em>reference</em> to `png_init_filter_functions_neon' 进入到3rdparty/libpng,在CMakeLists.txt最顶端增加: set(ENABLE_NEON ON)
undefined reference to `uuid_unparse@UUID_1.0'
/lib/x86_64-linux-gnu/libblkid.so.1: <em>undefined</em> <em>reference</em> to `uuid_unparse@UUID_1.0'collect2: error: ld returned 1 exit statusMakefile:2311: recipe for target 'glib-compile-resources' failedmake[4]: **...
什么是未定义的引用 / 未解析的外部符号错误? 如何修复它?
What are <em>undefined</em> <em>reference</em>/unresolved external symbol errors? What are common causes and how to fix/prevent them? Feel free to edit/add your own. 转载于:https://stackoverflow.com/questions/12573816/what-is-an-<em>undefined</em>-<em>reference</em>-unresolved-external-symbol-error-and-how-do-i-fix
undefined symbol: __cudaPopCallConfiguration
这个问题不会<em>出现</em>在你编译Cython模块时,是会<em>出现</em>在你编译好的.so文件中。当你运行demo.py时可能会<em>出现</em>。查询资料得知如果CUDA版本在编译和运行时不一致就会有这个问题。但实际上我使用CUDA9.2就几乎肯定会<em>出现</em>这个问题。解决方案是将系统的CUDA版本装为8.0,所以就需要对CUDA版本进行重装。原版的9.2也可以不用卸载,对原来的cuda软连接重新连接到8.0的文件夹中就可以了。 原...
opencv undefined reference to symbol '_ZN2c...异常
opencv <em>undefined</em> <em>reference</em> to symbol '_ZN2c...异常
error HTTP: undefined
用的是uploadify2.1.4版本,在我电脑的火狐浏览器上可以实现,在我同学的电脑上就会<em>出现</em>图片中的问题,不知道问题出在哪儿,求解答 部分代码如下<!DOCTYPE HTML PUBLIC "-
tf_listener编译失败,undefined reference to 'ros:: ……'
执行catkin_make命令后,<em>出现</em>如下报错: [ 25%] Linking CXX executable tf_listener CMakeFiles/tf_listener.dir/src/tf_listener.cpp.o: In function `transformPoint(tf::TransformListener const&amp;)': tf_listener.cpp:(....
解决caffe编译时//usr/lib/x86_64-linux-gnu/libSM.so.6: undefined reference to `uuid_unparse_lower@UUID_1.0
我在编译安装RefineDet的caffe版遇到//usr/lib/x86_64-linux-gnu/libSM.so.6: <em>undefined</em> <em>reference</em> to `uuid_unparse_lower@UUID_1.0' 我的编译环境时anaconda2,python2.7,ubuntu16.04 RefineDet$ make -j8 输出: CXX/LD -o .buil...
求解奇怪的问题 Undefined symbol:
我准备做一个动态列表 照着书上写了一个函数 SeupListItemsL() { CTextListBoxModel* model= iListBox->Model(); model->SetOwne
Linux下编译时不到.so文件 解决方法
在linux中.so文件为共享函数库文件,用于动态连接,相当于windows下的dll。如有编译时依赖较多的情况,很容易<em>出现</em><em>找</em><em>不到</em>.so文件的<em>错误</em>。 这类<em>错误</em>的常见提示类型: //usr/lib/x86_64-linux-gnu/libSM.so.6: <em>undefined</em> <em>reference</em> touuid_generate@UUID_1.0' /usr/bin/ld: cannot fi...
undefined reference to ros::package::getPath
ros::package::getPath用法: #include &lt;ros/package.h&gt; std::string path = ros::package::getPath("package_name"); 在 CMakeList.txt 中修改两处: 一是 find_package 模块中加入 roslib,例如 find_package(catkin RE...
OpenCV编译lena项目出错
第一次接触opencv,搭建好了环境,开始编写第一个demo工程,结果编译报错,最后国外<em>大神</em>给出解决方案。 <em>错误</em>信息:-1: error: main.o: <em>undefined</em> <em>reference</em> to symbol 'cv::imread(cv::String const&, int)' :-1: error: note: 'cv::imread(cv::String const&, int)' i
OpenCV 3与ROS兼容、OpenCV多版本共存
OpenCV 3与ROS兼容、OpenCV多版本共存在ubuntu下使用ros和OpenCV的时候,总是会遇到有些程序用的是OpenCV3写的,而有些则用到OpenCV2,而之前每当遇到这种情况,总是很难搞得定。今天就为大家介绍简单的方法能让这些不同的OpenCV版本在你的电脑里兼容。前提条件ubuntu ros indigo cmake工程OpenCV多版本共存官网下载OpenCV 2.和Op
编译时奇怪的引用问题,undefined reference
最近想使用activemq做消息处理,在ubuntu12.04上做客户端 http://activemq.apache.org/openwire-c-client.html 。使用activemq项目
caffe编译报错lib/libopencv_imgcodecs.so: undefined reference to `png_create_read_struct@PNG16_0'等
具体<em>错误</em>描述: /home/xuqiong/anaconda2/lib/libopencv_imgcodecs.so: <em>undefined</em> <em>reference</em> to `png_create_read_struct@PNG16_0' /home/xuqiong/anaconda2/lib/libopencv_imgcodecs.so: <em>undefined</em> <em>reference</em> to `png_se...
Latex编译参考文献报错
我在使用Latex编译参考文献时,当我加了一个新的参考文献后,就开始报错,如下: &quot;LaTeX  Warning: There were <em>undefined</em> <em>reference</em>s.  LaTeX  Warning:  There were multiply-defined labels.&quot; 经过检查,是 IEEE Communications Surveys &amp;amp; Tutorials中...
QT:error: undefined reference to 'xxxx'错误提示,解决方式
当你执行QT程序时,突然报错了这个错 error: <em>undefined</em> <em>reference</em> to 'xxxx' 表示未定义 函数 只需要把头文件里的private slots的指定报错的函数去除了就好了
Ubuntu16.04 报错ImportError: torch.utils.ffi requires the cffi package
报错 from .dcn_v2_func import DCNv2Function File “/root/deepblue/2_MOT/centerNet-deep-sort/CenterNet/src/lib/models/networks/DCNv2/dcn_v2_func.py”, line 9, in from ._ext import dcn_v2 as _backend File ...
DCNV1(pytorch版)理解
argparse:是python用于解析命令行参数和选项的标准模块 例如 python parseTest.py input.txt output.txt --user=name --port=8080 使用步骤: 1:import argparse 2:parser = argparse.ArgumentParser() 3:parser.add_argument() 4:parser.pars...
ubuntu16.04下编译caffe出现.build_release/lib/libcaffe.so: undefined reference to google ::protobuf...的问题
----------------------------------------------------------------------------------------------为什么会<em>出现</em><em>undefined</em> <em>reference</em> to 'xxxxx'<em>错误</em>?首先这是链接<em>错误</em>,不是编译<em>错误</em>,也就是说如果只有这个<em>错误</em>,说明你的程序源码本身没有问题,是你用编译器编译时参数用得不对,你没有指定链接...
C++/nvcc/cuda 编译文件 出现 undefined reference to `cv::String::deallocate()'的解决方法
从<em>错误</em>中可以看出 是CV没用被定义,也就是编译的时候没有包含库 加上 pkg-config --cflags --libs opencv 也就是nvcc -lglut -lGL pkg-config --cflags --libs opencv main.cu 可以解决 如果还是报错 就是没安装Opencv 参考 https://www.cnblogs.com/mypsq/p/6114824....
ubuntu16.04安装orb_slam2 安装填坑
1.OPENCV3.2.0安装包离线包 protobuf-cpp-3.1.0 离线包,无需解压(折腾2天<em>找</em>到的解决方案) 借助CMAKE GUI 以上折腾都没办法,最终配置完成解决方案 cmake_gui方法 https://blog.csdn.net/jindunwan7388/article/details/80397700 所有下载文件上传网盘。 地址如下: openc...
Keil 错误的总结
 stm32 是怎么与FWLIB联系在一起的?     1.main中#include &quot;stm32f10x.h&quot; 2.stm32f10x.h中 #ifdef USE_STDPERIPH_DRIVER   #include &quot;stm32f10x_conf.h&quot; #endif 3.stm32f10x_conf.h中 #include &quot;stm32f10x_adc.h&quot; #include &quot;st...
运行时报 undefined symbol
在so里面调用了主程序里面某个类的static成员函数,运行时报 “<em>undefined</em> symbol:函数名” 这个static成员已经在出程序中实现。请问是什么情况????
【LaTex】LaTeX Warning: Citation xxx on page xxx undefined on input line xxx
此时论文中的参考文献引用全部是“[?]”,可以通过编译两次来生成pdf文件: pdflatex paper bibtex paper pdflatex paper pdflatex paper 大功告成!
ROS mynteye 环境搭建错误汇总
1,ROS Kinetic 会自动安装 OpenCV, JPEG wget https://raw.githubusercontent.com/oroca/oroca-ros-pkg/master/ros_install.sh &amp;&amp; \ chmod 755 ./ros_install.sh &amp;&amp; bash ./ros_install.sh catkin_ws ...
undefined reference to错误如何解决
想写一个在后台监视短信的exe程序, MyStart.cpp #include #include #include // Cons
Ubuntu 16.04上安装Caffe.build_release/lib/libcaffe.so.1.0.0-rc3' failed
PROTOC src/caffe/proto/caffe.proto CXX .build_release/src/caffe/proto/caffe.pb.cc CXX src/caffe/comm
怪事,汇编成这样的结果:undefined symbol:start????
我编了个文件aaaaaaa.asm: title aaaaaaa ;******************************* data segment ;define data segment
Mmdetection踩坑教程
Mmdetection踩坑指南菜鸟初学mmdetection没几天,遇到一堆坑,和大家交流下1.Source not found2.libSM.so.63.import name 'deform_conv_cuda'向paperspace上传文件dtype torch.uint8现在是 不推荐使用,请改用dtype torch.bool(这是中文翻译hhhh)mmdetection训练模型测试模型...
undefined reference to怎么解决的?
"<em>undefined</em> <em>reference</em> to"怎么解决的? 有下面几个文件: tiwei@tiwei-desktop:~/graph$ ls binet.cpp global.cpp graph.c
Ubuntu16.04安装ROS kinetic以及标定工具Kalibr流程
Ubuntu16.04安装ROS kinetic以及标定工具Kalibr流程一、安装ROS Kinetic二、安装kalibr编译期间可能遇到的问题及解决方案: 一、安装ROS Kinetic (官网使用的是ubuntu14.04,所以安装的是ROS indigo,而ubuntu16.04支持的是ROS Kinetic) 网址:http://wiki.ros.org/Installation/Ub...
在运行slam时提示跟opencv以及ros相关未定义的引用的解决方法
在运行修改的slam到96%的时候<em>出现</em>了与opencv相关以及ros相关的未定义的引用 一开始以为是缺少链接库后来经查<em>找</em>发现都存在, 百度了一下有说是与电脑版本里的g++和gcc版本不对应有关,查看了一下自己电脑版本里的g++与gcc版本是对应的 后来怀疑是CMakeLists里出了问题(1)有可能是里面文件的顺序有先后<em>错误</em>检查了一下发现没有 (2)询问了一下<em>大神</em>说应该是与电脑里面的ope...
ROS kinetic版本cv_bridge配置opencv2.4.9与默认opencv3冲突的问题
问题描述:     目前我们学习ros开发普遍的配置是ubuntu14.04 ros indigo版本,但以后是有需要升级到ubuntu16.04 ros kinetic版本的。这几天在尝试在ros kinetic版本配置opencv2.4.9时遇到了opencv和kinetic的cv_Bridge包不兼容的问题,经过查阅博客和调试,问题解决,主要问题在于ros kinetic版本默认使用open...
Citation `xxxxxon page 1 undefined LaTeX
利用 VS code编译latex文档时,并采用bibtex引用参考文献,正文中参考文献全是[?] <em>原因</em>: 没有采用latex -&gt;bibtex-&gt;latex-&gt;latex四次编译顺利进行 解决办法 打开setting.json文件 修改编译方式 打开:file-&gt;p<em>reference</em>-&gt;settings-&gt;打开setting.json文件 ...
关于cuda运行时版本与编译时版本不相符的问题,求帮助QAQ
我现在在跑这个github上的这个程序:https://github.com/rowanz/neural-motifs 我已经在自己的linux服务器上安装了cude9.0(实验室的服务器原配时10.
ubuntu16 (ros kinetic) + opencv2/opencv3兼容问题
https://blog.csdn.net/zbzb1000/article/details/81431685 ubuntu16.04 + OpenCv 2.4.13安装 注意: 最后运行的时候要改成 : g++ -o test_opencv Dis.cpp  -L/usr/local/lib -lopencv_core -lopencv_highgui   推荐: https://w...
ros自带opencv版本与rosnode开发所需版本不一致时解决冲突
先设定好rosnode需要的opencv版本 set(OpenCV_DIR /usr/local/opencv2.4.13.1/share/OpenCV) find_package(OpenCV 2.4.13.1 REQUIRED) 在target_link_libraries前一句添加: find_package(catkin REQUIRED COMPONENTS roscpp...
ROS 加载对OpenCV的依赖报警
根据wiki中的教程,(操作见链接 http://wiki.ros.org/vision_opencv?distro=melodic 中2.Using OpenCV in your ROS code中处理)进行处理 此时执行 catkin_make 报警如下: CMake Error at /opt/ros/indigo/share/catkin/cmake/catkinConfig.cmak...
alsa-lib-1.0.25 make时undefined reference to `atomic_sub'
我正在做的是交叉编译,想移植ALSA到mips的开发板上,使板子能运行ALSA的相关应用 从网上下载了alsa-lib-1.0.25,解压以后开始configure的配置 ./configure --
Ubuntu16.04下opencv2与ROSkinetic中自带opencv3不兼容问题总结
1、背景:从ROSindigo换到ROSkinetic,ROSkinetic中自带的opencv3,与原来indigo中opencv2不一样,所以原来的涉及opencv的程序都出了问题,最近这两天就一直在改兼容性,清明节最后一天了,总结一下关于opencv的一些问题2、代码从indigo移到kinetic后,立马运行了一下,果真不行,然后百度,知道是opencv兼容问题,查到文章一篇:      ...
Ubuntu16.04_ROS_kinetic下如何使用OpenCV2.4
$ cd /opt/ros/kinetic/share/cv_bridge/cmake/ $ sudo gedit cv_bridgeConfig.cmake   if(NOT &quot;include;/usr/local/opencv2.4.10/include/opencv;include;/usr/local/opencv2.4.10/include/opencv2 &quot; STREQUAL &quot; ...
TexStudio提示报错citation undefined的解决
问题:当bib文件中包含待引用的参考文献,并且在tex中正常通过\cite{}引用,却依然提示citation <em>undefined</em>,pdf中显示问号时,怎么解决报错。 解决:删除根目录下的文件,重新编译tex之后即可正常显示。...
python cuda编译出现undefined symbol: THPVariableClass
针对ImportError: /.local/lib/python3.6/site-packages/channelnorm_cuda-0.0.0-py3.6-linux-x86_64.egg/channelnorm_cuda.cpython-36m-x86_64-linux-gnu.so: <em>undefined</em> symbol: THPVariableClass 解决方案:保证导入的模块,impor...
ROS报错:In function `......': xxx.cpp undefined reference to '......'
报错内容如下: MakeFiles/side_detection_node.dir/side_detection_node.cpp.o: In function `roborts_detection::SideDetectionNode::DetectionThread()': side_detection_node.cpp:(.text+0xb71): <em>undefined</em> <em>reference</em> t...
关于使用libtiff的问题
我有一个raw格式的RGB图像数据,大小为1024*1024。现在要把它保存成tiff格式 // 设置图像高度 TIFFSetField(image, TIFFTAG_IMAGEWIDTH, 1024
安装caffe ,undefined reference to `TIFFReadRGBAStrip@LIB解决办法
有时候安装caffe,总会有各种奇怪的问题,像下面这种问题经常<em>出现</em>: [ 97%] Linking CXX executable ssd/ssd_detect /usr/local/opencv3.4/lib/libopencv_imgcodecs.so.3.4.1: <em>undefined</em> <em>reference</em> to `TIFFReadRGBAStrip@LIBTIFF_4.0' /usr/loca...
ROS 自带opencv与已经安装的opencv之间的兼容问题
https://blog.csdn.net/qq_34570910/article/details/78245795
/usr/lib/x86_64-linux-gnu/libopencv_highgui.so.2.4.9: undefined reference toTIFFIsTiled@LIBTIFF_4.0'
今天编译caffe ,本来编译过无数次caffe了,基本坑都能解决的。但这次惹恼我了。一直搞不定。 <em>错误</em>信息是这样的: /usr/lib/x86_64-linux-gnu/libopencv_highgui.so.2.4.8: <em>undefined</em> <em>reference</em> to TIFFIsTiled@LIBTIFF_4.0' /usr/lib/x86_64-linux-gnu/libopencv_hi...
关于ROS编译包中出现的链接错误解决方法
关于ROS中编译功能包<em>出现</em>的链接<em>错误</em>解决方法 问题 Ubuntu16.04以及对应的版本,编译PROBOT_Anno<em>出现</em>了<em>错误</em>主要<em>错误</em>如下 make[1]: *** [PROBOT_Anno/probot_demo/CMakeFiles/moveit_revise_trajectory_demo.dir/all] Error 2 /opt/ros/kinetic/lib/libresource_r...
怎样排除编译错误:Undefined symbol:XXX
我用的是IBM编译器, xlC_r -g -qflag=w:w -qrtti=dynamiccast -O -o .libs/AO AO-AO.o -L../../../ace/.libs -lACE
Linux编译libpng时,报/libpng.so: undefined reference to `*'
安装完成libpng 编译GD时,libpng报错 /usr/local/lib/libpng.so: <em>undefined</em> <em>reference</em> to `inflateReset' /usr/local
DEFORM_3D_中文实例手册
DEFORM_3D_中文实例手册!!!!!!!!
Tensorflow-gpu 版 faster-rcnn demo
    经过一顿折腾,终于跑通了tensorflow版的faster rcnn,mark一下。     git源代码:git clone --recursive https://github.com/smallcorgi/Faster-RCNN_TF.git。这是github上面star最多的,也还有其他的实现,不过这个应该是最靠谱的。      进入Fater-RCNN/lib目录,执行ma...
opencv高低版本冲突的问题
/usr/bin/ld:warning: libopencv_core.so.3.4, needed by//usr/local/lib/libopencv_imgcodecs.so, may conflict withlibopencv_core.so.2.4/usr/bin/ld: /tmp/ccDhjMld.o: <em>undefined</em><em>reference</em> to symbol'_ZN2cv6Str...
caffe TIFF相关错误解决
/usr/local/lib/libopencv_imgcodecs.so.3.2.0: <em>undefined</em> <em>reference</em> to `TIFFReadDirectory@LIBTIFF_4.0' /usr/local/lib/libopencv_imgcodecs.so.3.2.0: <em>undefined</em> <em>reference</em> to `TIFFWriteEncodedStrip@LIBTIFF_...
opencv程序编译后执行不到
方法一: 在ubuntu下编译opencv程序后,执行报下面到<em>错误</em>: error while loading shared libraries: libopencv_core.so.2.4: cannot open shared object file: No such file or directory 解决方法:<em>找</em>到libopencv_开头到库的目录,在/usr/local/lib下面,
吐血给分,求证undefined reference to 'sqlcxt'
环境red flag Server 5 + Oracle9i 程序是C里面嵌入SQL,经过(Oracle Pro*C)预编译之后得到*.C文件. 还有我的是在windows下用Oracle9i的预编译
ubuntu16+anaconda+caffe+cuda+cudnn的环境安装
最近在做ubuntu16环境下caffe的安装: caffe官方安装文档:http://caffe.berkeleyvision.org/installation.html darkknightzh的博客http://www.cnblogs.com/darkknightzh/p/5797526.html 安装caffe之前,建议现安装个Anaconda,caffe支持python2.7和py...
deform使用手册(上)
介绍deform成型软件前处理过程:创建新作业,设置对象参数,输入对象数据
LaTex: Undefined citation warnings 解决方法
参考 Undefined citations LaTex: Undefined citation warnings 解决方法 在使用TexMaker编译文献的时候,<em>出现</em>引用参考文献的问题: Package natbib Warning: Citation `xxxxx' on page y <em>undefined</em> on input line z. 解决方法: pdflatex test #使用pdfl...
undefined reference to" 问题汇总及解决方法"> "undefined reference to" 问题汇总及解决方法
在实际编译代码的过程中,我们经常会遇到"<em>undefined</em> <em>reference</em> to"的问题,简单的可以轻易地解决,但有些却隐藏得很深,需要花费大量的时间去排查。工作中遇到了各色各样类似的问题,按照以下几种可能<em>出现</em>的状况去排查,可有利于理清头绪,从而迅速解决问题。 链接时缺失了相关目标文件 首先编写如下的测试代码: // test.h ...
deform 3D V6.1
亲测安装没毛病,最近刚刚开始学一下deform的切削仿真,附带两个学习资料,这个软件还是挺好用的,可以做个基础的切削仿真,深入的还没研究,我都是用软件自带的工件做了几个切削仿真,还有刀具也是可以选出来
tx2 opencv ubuntu16.04 问题总结
1.交叉编译opencv3.2.0后连接<em>出现</em>:libopencv_imgcodecs.so: <em>undefined</em> <em>reference</em> to `png_init_filter_functions_neon' 进入到3rdparty/libpng,在CMakeLists.txt最顶端增加:set(ENABLE_NEON ON) 2.error: ‘NppiGraphcutState’ does
海思3559A上编译OpenCV4.1.0源码操作步骤
1. 从https://github.com/opencv/opencv/releases 下载opencv源码opencv-4.1.0.zip并解压缩; 2. 修改最顶层的CMakeLists.txt,在第658行加入一条语句如下,fix error: pngstruct.h:30:18: fatal error: zlib.h: No such file or directory #incl...
为什么提示undefined reference to malloc
第一,都是在一个文件目录下的,第二我用的是linux,第三,我无语了 #include #include #include void m
ROS-Kinect cv_bridge的opencv版本兼容问题
今天在编译自己的drone_sensor模块的时候(含stereo camera)<em>出现</em>了/home/joey/pfl/ros/src/drone_sensor/src/stereo_camera/CameraThread.cpp: In member function ‘virtual void CameraThread::loop()’: /home/joey/pfl/ros/src/drone_
/usr/local/lib/libopencv_highgui.so:对‘TIFFIsTiled@LIBTIFF_4.0’未定义的引用
1、问题描述: 在编译普通C++文件的makefile时,一直有如题等问题<em>出现</em>,如下: /usr/local/lib/libopencv_highgui.so:对‘TIFFIsTiled@LIBTIFF_4.0’未定义的引用 /usr/local/lib/libopencv_highgui.so:对‘TIFFOpen@LIBTIFF_4.0’未定义的引用 /usr/local/lib/libo
OpenCV:_png_read_filter_row in opencv2(pngrutil.o)
我自己遇到的问题是因为OpenCV的版本过低了。 方法:下载最新OpenCV的版本添加到项目中就可以了
交叉编译opencv,放在开发板下运行出错
在32位Ubuntu16.04下,用飞凌的arm-linux-gcc 4.3.2交叉编译了opencv2.4.11,下面是交叉编译出来的库文件: 然后用SD卡,把这些文件拷贝到开发板根目录lib下,用
/usr/lib/x86_64-linux-gnu/libopencv_highgui.so:对‘TIFFReadRGBAStrip@LIBTIFF_4.0’未定义的引用...
LIBRARIES+=boost_threadstdc++boost_regex https://github.com/rbgirshick/fast-rcnn/issues/52 转载于:https://www.cnblogs.com/huhuai/p/10624740.html
openCV数据符号说明
在openCV中常常会使用CV_32UC1等相似的字符,这里简单说明含义,作为备忘录。 标识含义 CV_表示是openCV中的宏定义。32是指这个数据是一个32位数据,相同的还有8,16,64三种。U是unsigned的首字母,代表最高位表示计数,而不是符号位。除此之外还有:F,float的首字母,表示浮点数;S,signed首字母,表示有符号的数。后面的C1是channel 1的含义。就...
MYNT-EYE-SDK-2 上配置MYNT-EYE-OKVIS-Sample
MYNT-EYE-SDK-2 上配置MYNT-EYE-OKVIS-Sample 按照教程首先配置MYNT-EYE-SDK-2: https://github.com/slightech/MYNT-EYE-SDK-2 接着配置MYNT-EYE-OKVIS-Sample: https://github.com/slightech/MYNT-EYE-OKVIS-Sample 在编译时<em>出现</em>:...
6410_scatter.txt
6410_scatter.txt   分散加载描述文件,用于armlink的输入参数,他指定映像文件内部各区域的下载和运行时的位置,armlink会根据文件的一些区域相关的符号,他们是全局的供用户建立运行时环境时使用。txt文件中指定的代码启始地址是0x50200000,入口目标文件是startup.o ,程序入口地址是init,紧接着该段依次存放RO(代码与只读数据),RW(读写变量),zi未
Ubuntu 14.04 安装opencv3.0后,caffe编译出现connot find -lopencv_imgcodecs的解决方式
在caffe根目录下,<em>找</em>到Makefile文件,打开文件 查<em>找</em>“Derive include and lib directories”一节,修改“LIBRARIES +=”的最后一行(LIBRARIES += opencv_imgcodecs ),增加opencv_imgcodecs opencv_core opencv_highgui opencv_imgproc opencv
相见恨晚的超实用网站
相见恨晚的超实用网站 持续更新中。。。
开发文档模板集合(需求分析说明书、概要设计说明书、详细设计说明书)下载
文档的模板,包括业务需求说明书、需求分析报告、概要设计说明书、详细设计说明书、系统安装说明书等等共计12篇文档 相关下载链接:[url=//download.csdn.net/download/Jcbay/2022024?utm_source=bbsseo]//download.csdn.net/download/Jcbay/2022024?utm_source=bbsseo[/url]
计算器的简单计算实现下载
能够实现计算器一般的计算 加上自己的一点修改 还是可以的 相关下载链接:[url=//download.csdn.net/download/yuehunshang/3306046?utm_source=bbsseo]//download.csdn.net/download/yuehunshang/3306046?utm_source=bbsseo[/url]
vc的手动花HDC,打印功能下载
【语言】: vc 【功能】: 打印 【介绍】: 使用HDC手动画的打印功能 相关下载链接:[url=//download.csdn.net/download/syzcools/2271882?utm_source=bbsseo]//download.csdn.net/download/syzcools/2271882?utm_source=bbsseo[/url]
相关热词 c#委托 逆变与协变 c#新建一个项目 c#获取dll文件路径 c#子窗体调用主窗体事件 c# 拷贝目录 c# 调用cef 网页填表c#源代码 c#部署端口监听项目、 c#接口中的属性使用方法 c# 昨天
我们是很有底线的