ADS2013.06安装好后打不开,求救 [问题点数:40分]

Bbs1
本版专家分:0
结帖率 0%
Bbs1
本版专家分:0
Bbs1
本版专家分:0
Bbs1
本版专家分:0
Bbs1
本版专家分:0
Bbs1
本版专家分:0
Bbs1
本版专家分:0
解决XMind启动闪退问题
解决XMind启动闪退问题问题描述问题解决 问题描述 启动XMind后,在欢迎界面后直接应用退出。多次启动效果一样。 问题解决 打开Xmind.ini,看到路径名称有:@user.home/Application Data/XMind/ Everything搜索后查到**“C:\Users\123\AppData\Roaming\XMind”** 改名:“C:\Users\123\AppData...
装好MyEclipse后打不开
安<em>装好</em>MyEclipse后<em>打不开</em> 提示JVM terminated.Exit Code=13等信息
Oracle9i安装好后,有些选项打不开
我的Oracle9i在Win2000里刚<em>装好</em>,安装快完成时提示有些组件安装失败(DataBase)(应该有三项失败),当时忽略过了。rn接下来在开始菜单启动Database Configuration Assistant打算配置数据库,结果就是<em>打不开</em>(Net8 Assistant等选项也<em>打不开</em>)。rn郁闷啊!!!
装好10g后,em的URL打不开
安装的Oracle 10g R2 for Windows,600M的安装包rn安装过程中提示网络检测未通过,我手工通过了rn安装最后提示启动manage control出错,但最后安装也完成了rn我的计算机名为qwertyrn结果我访问http://qwerty:1158/em失败rn但是SQLPlus和http://qwerty:5560/isqlplus均成功访问rn怎么办?rn谢谢大家!
Gephi安装好打不开怎么办
gephi安<em>装好</em><em>打不开</em> ? 我安装gephi时出现了如下图所示错误,点击Gephi,开始初始化,然后就闪退出去了 1.安装jre7/jdk7。如果之前安装了jdk8/jre8,需要先卸载重新安装,不然不能运行!!!!!!!。 我一开始安装了jdk最新版本,然后按照网上很多报错方法修改了,Gephi还是<em>打不开</em>,后来卸载jdk,安装了jdk1.7,
tomcat5.9安装好后启动不了,求救!!!
我安装这个帖子的步骤安<em>装好</em>TOMCAT5.9但是发现服务启动不了.一启动,他就自己停止,请问什么情况会引起这样的状况,多谢了!!rn我安装的JDK.是rnc:\j2sdk1.4.2_06rnc:\Tomcat 5.5rntomcat配置:rnCATALINA_HOME=c:\Tomcat 5.5 rnCATALINA_BASE=c:\Tomcat 5.5rnclasspath=.;%JAVA_HOME%\lib;%CATALINA_HOME%\common\lib\servlet-api.jarrnrnhttp://www.softstudio.com.cn/LeadBBS /Announce/Announce.asp?id=72&BoardID=200
ADS安装到100%不动后,无法打开ADS
使用64位的WIN7朋友可能会遇到这个问题,在安装破解版的ADS1.2版本时,经常遇到安装最后到了100%进度条的时候,就不动了,现在分享一种刚刚摸出来的一种方法,希望对大家有所帮助
ads报错
the session file 'c:/documents .../../default-1-2-0-0.ses' could not be loaded.2007-03-19 15:50     the session file 'c:/documents .../../default-1-2-0-0.ses' could not be loaded.  这两天开始学ADS,不过在打开AXD时老是出现这样的错误,我问了好几个人,也不知道具体是怎么了?后来发现是工程所在的文件夹名字里有 中文      ,
ADS2011完美无脑破解文件
ADS2011完美破解文件,里面有详细的破解步骤说明,32位64位win7都适用,win10完美适用,xp适用,win8不知道
【Get深一度】ADS2011.10在win10系统中闪退问题解决方法
作者给安捷伦公司反馈数次,一直没收到解决方案,自己摸索发现以下两种办法供大家参考,水平有限,难免有遗漏或失误,欢迎读者批评指正。 1.设置软件向下兼容win7 2.软件夹中有Advanced Design System 2011.10和Advanced Design System 2011.10(32 bit simulations);不管你主机装的什么系统,不管是x86还是x64,一
ADS-2015在使用过程中的问题
刚接触ADS,现在软件碰到了两个比较严重的问题: 1.一旦开始仿真或优化,hpeesofde.exe就会无响应; 2.在版图仿真时出现以下报错内容: 在此之前已经根据其他前辈的提示,去更改11.40文
新手求救:安装好 swt-designer6.0 后的小问题。
本人有link模式安<em>装好</em>swt-designer后,激活后。在file->new->other->选中designer->swingrn只有在这个swing中的组件可以用,但是在form,Jface.swt等的其它组件生成时程序时会报错,rn比如,生成一个Jface的ApplicationWindowrn程序中好多错啊:rnimport org.eclipse.jface.action.MenuManager;rnimport org.eclipse.jface.action.StatusLineManager;rnimport org.eclipse.jface.action.ToolBarManager;rnimport org.eclipse.jface.window.ApplicationWindow;rnimport org.eclipse.swt.SWT;rnimport org.eclipse.swt.graphics.Point;rnimport org.eclipse.swt.widgets.Composite;rnimport org.eclipse.swt.widgets.Control;rnimport org.eclipse.swt.widgets.Display;rnimport org.eclipse.swt.widgets.Shell;rn这些都有错。不知道到哪去导入,是不是还要下什么东东啊
vc6.0安装好
win32的例子在哪个目录下?
装好apache后为什么打不开flash?
安<em>装好</em>apache(版本:2.0.39 for win32)后可以访问网页,但是<em>打不开</em>flash,为什么?要怎么改才对啊?
装好Macromedia FlashPaper 2后打不开怎么回事
我的Macromedia FlashPaper 2 运行时会弹出 rnCould not find the FlashPaper Print.Please reinstall FlashPaper Printer FlashPaper Printer will now close.我刚装完就这样了,重装几次后仍不行,请大虾们救救小弟。
xampp安装好后 http://localhost/ 打不开显示404 Not Found
![![图片说明](https://img-ask.csdn.net/upload/201510/21/1445426888_159409.png)图片说明](https://img-ask.csdn.net/upload/201510/21/1445426879_964616.png)
ads 使用中的问题
ads中怎样仿真光接收器(pd)呢?
ADS错误(Fatal)L6002U解决方法
ADS编译错误: Fatal L6002U:Could not open file:.....解决办法
ads反汇编窗口一闪而逝
现象:        当我们选中xx.s文件点击鼠标右键,选择Disassemble(反汇编),ads反汇编窗口闪一下就没了 分析:           这个原因可能是因为我们没有编译xx.s文件 解决方法:          选中xx.s文件点击鼠标右键,选择Compile(编译),然后选中xx.s文件点击鼠标右键,选择Disassemble(反汇编),窗口就出现了
关于Win7下安装ADS1.2出现问题的解决
一  以管理员身份运行 找到“所有程序——附件”,右击“命令提示符”选择“以管理员身份运行”。 接下来输入如下命令:“net    user   administrator   /active:yes” 然后注销或重启系统,即可使用超级管理员帐户了。(注意空格!) 打开控制面板,在“用户管理”中即可看到Administrator账户,选择该账户,重新设置密码,不要采用默认的无密码状态!
关于RVCT3.1破解中出现Cannot obtain license的解决办法
From:http://wenku.baidu.com/view/62666c65ddccda38376baf4f.html 按照 http://blog.csdn.net/xqhrs232/archive/2010/05/14/5589662.aspx  中的破解方法进行了RVDS破解。但是在进行编译时出现了以下信息:  armcc : Cannot obtain license
Manjaro 安装好后的配置
更换镜像源 sudo pacman-mirrors -i -c China -m rank 添加源 [archlinuxcn] SigLevel = Optional TrustedOnly Server = https://mirrors.tuna.tsinghua.edu.cn/archlinuxcn/$arch 全面更新系统 sudo pacman -Syyu 安装googlep...
装好ubuntu后的操作
第一步:在系统设置中,点击软件和更新,切换源到阿里云第二步:在shell中输入:sudo apt-get update第三步:继续输入sudo apt-get upgrade第四步:安装一个工具,sudo apt install unity-tweak-tool第五步:sudo add-apt-repository ppa:noobslab/themes第六步:sudo apt install f...
SQL安装好后出问题了
我在安装SQL2000标准版的时候,出现了一个问题:安<em>装好</em>了之后,企业管理器里面的打开表,设计表,返回所有航都出现错误提示“在执行该操作时发生意外错误”,很多方法我都试过了就是不管用.....望大虾指教.....
装好FlatStyle for D7 后
安<em>装好</em>FlatStyle for D7 后...其它的可以正常使用了......rnrnrn唯有 FlatAnimWnd 控件在窗体上.请问该如何..显示和使用....rnrnrn还请大家能帮帮忙.
apache安装好但是localhost打不开,127.0.0.1也打不开
其中端口号没有冲突是80rnrn 协议 本地地址 外部地址 状态rn TCP 0.0.0.0:80 0.0.0.0:0 LISTENINGrn TCP 0.0.0.0:135 0.0.0.0:0 LISTENINGrn TCP 0.0.0.0:445 0.0.0.0:0 LISTENINGrn TCP 0.0.0.0:49152 0.0.0.0:0 LISTENINGrn TCP 0.0.0.0:49153 0.0.0.0:0 LISTENINGrn TCP 0.0.0.0:49154 0.0.0.0:0 LISTENINGrn TCP 0.0.0.0:49155 0.0.0.0:0 LISTENINGrn TCP 0.0.0.0:49157 0.0.0.0:0 LISTENINGrn TCP 111.22.179.115:139 0.0.0.0:0 LISTENINGrn TCP 111.22.179.115:50093 101.199.97.102:80 ESTABLISHErn TCP 111.22.179.115:52609 114.112.73.200:80 LAST_ACKrn TCP 111.22.179.115:52701 117.79.93.218:80 ESTABLISHErn TCP 111.22.179.115:52709 117.79.93.218:80 ESTABLISHErn TCP 111.22.179.115:52726 117.79.93.209:80 LAST_ACKrn TCP 111.22.179.115:52733 117.79.93.218:80 ESTABLISHErn TCP 111.22.179.115:52735 117.79.93.218:80 ESTABLISHErn TCP 111.22.179.115:52758 111.8.9.155:80 TIME_WAITrn TCP 111.22.179.115:52759 117.79.93.218:80 ESTABLISHErn TCP 111.22.179.115:52781 183.60.136.139:80 ESTABLISHErn TCP 111.22.179.115:52782 183.60.136.139:80 ESTABLISHErn TCP 111.22.179.115:52783 183.60.136.139:80 ESTABLISHErn TCP 111.22.179.115:52784 183.60.136.139:80 ESTABLISHErn TCP 111.22.179.115:52785 183.60.136.139:80 ESTABLISHErn TCP 111.22.179.115:52786 183.60.136.139:80 ESTABLISHErn TCP 127.0.0.1:27018 0.0.0.0:0 LISTENINGrn TCP 127.0.0.1:49403 127.0.0.1:49404 ESTABLISHErn TCP 127.0.0.1:49404 127.0.0.1:49403 ESTABLISHErn TCP 127.0.0.1:49405 127.0.0.1:49406 ESTABLISHErn TCP 127.0.0.1:49406 127.0.0.1:49405 ESTABLISHErn TCP 172.27.35.1:8086 0.0.0.0:0 LISTENINGrn TCP 172.27.35.1:8087 0.0.0.0:0 LISTENINGrn TCP 172.27.35.1:8190 0.0.0.0:0 LISTENINGrn TCP 172.27.35.1:8360 0.0.0.0:0 LISTENINGrn TCP [::]:80 [::]:0 LISTENINGrn TCP [::]:135 [::]:0 LISTENINGrn TCP [::]:445 [::]:0 LISTENINGrn TCP [::]:49152 [::]:0 LISTENINGrn TCP [::]:49153 [::]:0 LISTENINGrn TCP [::]:49154 [::]:0 LISTENINGrn TCP [::]:49155 [::]:0 LISTENINGrn TCP [::]:49157 [::]:0 LISTENING
ADS2013.06破解详细步骤
ADS2013.06破解详细步骤
jdk各个版本及其代号
版本号 名称 中文名 发布日期 JDK 1.1.4 Sparkler 宝石 1997-09-12 JDK 1.1.5 Pumpkin 南瓜 1997-12...
cannot access local-nexus 输入私服地址可以访问到,但是项目却显示访问不到私服地址
VPN已开,输入私服地址可以访问到,但是项目却显示访问不到私服地址。注意 offline,是说我现在是离线状态。 解决方式:
IDEA创建spring boot项目报错:Cannot download 'https://start.spring.io'的解决办法
今天有点无聊了, 水一片博客吧~~哈哈, 不过也挺有用的!!! 今天在使用IDEA的Spring Initializr快速创建Spring Boot项目的时候, 发现无法连接到 https://start.spring.io 报错信息: Cannot download ‘https://start.spring.io’ 解决办法: 将 https 改为 http ...
Adams2014安装后启动问题
借鉴的网上经验因为自己的是Win10系统,之前用的电脑win7系统和MATLAB联合仿真没有问题,自从换了电脑后,adams安装后<em>打不开</em>。网上的原因主要有以下两点:1.对许可证管理器,选择如下界面,先停止再开启Server即可2.关闭win10的防火墙我个人的原因是第二个原因。在关闭防火墙后,adams可以正常打开。...
装好软件后,第一次运行就出错(高分求救
系统:windows XP pro rn软件:C++ builder 6.0 rn问题:当<em>装好</em>软件后,无论运行什么程序就出错,rnrn显示如下:rnAccess violation at address 06EFD1E9 in module 'bordbk61.dll'. Read of address 0000000.rnrn重装一次软件后还是一样,请教高人指点。
高分求救,安装好.net后不能用..............
错误提示:visual studio.net 无法创建或打开应用程序,问题很可能是因为本地web服务器上没有安装所需的组件,请运行visual studio .net 安装程序并添加web开发组件rnrnrnrn我重装后还是这样。....都一天了。
ADS2013.06 CRACK.rar
Agilent ADS2013.06 CRACK.rar
ORACLE9.0安装好后,配置管理服务器的问题?
安<em>装好</em>ORACLE9.0后,在配置管理服务器时,运行“开始\程序\Oracle-OraHome90\Configration and Migration Tools\Enterprise Manager Configuration Assistant”命令,安默认配置点击“下一步”出现如下显示:rn1、首先出现“invalid ENDheader format”对话框。rn2、点击“确定”按钮后出现“尝试为Enterprise Manager 资料档案库创建数据库失败,原因:rn命令:‘C:\oracle\ora90\BIN\launch.exe C:\oracle\ora90\assistants\dbcadbca.cl-progress_only-createDatabase-templateName Transaction_Processing.dbc -gdbName OEMREP -sid OEMREP’rn返回状态:1”对话框。rn3、在详细资料中显示“正在创建SID为“OEMREP”的本地数据库“C:\oracle\ora90\BIN\launch.exe C:\oracle\ora90\assistants\dbcadbca.cl-progress_only-createDatabase-templateName Transaction_Processing.dbc -gdbName OEMREP -sid OEMREP”rn>>>创建本地数据库失败。rn处理失败“rn请问这是怎么回事?rn
装好显卡驱动后,怎么配置?
先<em>装好</em>显卡的驱动rn rpm -i dri-Intel-3.4.3006-20051209.i386.rpmrn然后readme里面提示要进行“配置”,原文如下:rnRun SuSE's own configurator called 'YAST' rnunder System from SuSE application broswer menurn a. Select the 'Hardware' iconrn b. Select the 'Graphics Card and Monitor' iconrn c. Select 'Grapihcs desktop environment'radio buttonrn d. Select 'Change'rn e. Under 'Desktop' select 'Graphics Card'rn f. Select 'Add new card'rn g. Under 'General' tab, select 'Intel' and then '945G'rn h. Accept all changes and exit 'YAST'rn但是怎么进去这个“YAST”ne
ntddk安装好后如何设置
我已经<em>装好</em>了ntddk 2003 sp1,但是我在rn #include rn时,提未找不到ntddk.h文件,谁用过,请指点指点
redhat8安装好后出了问题,怎么回事?
前段时间,装了redhat8,感觉不错,rn用起来挺好的,但今天突然不能进入图形界面了。rn屏幕度找不到,不知道是不是redhat8的不稳定,rn大家遇到这样的情况没?知道怎么办不?
VS.NET中文版安装好后出现了问题
<em>装好</em>后,当新建一个项目时,出现一个对话框“VC软件包不可用或未注册”的对话框,这个对话框不论我是新建vb或者是C#,都会出现,我用的系统是win200 serverrn请哪位大哥知道是什么原因阿?
装好tomcat后,启动时报错
刚安装的系统,还没有项目rnrn环境信息:rnG:\>java -versionrnjava version "1.5.0_02"rnJava(TM) 2 Runtime Environment, Standard Edition (build 1.5.0_02-b09)rnJava HotSpot(TM) Client VM (build 1.5.0_02-b09, mixed mode, sharing)rnrnrn5.5和6.0版本都报这个错rnCommons Daemon procrun (1.0.2.0) startedrnRunning Service...rnStarting service...rnError occurred during initialization of VMrnjava/lang/NoClassDefFoundErrorrn: java/lang/Objectrnrn
qt-everywhere-opensource-src-4.8.2安装好后,编译代码出错.
我安<em>装好</em>了qt之后编译以下hello world代码报错,请问是怎么回事?rnrn#include rn#include rnrnint main(int argc, char *argv[])rnrn QApplication app(argc,argv);rnrn QPushButton b("Hello World !");rn b.show();rnrn QObject::connect(&b,SIGNAL(clicked()),&app,SLOT(quit()));rnrn return app.exec();rnrnrnrn错误如下:rn/usr/include/qt4/QtCore/qbytearray.h:469:2: error: expected declaration specifiers before ‘;’ tokenrn/usr/include/qt4/QtCore/qbytearray.h:471:17: error: expected ‘=’, ‘,’, ‘;’, ‘asm’ or ‘__attribute__’ before ‘QByteArray’rn/usr/include/qt4/QtCore/qbytearray.h:473:17: error: expected ‘=’, ‘,’, ‘;’, ‘asm’ or ‘__attribute__’ before ‘QByteArray’rn/usr/include/qt4/QtCore/qbytearray.h:475:18: error: expected ‘=’, ‘,’, ‘;’, ‘asm’ /usr/include/qt4/QtCore/qbytearray.h:521:1: error: unknown type name ‘bool’rn/usr/include/qt4/QtCore/qbytearray.h:521:21: error: expected ‘=’, ‘,’, ‘;’, ‘asm’ or ‘__attribute__’ before ‘’ tokenrn/usr/include/qt4/QtCore/qbytearray.h:535:1: error: unknown type name ‘bool’rn/usr/include/qt4/QtCore/qbytearray.h:535:21: error: expected ‘=’, ‘,’, ‘;’, ‘asm’ or ‘__attribute__’ before ‘>’ tokenrn/usr/include/qt4/QtCore/qbytearray.h:537:1: error: unknown type name ‘bool’rn/usr/include/qt4/QtCore/qbytearray.h:537:21: error: expected ‘=’, ‘,’, ‘;’, ‘asm’ or ‘__attribute__’ before ‘>’ tokenrn/usr/include/qt4/QtCore/qbytearray.h:539:1: error: unknown type name ‘bool’rn/usr/include/qt4/QtCore/qbytearray.h:539:21: error: expected ‘=’, ‘,’, ‘;’, ‘asm’ or ‘__attribute__’ before ‘>=’ tokenrn/usr/include/qt4/QtCore/qbytearray.h:541:1: error: unknown type name ‘bool’rn/usr/include/qt4/QtCore/qbytearray.h:541:21: error: expected ‘=’, ‘,’, ‘;’, ‘asm’ or ‘__attribute__’ before ‘>=’ tokenrn/usr/include/qt4/QtCore/qbytearray.h:543:1: error: unknown type name ‘bool’rn/usr/include/qt4/QtCore/qbytearray.h:543:21: error: expected ‘=’, ‘,’, ‘;’, ‘asm’ or ‘__attribute__’ before ‘>=’ tokenrn/usr/include/qt4/QtCore/qbytearray.h:557:19: error: expected ‘=’, ‘,’, ‘;’, ‘asm’ or ‘__attribute__’ before ‘&’ tokenrn/usr/include/qt4/QtCore/qbytearray.h:559:19: error: expected ‘=’, ‘,’, ‘;’, ‘asm’ or ‘__attribute__’ before ‘&’ tokenrn/usr/include/qt4/QtCore/qbytearray.h:561:19: error: expected ‘=’, ‘,’, ‘;’, ‘asm’ or ‘__attribute__’ before ‘&’ tokenrn/usr/include/qt4/QtCore/qbytearray.h:564:19: error: expected ‘=’, ‘,’, ‘;’, ‘asm’ or ‘__attribute__’ before ‘&’ tokenrn/usr/include/qt4/QtCore/qbytearray.h:566:19: error: expected ‘=’, ‘,’, ‘;’, ‘asm’ or ‘__attribute__’ before ‘&’ tokenrn/usr/include/qt4/QtCore/qbytearray.h:568:19: error: expected ‘=’, ‘,’, ‘;’, ‘asm’ or ‘__attribute__’ before ‘&’ tokenrn/usr/include/qt4/QtCore/qbytearray.h:570:19: error: expected ‘=’, ‘,’, ‘;’, ‘asm’ or ‘__attribute__’ before ‘&’ tokenrn/usr/include/qt4/QtCore/qbytearray.h:572:19: error: expected ‘=’, ‘,’, ‘;’, ‘asm’ or ‘__attribute__’ before ‘&’ tokenrn/usr/include/qt4/QtCore/qbytearray.h:577:1: error: unknown type name ‘Q_CORE_EXPORT’rn/usr/include/qt4/QtCore/qbytearray.h:577:27: error: expected ‘=’, ‘,’, ‘;’, ‘asm’ or ‘__attribute__’ before ‘&’ tokenrn/usr/include/qt4/QtCore/qbytearray.h:578:1: error: unknown type name ‘Q_CORE_EXPORT’rn/usr/include/qt4/QtCore/qbytearray.h:578:27: error: expected ‘=’, ‘,’, ‘;’, ‘asm’ or ‘__attribute__’ before ‘&’ tokenrn/usr/include/qt4/QtCore/qbytearray.h:582:1: error: unknown type name ‘Q_CORE_EXPORT’rn/usr/include/qt4/QtCore/qbytearray.h:582:26: error: expected ‘=’, ‘,’, ‘;’, ‘asm’ or ‘__attribute__’ before ‘qCompress’rn/usr/include/qt4/QtCore/qbytearray.h:583:1: error: unknown type name ‘Q_CORE_EXPORT’rn/usr/include/qt4/QtCore/qbytearray.h:583:26: error: expected ‘=’, ‘,’, ‘;’, ‘asm’ or ‘__attribute__’ before ‘qUncompress’rn/usr/include/qt4/QtCore/qbytearray.h:584:1: error: unknown type name ‘QByteArray’rn/usr/include/qt4/QtCore/qbytearray.h:584:35: warning: type defaults to ‘int’ in declaration of ‘QByteArray’ [-Wimplicit-int]rn/usr/include/qt4/QtCore/qbytearray.h:584:45: error: expected ‘;’, ‘,’ or ‘)’ before ‘&’ tokenrn/usr/include/qt4/QtCore/qbytearray.h:586:1: error: unknown type name ‘QByteArray’rn/usr/include/qt4/QtCore/qbytearray.h:586:37: warning: type defaults to ‘int’ in declaration of ‘QByteArray’ [-Wimplicit-int]rn/usr/include/qt4/QtCore/qbytearray.h:586:47: error: expected ‘;’, ‘,’ or ‘)’ before ‘&’ tokenrn/usr/include/qt4/QtCore/qbytearray.h:590:1: error: expected declaration specifiers before ‘Q_DECLARE_TYPEINFO’rn/usr/include/qt4/QtCore/qbytearray.h:591:1: error: expected declaration specifiers before ‘Q_DECLARE_SHARED’rnIn file included from /usr/include/qt4/QtCore/qobject.h:48:0,rn from /usr/include/qt4/QtCore/qcoreapplication.h:45,rn from /usr/include/qt4/QtGui/qapplication.h:45,rn from /usr/include/qt4/QtGui/QApplication:1,rn from b.c:1:rn/usr/include/qt4/QtCore/qstring.h:60:22: fatal error: string: No such file or directoryrncompilation terminated.rnmake: *** [b.o] Error 1rnrn等等,还有一堆这样的错误就没全部贴出来了。rn我检查过了类似于/usr/include/qt4/QtCore/这样的路径,是存在像qstring.h这样的头文件的。求教各位高手~
oracle9.0.2I安装好后没有解析器
oracle安<em>装好</em>后没有解析器,出现这个错;用户和密码对的进不了;我在装ORACLE之前先装了个SQL SERVER的
第二步:安装好python后,安装Anaconda
First,1. 打开网址输入www.anaconda.com进入Anaconda的官网,下载适合你电脑版本的资源包。 2. 打开你下载的资源包运行画面后,直接点击next 3. 进入下个页面后,点击我同意。 4. 点击I Agree后,有两个选项第一个是我自己使用,第二个所有用户都可以使用。一般都是自己使用,选择后点击next 5. 第五步,同样更改下路径。选择到你之前建...
很急!Linux下安装好Oracle8.1.7后无法启动
我在redhat7.1下安装oracle8.1.7,第一次没成功,第二次才OKrn我运行了svrmgrl,在执行startup后就停了,昨天晚上运行startup,现在它还停在那里.什么提示都没有!rn各位,帮忙看下是怎么回事,要不要重装Linux+Oracle???rn我是这样执行svrmgrl的rn#svrmgrlrnSVRMGRL>connect internalrnconnectedrnSVRMGRL>startuprn没反应了rn
exchange2003安装好后如何设置参数
请问:rnrn1.windows2003 + exchange 2003 安<em>装好</em>后,需要对exchange2003服务端怎么样rn  的设置才可以正常收发邮件?rnrn2.客户端可以用OE6吗?rnrn3.如果用Express Outlook 2003 需要怎么设置?rnrnrn 请知道的朋友帮助看看,或是提供相关的资料,不甚感激!~^~rnrn  提示:之前已申请公网域名:haue.com.cn
装好jdk后找不到javac问题
今天装tomcat,要装jdk,所以就下载了一个,安装的时候出了一点问题,因为没有搞过这个,所以还是记录一下,以防日后再在这些小问题上耽误时间。 ======================================================================= 官网下载:http://www.oracle.com/technetwork/java/javase/do...
装好mysql后登录重置密码
$ mysql -u root  //直接回车进入mysql控制台mysql &amp;gt; use mysql;mysql &amp;gt; update user set password=password('123456') where user='root';mysql &amp;gt; exit;
react 安装好后build不出来!mac下
facebook的react框架,按照说明安装,中间比较坎坷,应该都安装上了rn环境是mac、android studiorn编译到rn:app:mergeDebugResourcesrn卡死在一大堆这样错误下:rnException in thread "png-cruncher_13" java.lang.RuntimeException: Timed out while waiting for slave aapt process, try setting environment variable SLAVE_AAPT_TIMEOUT to a value bigger than 5 secondsrn at com.android.builder.png.AaptProcess.waitForReady(AaptProcess.java:104)rn at com.android.builder.png.QueuedCruncher$1.creation(QueuedCruncher.java:107)rn at com.android.builder.tasks.WorkQueue.run(WorkQueue.java:206)rn at java.lang.Thread.run(Thread.java:745)rnException in thread "png-cruncher_20" java.lang.RuntimeException: Timed out while waiting for slave aapt process, try setting environment variable SLAVE_AAPT_TIMEOUT to a value bigger than 5 secondsrn at com.android.builder.png.AaptProcess.waitForReady(AaptProcess.java:104)rn at com.android.builder.png.QueuedCruncher$1.creation(QueuedCruncher.java:107)rn at com.android.builder.tasks.WorkQueue.run(WorkQueue.java:206)rn at java.lang.Thread.run(Thread.java:745)rnException in thread "png-cruncher_8" java.lang.RuntimeException: Timed out while waiting for slave aapt process, try setting environment variable SLAVE_AAPT_TIMEOUT to a value bigger than 5 secondsrn at com.android.builder.png.AaptProcess.waitForReady(AaptProcess.java:104)rn at com.android.builder.png.QueuedCruncher$1.creation(QueuedCruncher.java:107)rn at com.android.builder.tasks.WorkQueue.run(WorkQueue.java:206)rn at java.lang.Thread.run(Thread.java:745)rnException in thread "png-cruncher_9" java.lang.RuntimeException: Timed out while waiting for slave aapt process, try setting environment variable SLAVE_AAPT_TIMEOUT to a value bigger than 5 secondsrn at com.android.builder.png.AaptProcess.waitForReady(AaptProcess.java:104)rn at com.android.builder.png.QueuedCruncher$1.creation(QueuedCruncher.java:107)rn at com.android.builder.tasks.WorkQueue.run(WorkQueue.java:206)rn at java.lang.Thread.run(Thread.java:745)rnException in thread "png-cruncher_18" java.lang.RuntimeException: Timed out while waiting for slave aapt process, try setting environment variable SLAVE_AAPT_TIMEOUT to a value bigger than 5 secondsrn at com.android.builder.png.AaptProcess.waitForReady(AaptProcess.java:104)rn at com.android.builder.png.QueuedCruncher$1.creation(QueuedCruncher.java:107)rn at com.android.builder.tasks.WorkQueue.run(WorkQueue.java:206)rn at java.lang.Thread.run(Thread.java:745)rnException in thread "png-cruncher_5" java.lang.RuntimeException: Timed out while waiting for slave aapt process, try setting environment variable SLAVE_AAPT_TIMEOUT to a value bigger than 5 secondsrn at com.android.builder.png.AaptProcess.waitForReady(AaptProcess.java:104)rn at com.android.builder.png.QueuedCruncher$1.creation(QueuedCruncher.java:107)rn at com.android.builder.tasks.WorkQueue.run(WorkQueue.java:206)rn at java.lang.Thread.run(Thread.java:745)rnException in thread "png-cruncher_11" java.lang.RuntimeException: Timed out while waiting for slave aapt process, try setting environment variable SLAVE_AAPT_TIMEOUT to a value bigger than 5 secondsrn at com.android.builder.png.AaptProcess.waitForReady(AaptProcess.java:104)rn at com.android.builder.png.QueuedCruncher$1.creation(QueuedCruncher.java:107)rn at com.android.builder.tasks.WorkQueue.run(WorkQueue.java:206)rn at java.lang.Thread.run(Thread.java:745)rnException in thread "png-cruncher_10" java.lang.RuntimeException: Timed out while waiting for slave aapt process, try setting environment variable SLAVE_AAPT_TIMEOUT to a value bigger than 5 secondsrn at com.android.builder.png.AaptProcess.waitForReady(AaptProcess.java:104)rn at com.android.builder.png.QueuedCruncher$1.creation(QueuedCruncher.java:107)rn at com.android.builder.tasks.WorkQueue.run(WorkQueue.java:206)rn at java.lang.Thread.run(Thread.java:745)rnException in thread "png-cruncher_19" java.lang.RuntimeException: Timed out while waiting for slave aapt process, try setting environment variable SLAVE_AAPT_TIMEOUT to a value bigger than 5 secondsrn at com.android.builder.png.AaptProcess.waitForReady(AaptProcess.java:104)rn at com.android.builder.png.QueuedCruncher$1.creation(QueuedCruncher.java:107)rn at com.android.builder.tasks.WorkQueue.run(WorkQueue.java:206)rn at java.lang.Thread.run(Thread.java:745)rnException in thread "png-cruncher_6" java.lang.RuntimeException: Timed out while waiting for slave aapt process, try setting environment variable SLAVE_AAPT_TIMEOUT to a value bigger than 5 secondsrn at com.android.builder.png.AaptProcess.waitForReady(AaptProcess.java:104)rn at com.android.builder.png.QueuedCruncher$1.creation(QueuedCruncher.java:107)rn at com.android.builder.tasks.WorkQueue.run(WorkQueue.java:206)rn at java.lang.Thread.run(Thread.java:745)rnException in thread "png-cruncher_17" java.lang.RuntimeException: Timed out while waiting for slave aapt process, try setting environment variable SLAVE_AAPT_TIMEOUT to a value bigger than 5 secondsrn at com.android.builder.png.AaptProcess.waitForReady(AaptProcess.java:104)rn at com.android.builder.png.QueuedCruncher$1.creation(QueuedCruncher.java:107)rn at com.android.builder.tasks.WorkQueue.run(WorkQueue.java:206)rn at java.lang.Thread.run(Thread.java:745)rnException in thread "png-cruncher_15" java.lang.RuntimeException: Timed out while waiting for slave aapt process, try setting environment variable SLAVE_AAPT_TIMEOUT to a value bigger than 5 secondsrn at com.android.builder.png.AaptProcess.waitForReady(AaptProcess.java:104)rn at com.android.builder.png.QueuedCruncher$1.creation(QueuedCruncher.java:107)rn at com.android.builder.tasks.WorkQueue.run(WorkQueue.java:206)rn at java.lang.Thread.run(Thread.java:745)rnException in thread "png-cruncher_16" java.lang.RuntimeException: Timed out while waiting for slave aapt process, try setting environment variable SLAVE_AAPT_TIMEOUT to a value bigger than 5 secondsrn at com.android.builder.png.AaptProcess.waitForReady(AaptProcess.java:104)rn at com.android.builder.png.QueuedCruncher$1.creation(QueuedCruncher.java:107)rn at com.android.builder.tasks.WorkQueue.run(WorkQueue.java:206)rn at java.lang.Thread.run(Thread.java:745)rnException in thread "png-cruncher_12" java.lang.RuntimeException: Timed out while waiting for slave aapt process, try setting environment variable SLAVE_AAPT_TIMEOUT to a value bigger than 5 secondsrn at com.android.builder.png.AaptProcess.waitForReady(AaptProcess.java:104)rn at com.android.builder.png.QueuedCruncher$1.creation(QueuedCruncher.java:107)rn at com.android.builder.tasks.WorkQueue.run(WorkQueue.java:206)rn at java.lang.Thread.run(Thread.java:745)rnException in thread "png-cruncher_14" java.lang.RuntimeException: Timed out while waiting for slave aapt process, try setting environment variable SLAVE_AAPT_TIMEOUT to a value bigger than 5 secondsrn at com.android.builder.png.AaptProcess.waitForReady(AaptProcess.java:104)rn at com.android.builder.png.QueuedCruncher$1.creation(QueuedCruncher.java:107)rn at com.android.builder.tasks.WorkQueue.run(WorkQueue.java:206)rn at java.lang.Thread.run(Thread.java:745)rnException in thread "png-cruncher_3" java.lang.RuntimeException: Timed out while waiting for slave aapt process, try setting environment variable SLAVE_AAPT_TIMEOUT to a value bigger than 5 secondsrn at com.android.builder.png.AaptProcess.waitForReady(AaptProcess.java:104)rn at com.android.builder.png.QueuedCruncher$1.creation(QueuedCruncher.java:107)rn at com.android.builder.tasks.WorkQueue.run(WorkQueue.java:206)rn at java.lang.Thread.run(Thread.java:745)rnException in thread "png-cruncher_1" java.lang.RuntimeException: Timed out while waiting for slave aapt process, try setting environment variable SLAVE_AAPT_TIMEOUT to a value bigger than 5 secondsrn at com.android.builder.png.AaptProcess.waitForReady(AaptProcess.java:104)rn at com.android.builder.png.QueuedCruncher$1.creation(QueuedCruncher.java:107)rn at com.android.builder.tasks.WorkQueue.run(WorkQueue.java:206)rn at java.lang.Thread.run(Thread.java:745)
装好SQL后的第一个问题
安<em>装好</em>SQL后,是不是直接就可以启动SQL服务了?rn为什么我启动不了?rn说由于登陆失败而无法启动服务,这是怎么回事啊?rn大家帮帮忙啊,急
装好redhat 9.0后出现的问题
我安装后,安装正常,(全部安装),启动都正常,到要输入用户名密码那一段就是很大的屏幕,且花屏感觉rn不知道怎么原因,我已经<em>装好</em>几次,都一样,我过去装8.0里没有问题rnrn再问一个问题,redhat linux server版本跟这个具体又什么区别?rn
tomcat5.5安装好后不能访问主页
jdk1.5.0_14安装:rnrn1,JAVA_HOME:C:\Program Files\Java\jdk1.5.0_14rn2,CLASSPATH:rnrn.;C:\Program Files\Java\jdk1.5.0_14\lib;C:\Program Files\Java\jdk1.5.0_14\lib\tools.jar;C:\Program Files\Java\jdk1.5.0_14\lib\dt.jar;rnrn3,PATH:C:\Program Files\Java\jdk1.5.0_14\binrnrnrn安装完后,java,javac都能运行;rnrntomcat5按默认安装rn启动之后不能访问主页rnrnrn另外:xp系统是刚刚重装的
TreeView安装好后显示不了树型
TreeView(360KB)<em>装好</em>后,显示不了树型,项目是在wwwroot下面,就算静态的树也显示不出来,只有一行rnNODE1 NODE5 NODE2 NODE3 NODE4
用vmware 安装好linux 后
不小心把语言设置成英语的了。。如何再改成中文的rn 语言设置中只有英文的。。rn 显示器是 vmare 辨率很底。。。如何设置。。rn 如何设置上网。。我这是内网,通过共享上网。。。服务器为window2000 的。。。rn 谢谢!!!!!
请问 proftpd 安装好后如何启动?
谢谢
装好UBUNTU10.4后的配置(大概)
安<em>装好</em>10.4后,还要有很多的设置,包括安装常用软件。 在做以下工作前,必须配置网络连接,个人觉得ubuntu离开了网络,基本上没法活了。 一、安装中文环境 首先配置一个速度快的源,然后安装中文环境,更新软件管理器,使其系统处于最新状态。 二、配置输入法 配置不好输入法,打中文就痛苦了。 三、安装Tweak,linux下的优化大师 下载地址:http://...
在安装好j2sdk1.4.2_02系统后发现的问题
我用的是繁体的WIN2K系统,安装了j2sdk1.4.2_02后,开始编程.编写好程式就编译,这些都无问题,但是在执行的时候就是显示不了汉字,显示出来的是一些问号或者是框框,不知道是什么原因.请各位指教一下.谢谢!
kylix安装好后,为何不运行?
我用的是Bata3 ,是不是过期了。改系统时间也不行。
装好JB9后,不能启动程序
安装完JB9后,点击程序组里的“Borland JBuilder 9 Enterprise”,却没有什么反应。可能是个小问题,我却试验了几次都不行,其中还重装了Win2000。求各位大侠救命!!!
JBOSS安装好后出现的问题.
http://localhost:8080/jmx-console/index.jsprnrnj2sdk1.4.2_04rnjboss-3.2.3rnrnrnrn错误信息:rnHTTP Status 500 - rnrn--------------------------------------------------------------------------------rnrntype Exception reportrnrnmessage rnrndescription The server encountered an internal error () that prevented it from fulfilling this request.rnrnexception rnrnorg.apache.jasper.JasperException: Unable to compile class for JSPrnrnAn error occurred at line: -1 in the jsp file: nullrnrnGenerated servlet error:rn [javac] Compiling 1 source filern [javac] D:\jboss-3.2.3\server\default\work\MainEngine\localhost\jmx-console\index_jsp.java:51: handlePageException(java.lang.Exception) in javax.servlet.jsp.PageContext cannot be applied to (java.lang.Throwable)rn [javac] if (pageContext != null) pageContext.handlePageException(t);rn [javac] ^rn [javac] 1 errorrnrn
装好tomcat后需不需要配置环境变量
系统2000server+jdk142+tomcat5014rn在安<em>装好</em>上面的东西后,开始java的练习,启动tomcat服务器,编写如下的文件rnsubmit.jsprn===================rnrnrnrn 数据库演示rnrnrnrn rn请输入用户名: rn请输入密 码: rnrnrnrnrnrn运行rn出现下面的错误rntype Exception reportrnrnmessage rnrndescription The server encountered an internal error () that prevented it from fulfilling this request.rnrnexception rnrnorg.apache.jasper.JasperException: Unable to compile class for JSPrnrnNo Java compiler was found to compile the generated source for the JSP. rnThis can usually be solved by copying manually $JAVA_HOME/lib/tools.jar from the JDK rnto the common/lib directory of the Tomcat server, followed by a Tomcat restart. rnIf using an alternate Java compiler, please check its installation and access path.rnrnorg.apache.jasper.compiler.DefaultErrorHandler.javacError(DefaultErrorHandler.java:127)rnorg.apache.jasper.compiler.ErrorDispatcher.javacError(ErrorDispatcher.java:351)rnorg.apache.jasper.compiler.Compiler.generateClass(Compiler.java:418)rnorg.apache.jasper.compiler.Compiler.compile(Compiler.java:461)rnorg.apache.jasper.compiler.Compiler.compile(Compiler.java:442)rnorg.apache.jasper.JspCompilationContext.compile(JspCompilationContext.java:552)rnorg.apache.jasper.servlet.JspServletWrapper.service(JspServletWrapper.java:291)rnorg.apache.jasper.servlet.JspServlet.serviceJspFile(JspServlet.java:301)rnorg.apache.jasper.servlet.JspServlet.service(JspServlet.java:248)rnjavax.servlet.http.HttpServlet.service(HttpServlet.java:856)rnrnrnnote The full stack trace of the root cause is available in the Tomcat logs.rnrn让我把JAVA_HOME/lib/tools.jar 拷贝到响应的目录下rn这个是不是没有配置环境变量的原因,如果需要配置环境变量,应当配置那些环境变量,环境变量的值是什么??rn谢谢rn
为什么我安装好linux后,无法启动。
每次安<em>装好</em>后,重起计算机,硬件自检过后,屏幕上全是 010101010.....rnrn为什么呀,我的安装应该是正确的,因为我以前也是这样安装的,一切正常。但是rn现在去是这样的情况rn
sql 安装好后出现问题,奇怪
我的sql server 2000在window 2000 server下安装,安装完成后可以新建数据库,担新建表时出现,没有足够的存储器,是怎么回事。新建视图也同样如此rn
laravel 安装好后白屏,显示 500
Q: laravel 安<em>装好</em>后, 访问了一把, 直接来了个 500. 没有错误提示信息. A: 测了一index.php页面, 确信访问是进来了的. 排除环境的问题, 后来才发现, 错误信息是直接丢到了 nginx的日志文件 中去了!! 错误信息也比较详细, 是 storage 文件夹的没有写权限导致的!~
装好cmake后,可以安装mysql了。
mysql我没有直接使用yum来完成安装,主要我想还是源码的好控制些,配置文件也好找些,所以安装了源码包,源码包的版本是:mysql-5.6.21.tar.gz。 在安装之前可以先完成一些准备工作: 当然也可以先用windows下载好,然后直接传递到/usr下就可以了。 将mysql-5.6.21.tar.gz解压后,拷入到/usr/local/src目录下后,使用 cmake \
装好DISCUS论坛后出现一片空白
安<em>装好</em>DISCUS论坛后进入首页出现一片空白
为什么安装好MSSQL后,无法启动~~
提示:创建日志文件失败~~不知怎样才能启动MSSQL~~
debian9安装好后的初始化配置
上一篇文章,已经说明了虚拟机的网络配置,此篇文章,就讲讲考拉自己在新系统安<em>装好</em>后的一些初始化配置。 声明: 考拉实验环境,virtualbox 5.2.0,宿主机 win10 企业版,网络连接 LAN ,客户机 debian-9.2.1,客户机只安装了基本系统,没有安装图形化界面。 1.Change the source(更换源) 在终端中,输入命令: lsb_release -a ,
装好mysql后添加别名命令
在bashrc中添加创建别名的命令: alias mysql '/usr/local/mysql/bin/mysql' alias mysqladmin '/usr/local/mysql/bin/mysqladmin' brew install mysql  brew install mysql
装好Win8后必做的优化
安<em>装好</em>Win8后必做的优化,各项安排及系统简要优化
SQL2005安装好后,怎么不见了主程序?
SQL2005里面只有个“配置工具”,没有启动程序?这是怎么回事。。安装数据库都是成功的。
消除WIN2000安装好后的共享问题!!
怎样去了win2000安<em>装好</em>后,去掉共享权限!~~~~~~~~~~~!!!
xp安装好IIS后测试不成功????
无法显示网页 rn您要访问的网页有问题,无法显示。 rnrn--------------------------------------------------------------------------------rnrn请尝试以下操作:rnrn打开 127.0.0.1 主页,然后查找指向您感兴趣信息的链接。 rn单击刷新按钮,或以后再试。rnrn单击搜索,寻找 Internet 上的信息。 rn也可查看相关站点列表。 rnrnrnrnrnHTTP 500 - 内部服务器错误 rnInternet Explorer rnrnrnrnrnrnrnrn输入127.0.0.1后显示这个,怎么回事呢
tomcat在linux下安装好后出现错误
type Exception reportrnrnmessage rnrndescription The server encountered an internal error () that prevented it from fulfilling this request.rnrnexception rnrnorg.apache.jasper.JasperException: Unable to compile class for JSPrnrnAn error occurred at line: -1 in the jsp file: nullrnrnGenerated servlet error:rn [javac] Since fork is true, ignoring compiler setting.rn [javac] Compiling 1 source filern [javac] Since fork is true, ignoring compiler setting.rn系统环境linux7.1+tomcat4.1.24+jdk1.2.2,tomcat是刚刚升级(升级之前一切正常)我在安装完之后,启动tomcat的startup.sh后在浏览器中输入http://localhost:8080就出现了上述错误
装好IIS后,无法显示网页!!
我用的OS win2000 server sp4rn装上IIS后,服务启动也能启来。rn打开IE后,http://localhost/ 或http://127.0.0.1rn出现rn无法显示网页 rn您要访问的网页有问题,无法显示。 rn是什么原因。
装好后 实例启动出现问题
错误如上正在排错中
iewebcontrols安装好后,目录显示不出来?
iewebcontrols都已经安<em>装好</em>,在vs中使用它也没报什么错,但就显示出文本,没有链接,程序是一定没错的,在我同事那里能正常运行!
openCV安装好后简单测试
今天在学习在Python中使用OpenCV 安<em>装好</em>了之后进行打开图片的简单测试 测试代码如下: import cv2 as cv #读取图像,支持 bmp、jpg、png、tiff 等常用格式 img = cv.imread("F:\ps背景图\2.jpg") #创建窗口并显示图像 cv.namedWindow("Image") cv.imshow("Image",img) cv.waitKe...
装好ubuntu16.04后要做的事
​1. 清除一些不用的软件删除libreofficesudo apt autoremove libreoffice-common 删除Amazon链接sudo apt autoremove unity-webapps-common删除一些不用的自带软件, 需要的时候再装sudo apt autoremove thunderbird totem rhythmbox empathy brasero s
CentOS下安装好MySQL后要做的事儿
1、安装完成路径: 1、数据库目录 /var/lib/mysql/ 2、配置文件 /usr/share/mysql(mysql.server命令及配置文件) 3、启动脚本 /etc/rc.d/init.d/(启动脚本文件mysql的目录) 4、相关命令 /usr/bin(mysqladmin mysqldump等命令) 注:1~3安装server安装后存在,4
装好Protege4.3后 无法启动,什么鬼
安<em>装好</em>Protege4.3后 无法启动,什么鬼?? 我的解决方案是:卸载本机已经安<em>装好</em>的JDK1.9,然后重新安装了JDK1.7,再次重新安装Protege4.3 选择了jre1.7后 就好了
控件安装好后不能用??
比如我安一个控件,在用它的时间,编译出错:rn[Fatal Error] Unit1.pas(7): File not found: 'PBSpinEdit.dcu'rnrn怎么解决呀。。
JBuilder9.0安装好,祝贺
sss
CACTI8.7G安装好的文件。
可以在WINDOWS上使用。先安装APPSERV。文件下载后解压致c:\appsvr\www\下以cacti命名。重启APACHE服务,打开IE进入HTTP://LOCALHOST/CACTI就可以了。
装好的软件到哪去了?
我用rpm 安装软件成功, rn却不知道软件被安装到何处?rn请知道者告知, 不胜感谢!!!!
装好VB以后
安<em>装好</em>VB以后,打开一个窗口,双击鼠标或者'view code'出现以下非法操作提示:"0x0fa928eb"指令参考的"0x00000000"记忆体.该记忆体不能为"read".重新安装VB也不行rn请问是啥问题,能不能在不重新安装系统的前提下解决
oracle 10g 安装好但是打不开数据库主页
如题,而且用PL/SQL使用SYSTEM登陆名也进不去,卡在登陆画面,用SQL窗口能够正常连接数据库rn正常的打开数据库主页等一晚上也<em>打不开</em>,卸载重新安装过很多次,内存刚加的2G,谢谢
求高人,安装好QT了,但是QT Designer打不开。。。
本人用的是vs2008,安装的最新的QT,照着网上写的设置,都弄好了,CREATE也可以用。但是在VS2008下打开UI,调用QT Designer的时候就提示“couldn't start qt designer”。这是神马原因啊。重装了也不行啊,还是一样的问题,度娘和谷哥都不肯告诉我。只好来求达人。
windows2003装好后无故重起??求救
windows2003<em>装好</em>后无故重起??
安装了Tomact 4.1后 打不开jsp文件
我的系统是win2000,安装J2SDK并添加环境变量rn然后安装Tomcat,用http://localhost:8080/examples/jsp/test.jsp测试成功rn我的机子上还安装了oracle9i数据库rn如果打开oracle9i数据库服务器那么http://localhost:8080/examples/jsp/test.jsprn打开不成功rn我把tomcat服务器的端口改为9090也不行rn只有关闭oracle9i数据库服务器就可以了rnrn请问为什么rn
java和数据库的简单增删查改下载
第一次写,写的很简单的~但因为新手,所以冗余很多,哈,需要的看看。 相关下载链接:[url=//download.csdn.net/download/jackiepotter/2447264?utm_source=bbsseo]//download.csdn.net/download/jackiepotter/2447264?utm_source=bbsseo[/url]
电源模式修改工具下载
用于windows xp电源模式修改工具 相关下载链接:[url=//download.csdn.net/download/chaoshanlangzi/4611054?utm_source=bbsseo]//download.csdn.net/download/chaoshanlangzi/4611054?utm_source=bbsseo[/url]
每个程序员都应该知道的福利下载
每个程序员都应该知道的福利 相关下载链接:[url=//download.csdn.net/download/sosogaga/5037921?utm_source=bbsseo]//download.csdn.net/download/sosogaga/5037921?utm_source=bbsseo[/url]
相关热词 c++和c#哪个就业率高 c# 批量动态创建控件 c# 模块和程序集的区别 c# gmap 截图 c# 验证码图片生成类 c# 再次尝试 连接失败 c#开发编写规范 c# 压缩图片好麻烦 c#计算数组中的平均值 c#获取路由参数
我们是很有底线的