Android Studio 编译出错,求助!万分感谢! [问题点数:40分]

Bbs1
本版专家分:0
Blank
GitHub 绑定GitHub第三方账户获取
结帖率 0%
Bbs1
本版专家分:0
Blank
GitHub 绑定GitHub第三方账户获取
Bbs6
本版专家分:9177
Blank
红花 2015年3月 移动开发大版内专家分月排行榜第一
Blank
黄花 2015年2月 移动开发大版内专家分月排行榜第二
Blank
蓝花 2015年4月 移动开发大版内专家分月排行榜第三
2015年1月 移动开发大版内专家分月排行榜第三
Bbs1
本版专家分:0
Bbs4
本版专家分:1630
Bbs1
本版专家分:0
Bbs1
本版专家分:0
Bbs1
本版专家分:0
解决AndroidStudio编译时报错:org.gradle.api.ProjectConfigurationException
修改项目外gradle配置   repositories {         jcenter()         maven{url 'http://maven.aliyun.com/nexus/content/groups/public/'}         google()     }  repositories {         jcenter()         maven{url ...
Error:A problem occurred configuring project ':app'. > failed to find Build
使用android studio进行build时出现此错误Error:A problem occurred configuring project ':app'. > failed to find Build        解决方法为:修改build.grade中的 buildToolsVersion  调整为安装的sdk版本
第一次使用Gradle构建Java程序
目录结构│ build.gradle └─src └─main └─java └─com └─manning └─gia └─todo │ ToDoApp.java
Guava的Jar包(guava-26.0-jre.jar)
Guava是Google公司开发的一款适用于Java的工具类集合。
android studio中出现gradle编译失败: Could not resolve all dependencies for configuration ':app:_debugApkCop
1.原因 Error:A problem occurred configuring project ':app'. > Could not resolve all dependencies for configuration ':app:_debugApkCopy'. > Could not resolve com.tencent.bugly:crashreport:lates...
Starting a Gradle Daemon, 5 busy and 1 incompatible and 1 stopped Daemons could not be reused, use -...
执行gradle build出的问题,查看hs_err_pid11064.log日志文件发现,是电脑的RAM不足导致
solve Error:Could not find common.jar (android.arch.core:common:1.0.0). Searched in the following
Error:Could not find common.jar (android.arch.core:common:1.0.0).Searched in the following locations:    https://jcenter.bintray.com/android/arch/core/common/1.0.0/common-1.0.0.jar对于这个问题,问题出在app build...
kotlin_version解决Error:Unable to find method 'org.gradle.api.internal.project.ProjectInternal.g
ext.kotlin_version = '1.1.2-4'便可解决如果不是kotlin 的事情的话 请接着往下看错误描述今天在Github上面下载了一份代码,然后导入到<em>Android</em> <em>Studio</em>中直接报了如下图所示的错误: 错误描述如下:Error: Unable to find method ‘org.gradle.api.internal.project.ProjectInternal...
今天写项目时遇到了一个问题could not delete path'......'\output\jars\classes.jar 没法运行,也没法打包
原因暂时不明,之前是在网上下了个demo,然后让下载一些新的各种巴拉巴拉之类的文件,不然运行不起来 我就下载了,出现了这个问题!   在bilid里提示的是这个错 自己找了一会问题,然后我是自己项目里运行的时候出的这个错,里面拷贝的有之前下的demo的文件 以为是文件问题,注释了也不可以,然后就把代码恢复到了下午刚开始写的时候   发现依然不可以,然后自己再网上搜到了一些,发现了...
Android Studio遇到报错:cannot delete xxx file
当rebuild 或者 clean 工程的时候,会出现 cannot delete 某个文件的报错: Error:Execution failed for task ':app:clean'. > Unable to delete directory: D:\My_projects\<em>Android</em>_Projects\TestLibJpeg2\app\build 不要方,也许是这个文件被其
java.io.IOException: Could not delete path 'C:\Users\Administrator\AndroidStudioProjects\SuperMarket
java.io.IOException: Could not delete path 'C:\Users\Administrator\<em>Android</em><em>Studio</em>Projects\SuperMarket\app\build\intermediates\transforms\dexBuilder\debug\56\com\android\tools\ir'. 第三方包错误,手动删除这个目录下的ir文
gradle配置不成功,求助
Error:Could not find com.android.tools.build:gradle:22.0.1. Searched in the following locations: htt
升级Android Studio3.0 Error:A problem occurred configuring project ':app'. > android-apt plugin is inc
Error:A problem occurred configuring project ':app'. > android-apt plugin is incompatible with the <em>Android</em> Gradle plugin. Please use 'annotationProcessor' configuration instead.原因 原来项目里使用的是android-ap
Andrid Studio Gradle sync failed: A problem occurred configuring project ':app' 解决方法
我在<em>Android</em> <em>Studio</em>中进行Gradle sync 时出现了这个错误,<em>Android</em> <em>Studio</em> <em>出错</em>提示是 Gradle sync failed: A problem occurred configuring project ‘:app’,而错误日志的最后几行 是这样子的 2018-10-30 21:05:30,041 [thread 106] WARN - ect.sync.i...
A problem occurred configuring project ....
-
Guava19.0已经下载,不知怎么导入eclipse
高手教我一下,谢谢了
AS 打包问题求助Could not download kotlin-stdlib.jar
程序出现这个错误,这个安装包我下载下来了,不知道放在哪里,然后怎么操作? 安卓包版本:kotlin-stdlib-1.2.0
Error:A problem occurred configuring project ':app'.
在github上导入项目,或其他地方导入<em>Android</em> <em>Studio</em>,出现Error:A problem occurred configuring project ':app'.的错误。 其实这种错误有很多种原因,需要对每种情况进行不同的处理才行,这里说的一种情况是JNI的情况,即该项目使用到C/C++库,此时需要引入NDK才行,先看下错误提示Gradle 'trunk' project ref...
Could not download fastutil.jar (it.unimi.dsi:fastutil:7.2.0): No cached version available for offli
把这段代码加入 build.gradle buildscript { repositories { maven{ url ‘http://maven.aliyun.com/nexus/content/groups/public/’} google() } } allprojects { repositories { maven{ url ‘http://maven.aliyun.com/nexus...
【我的Android进阶之旅】解决AndroidStudio编译时报错:Timeout waiting to lock artifact cache .
1、 错误描述今天在<em>Android</em> <em>Studio</em>中,使用gradle命令的时候,出现了如下所示的错误:D:\GitLab Source\XTCLint>gradlew clean uploadArchives --stacktrace Starting a Gradle Daemon, 1 busy and 1 incompatible Daemons could not be reused, us
react native开发Android 篇——运行错误收集
react native开发<em>Android</em> 篇——运行报错:Could not read path 报错内容:Could not read path 'C:\Users\123\Desktop\react_native_app\DaysMatter\android\app\build\generated\not_namespaced_r_class_sources\debug\processDeb...
Android Studio编译错误提示信息
-
使用androidstudio当遇上gradle编译失败时,如何才能看到详细的错误信息?
使用以下命令中的其中一个即可1.gradlew compileDebug --stacktrace2.gradlew compileDebug --stacktrace -info3.gradlew compileDebug --stacktrace -debug 4.(推荐)gradlew compileDebugSources --stacktrace -info...
androidstudio编译失败时查错方法
例如我遇到的错误为Execution failed for task ‘:app:processDebugResources’ 但没有显示到底是哪里错了。 你可以尝试执行如下命令: ./gradlew assembleDebug --stacktrace 有三个参数可选: 1. –stacktrace 获取堆的跟踪信息 2. –debug 获取更多的log信息 3. –scan...
Error:Could not find com.android.tools.build:gradle-core:2.3.3. Searched in the following locations:
-
Android Studio 使用中 遇到的那些奇奇怪怪的问题
版权声明:1、本BLOG的目的、形式及内容。   此BLOG为个人维护BLOG,内容均来自 原创及互连网转载。最终目的为收集整理自己需要的文章技术等内容,不涉及商业用途。\r\n 2、有关原创文章的版权   本BLOG上原创文章未经本人许可,不得用于商业用途及传统媒体。网络媒体转载请注明出处,否则属于侵权行为。\r\n 3、有关本站侵权   本BLOG所转载的内容,均是本人未发现有对文章版权声明的...
guava.jar包 运行错误
-
Android Studio之让人懵逼的错误:Failed to load native library 'native-platform.dll' for Windows 10 x86.
在使用<em>Android</em> <em>Studio</em>的时候,经常会遇到各种莫名其妙的错误,让人一脸懵逼,无从下手,有时候整一天都弄不明白,既浪费了时间又让人身心俱疲。下面我把我这次遇到的奇葩问题和解决办法贴到这里,希望能够帮到大家,让大家1分钟就爬坑成功!(心疼自己个儿)1.错误描述: Error:Unable to start the daemon process. This problem might be
Android Studio下“Error:Could not find com.android.tools.build:gradle:2.2.1”的解决方法
今天更新<em>Android</em> <em>Studio</em>后打开Project,报错: Error:Could not find com.android.tools.build:gradle:2.2.1. Searched in the following locations:     file:/D:/Program Files/<em>Android</em>/android-studio/gradle/m2repos
Android在对Sdcard进行文件的读写操作的时候报错FileNotFoundException
在对Sdcard进行文件的读写操作的时候报错FileNotFoundException File targetFile = new File("/mnt/sdcard/count.txt"); 用RandomAccessFile raf = new RandomAccessFile(targetFile, "rw"); RandomAccessFile:...
gradle build出错,不知道这是为什么
-
IDEA导入gradle文件报错
IDEA版本:2016.1.1 纠结了很久,没弄出来     昨天还是好好的,今天就不行了。求解决
导入RecyclerView-v7的时候gradle build出错
-
Android Studio;Gradle:unable to delete file
-
Could not delete path 'E:\xx\xx\xxapp\build\intermediates\transforms\mergeJar
项目运行中,无意见出现这个问题,查找好多,都没解决最后还是使出杀手锏,删除.gradle和.build下的所有文件。之后clean 重构项目。再次运行才一切正常能够正常运行。...
Could not find com.android.databinding:library:1.2.1. Required by: XXXXX:app:unspecified
解决由于androidstudio 升级导致的 Could not find com.android.databinding:library:1.2.1. Required by: XXXXX:app:unspecified 问题
Could not find common.jar (android.arch.core:common:1.0.0). Searched in the following locations:
在我解决Could not find com.android.tools.build:gradle:3.0.1这个问题,也就是刚刚写的博客之后,又出现了个Could not find com.android.tools.build:gradle:3.0.1的问题,其实解决方法也很简单,如下: // Top-level build file where you can add configur...
Android Studio 常见问题
1.Error:A problem occurred configuring project ':MaterialPreference'. > Could not resolve all dependencies for configuration ':MaterialPreference:_debugCompile'.    > Could not find com.android.supp
AS导入项目报Dagger2错误:Could not download dagger-compiler.jar (com.google.dagger:dagger-compiler:2.15)
具体错误提示为: Error:Could not resolve all files for configuration ':app:debugAnnotationProcessorClasspath'. &amp;gt; Could not download dagger-compiler.jar (com.google.dagger:dagger-compiler:2.15)    &amp;gt; Cou...
Android Studio Gradle project sync failed,Configure project:app 前出现红叹号
-
java.io.IOException: Could not delete path。。。。。。
android studio<em>编译</em>时提示:java.io.IOException: Could not delete path 'E:\<em>Android</em>WorkSpace\。。。。\rtu\build\generated\source\r\debug\android\support'. 原因:上次<em>编译</em>的缓存没清空导致,可直接手动clean,或者进入android目录下:gradle clean...
Android studio build时候报错
-
android studio 引入guava
官方配置文档  https://github.com/google/guava/wiki/UseGuavaInYourBuilddependency 直接用下面那个就好了<em>编译</em>之后报错  原文连接 :https://www.jianshu.com/p/d5d3a92e5e1dWarning:Conflict with dependency 'com.google.code.findbugs:jsr3...
android clean时出现错误
-
Spark 开发环境搭建(1)IDEA Gradle的安装部署、使用
Spark 开发环境搭建(1)使用IDEA Gradle的方式1,JAVA环境检查 C:\Windows\System32>java -versionjava version "1.8.0_121"Java(TM) SE Runtime Environment (build 1.8.0_121-b13)Java HotSpot(TM) 64-Bit Server VM (build 25.121-
Android studio引入依赖的时候出现问题
我在<em>Android</em> studio引入依赖的时候出现了问题,我当前现在的SDK版本分别是23,22,19三个版本,例如:当我引入v7包的时候,应该能在choose library dependency中
android studio打包的时候出现问题了,求大神解决啊
Error:Execution failed for task ':app:dexRelease'. > java.util.zip.ZipException: error in opening zi
Gradle报错:java.io.IOException: Unable to establish loopback connection
先说下问题原因: 总结起来就是jvm无法访问127.0.0.1 有可能出现的情况: 1.java被禁网了。。。。我就是这样浪费了三天时间 2.防火墙问题 3.ipv6的问题 …其他的反正跟网络有关的问题 错误信息大概如下Starting a Gradle Daemon, 1 incompatible and 1 stopped Daemons could not be reused, use
React Natived打包报错java.io.IOException: Could not delete path '...\android\support\v7'解决
问题详情React Native打包apk时在第二次<em>编译</em>时候报错:java.io.IOException: Could not delete path 'D:\mycode\reactnative\SecondTest\android\app\build\generated\source\r \release\android\support\v7问题解决直观上看是没有删除某个文件,产生的IOExc...
guava-19.0.jar
Guava工程包含了若干被Google的 Java项目广泛依赖 的核心库,例如:集合 、缓存 、原生类型支持 、并发库 、通用注解 、字符串处理 、I/O 等等。 所有这些工具每天都在被Google的
解决:Please specify version of Web Project through configuration property of war plugin。
我出现报错的位置是在创建了一个maven war包的情况下,maven项目的pom.xml文件首行报错:Cannot detect Web Project version. Please specify version of Web Project through &amp;lt;version&amp;gt; configuration property of war plugin. E.g.: &amp;lt;plu...
AndroidStudio 报错
Starting a Gradle Daemon, 2 incompatible Daemons could not be reused, use --status for details FAILURE: Build failed with an exception. * What went wrong: Unable to start the daemon process. This pr...
提供 guava-19.0.jar 的jar包的下载链接云盘
guava-19.0.jar 的jar包下载云盘。如下: 链接:http://pan.baidu.com/s/1c2khCxa 密码:5o65 里面一个jar包,一个相当于是源码包,里面的数据更全点。都是19版本的。 github开源项目:https://github.com/google/guava/wiki/Release19 英文的api:http://google.github.io/guava/releases/19.0/api/docs/ 请叫我大师兄
AndroidStudio编译出现 Could not download auto-value.jar(...):No cached version available for offline mod
前天下午出现一个比较蛋疼的问题      可能是AS的问题 gradle的问题 AS下载不了jar包,于是我开始上网各种百度,刷机,重装。。。。 注意:根本就不是其他人所说的关闭离线模式,至少在我这里是行不通的!   解决方法 你可能需要一个翻墙工具 我用了ssr 打开srr,确保你的链接能用,登录下google看下能不能用。 能用的话 然后再设置中如下   ...
AS Gradle构建失败异常:Could not download gradle.jar (io.fabric.tools:gradle:1.25.4)
<em>Android</em> <em>Studio</em> 项目Gradle构建失败异常一:报错如下: Error:A problem occurred configuring project ':app'.&amp;gt; Could not resolve all dependencies for configuration ':app:classpath'.&amp;gt; Could not download gradle.ja...
记录使用gradle编译spring源码时发生的错误
D:\Program Files\spring-framework\spring-beans&amp;gt;gradle cleanidea eclipseStarting a Gradle Daemon, 4 incompatible and 1 stopped Daemons could not be reused, use --status for detailsFAILURE: Build fai...
Andorid Studio 集成 Google Protocol Buffer(简称protobuf)
Andorid <em>Studio</em> 集成 Google Protocol Buffer(简称protobuf) 一、配置gradle导如protobuf 1、项目的build.gradle文件中加入 classpath 'com.google.protobuf:protobuf-gradle-plugin:0.8.0' 2、模块的build.gradle文件 顶部添加proto
Android错误总结
<em>Android</em>错误总结博客撰写人:It一zhai男 转载请标明地址:http://blog.csdn.net/u013293125/article/details/52636929最近一直想将自己编写程序时遇到的错误总结一下,但因为诸多原因一直都没付诸行动。这个错误总结本人将会不断更新,以下错误是本人遇到并解决了,编程工具<em>Android</em> studio 2.0。错误提示一:Error:Executi
Android Things:撸起袖子来创建第一个Things工程
在前面的章节,我们利用官方的sample-simplepio项目的blink模块,给大家演示了如何导入和运行现成的<em>Android</em> Things工程。那么这个章节,我们来手把手的给大家演示,如何从零开始创建、开发和运行一个<em>Android</em> Things项目。 1.前期准备 在你开始创建你的<em>Android</em> Things项目之前,你必须完成以下事情: 更新你的SDK工具为24或者更高版本,更新的SDK工具可以让你能构建和测试Things应用。 更新你的SDK为<em>Android</em> 7.0(API 24)或者更高,
* What went wrong: A problem occurred configuring project ':app'. > SDK location not found. Define l
  错误提示:    问题定位:        经过查看错误日志,发现是没有找到SDK的路径所导致的。   解决办法:       1、在react native 工程中的android根目录下创建一个local.properties 文件,并在其中加入如下代码,sdk.dir=你本地SDK的路径,我的是在D:\<em>Android</em>\android_sdk ,修改为你自己的即可 s...
rn 启动项目失败:A problem occurred configuring project ':app'. (二)
再配置好sdk后,遇到此问题解决办法:从下载好的sdk中,找到sdkmanager,打开后下载需要的sdk组件
A problem occurred configuring project ':react-native-camera'. > The SDK Build Tools revision
 A problem occurred configuring project ':react-native-camera'.      &amp;gt; The SDK Build Tools revision (23.0.1) is too low for project ':react-native-camera'. Minimum required is 25.0.0在androidStoudio...
Android Studio报错a problem occurred configuring project ' app'. java.lang.nullpointerexception
今天换了台新电脑,把老电脑上的android studio项目打成压缩包,拷贝到新电脑上解压运行, 结果给我报了个 a problem occurred configuring project ’ :library’. java.lang.nullpointerexception 原来我项目中使用了c++的库,但是新装的android studio没有自动安装ndk插件,导致无法<em>编译</em>c++文件。 ...
Error:A problem occurred configuring project ':app'. > failed to find target with hash string 'andro
在导入安卓项目时,报如题所示错误:Error:A problem occurred configuring project ':app'.&amp;gt; failed to find target with hash string 'android-22' in: C:\Program Files\<em>Android</em>\sdk大致意思读个七七八八:在 C:\Program Files\<em>Android</em>\sdk下...
更新AS2.3.1后更新慢及更新好后出现Gradle sync failed: Failed to find Build Tools revision 26.0.1的解决办法
问题 <em>Android</em> <em>Studio</em>2.3.1更新后,我的AS版本如下图,无论自动Sync Project with Gradle Files,还是手动加载gradle-3.3-all.zip文件,也不论你解压不解压,也无论你是放在如下文件夹,还是放在自定义的文件夹。 都会出现Gradle sync failed: Failed to find Build Tools r
解决Jenkins构建Android app无法找到SDK路径问题
默认Jenkins没有设置<em>Android</em> SDK环境的选项,所以构建App时会报错。 报错信息如下:01:52:21.861 [INFO] [org.gradle.api.Project] Parsing the SDK, no caching allowed 01:52:21.872 [ERROR] [org.gradle.BuildExceptionReporter] 01:52:21.87
Android Studio 编译常见问题解决办法
1.dexDebug ExecException finished with non-zero exit value 2 需要在gradle中配置下面的代码,原因是引用了多个libraries文件 defaultConfig { multiDexEnabled true } 2.Exe
Error:Could not download hamcrest-core.jar (org.hamcrest:hamcrest-core:1.3): No cached version avai
创建好项目后,编辑一部分代码<em>编译</em>时发生如上错误,通过查找百度和查找资料发现,是因为最新的创建项目会使用junit库来进行代码测试,在下载这个库的内容的时候发现他引用了hamcrest这个框架,不过国内下载这个框架的hamcrest-core.jar不成功(博主电脑没有翻墙)。  尝试方法1 In my experience, When I created a new project I encou...
Failed to find Build Tools revision 26.0.1
Error:A problem occurred configuring project ':app'. > Failed to find Build Tools revision 26.0.1 在build.gradle 中buildToolsVersion 如何修改。看本地安装了哪些版本的 进入文件夹<em>Android</em> SDK 目录下build-tools,修改为里面有
解决Android Studio中Gradle版本不对应无法调试app的问题
遇到的问题 Windows操作系统下,在导入一个<em>Android</em>工程到<em>Android</em> <em>Studio</em>中时,调试时Gradle拨错,错误提示如下: -------------------------------------------------------------------------------------------- FAILURE: Build failed with an exc
spring源码导入eclipse,A problem occurred configuring project ':spring-orm-hibernate4'.
今天下了下spring的源码,打算深入了解下spring的机制,在源码导入eclipse的过程中,遇到了一些问题,现把解决过程中查阅到的博客共享一下,方便遇到同样问题的同学做个参考: http://blog.csdn.net/gksrxn/article/details/14105245 这里讲的是源码导入的过程,IDE我使用的还是eclipse,在执行gradle命令的时候,会出现以下错误:
ReactNative android 之 (A problem occurred configuring project 'app'.异常)
ReactNative android 之 A problem occurred configuring project ‘:app’.异常异常信息如下:A problem occurred configuring project ':app'. > You have not accepted the license agreements of the following SDK component
在mac 上配置AndroidStudio碰到的坑
1.配置完jdk与sdk后<em>编译</em>报这个错; Error:Could not find com.android.tools.build:gradle:2.8. Searched in the following locations:     file:/Users/lollipop/Documents/<em>Android</em> <em>Studio</em>.app/Contents/gradle/m2repository
Error:Could not find com.android.tools.build:gradle:2.14.1-all. Searched in the following locations:
Error:Could not find com.android.tools.build:gradle:2.14.1-all. Searched in the following locations: 这篇文章来总结一下 gradle文件相关的几个 报这个错,看提示,挨着每个文件夹找,就能看到在D 的目录下没有这个gradle文件,看哈有那个,就添加 这里的的gradle
Execution failed for task ':app:processDebugResources'. > java.io.IOException: Could not delete path
Error:Execution failed for task ':app:processDebugResources'. > java.io.IOException: Could not delete path C:\Users\ehsan\<em>Android</em><em>Studio</em>Projects\MyApplication3\app\... 这个问题是我在as 2.2.2升级到2.2.3的时候出现
Java入门到精通——调错篇之Eclipse No Java virtual machine was found after searching the following locations
一、错误现象。        在一次启动Eclipse的时候弹出了下面的错误 二、错误原因        原因是没有找到javaw.exe文件的路径。 三、解决方案        在eclipse根目录下找到eclipse.ini加入下面一句话              -vm             D:\Java\jdk1.8.0_25\bin(jdk的bin目录路径)
eclipse打开异常(No Java virtual machine was found after searching the following locations)
描述:点击桌面的eclipse快捷方式打开eclipse后出现以下提示框No Java virtual machine was found after searching the following locations翻译过来就是:在以下的地址找不到java虚拟机错误的意思是:在指定的路径D:\eclipse\jre\bin\javaw.exe下面没有找到javaw.exe。原因是Eclipse启...
AndroidStudio配置常见问题及解决
1,"Unable to access <em>Android</em> SDK add-on list..." 解决:直接点击cancel,取消后进入系统在SDK Manager中重新定位sdk文件夹的位置 2,第一次打开AS后出现”Could not download junit.jar (junit:junit:4.12)“ 解决:重新下载junit4.12,并将其放在...\<em>Android</em> S
java.io.IOException: Could not delete path 'F:\MyProject\five\android\app\buil
在学习react native中通过命令提示符  react-native run-android 会出现  java.io.IOException: Could not delete path 'F:\MyProject\five\android\app\buil  Could not find tools.jar. Please check that C:\Program Files\Ja
Android Studio开发过程中各种问题
我的微信公众号: 该贴的原文地址:https://www.cnblogs.com/royi123/p/5378056.html 1.dexDebug ExecException finished with non-zero exit value 2 全bug日志如下: (Error:Execution failed for task ':app:dexDebug'. &g...
Android studio常见问题
1、Error:Execution failed for task ':mygirlFlash:transformClassesWithJarMergingForDebug'. > com.<em>Android</em>.build.api.transform.TransformException: Java.util.zip.ZipException: duplicate entry: MTT/Third
Android Studio Build 错误
相信很多朋友遇到过这样的Bug Error:Execution failed for task ':app:processDebugResources'. > java.io.IOException: Could not delete path 'C:\Users\newone\Desktop\XXXX\app\build\generated\source\r\debug\android\suppo
java.io.IOException: Could not delete path 'E:\rn\PentaxPhotoSync\android\app\build\generated\
 Execution failed for task ':app:generateDebugBuildConfig'.&amp;gt; java.io.IOException: Could not delete path 'E:\rn\PentaxPhotoSync\android\app\build\generated\source\buildConfig\debug\com'. 相信不少人都遇到过ja...
Gradle 构建的时候出现了如下错误: java.io.IOException: Could not delet folder "xxx"
<em>Android</em><em>Studio</em> Gradle 构建的时候出现了如下错误 Error:Execution failed for task ‘:app:processDebugResources’. java.io.IOException: Could not delete folder C:\Users\xxx\<em>Android</em><em>Studio</em>Projects\MyApplication\app...
java.io.IOException: Could not delete path
java.io.IOException: Could not delete path 'C:\Users\Administrator\Desktop\QFDrone\app\build\generated\source\r\anzhi\debug\android\support\graphics'.这是因为上次<em>编译</em>的缓存没清空导致,手动clean一下即可。...
android开发中遇到的问题汇总【八】
一. 工具使用245.使用androidstudio时,不知道什么原因svn不见了<em>Android</em> <em>Studio</em> missing Subversion pluginPlease make sure that the “SubversionIntegration” plugin is enabled in Preferences > Plugins248.androidstudio 如何自动import
android studio import project 错误汇总--基础篇
1、导入工程以后 Error:Could not find com.android.tools.build:gradle:1.3.1. Searched in the following locations:     file:/E:/android-studio/gradle/m2repository/com/android/tools/build/gradle/1.3.1/gradle-
cordova 安装配置 及遇到的问题解决
1,需要先按照node.js   下载地址:https://nodejs.org/en/   默认安装目录:C:\Program Files\nodejs 2,cmd下运行命令 npm install -g cordova (如果安装<em>出错</em> 就是网络连接失败 因为是国外网 需要 网络代理软件  这里我用的软件是  proxy999   安装完后 运行cordova  运行成功
Android Studio 常见 Build 问题 Error:failed to find Build Tools revision 23.0.2
问题一有时候从 Github 上拷贝人家的工程,运行会出现各种依赖包、版本包问题。 修改 build.gradle在项目的 build.gradle 里面设置,注意有两个build.gradle,最好都注意一下。把build.gradle里面的版本改为自己能运行的工程里面版本号。android { compileSdkVersion 22 buildToolsVersion "23
学会了这些技术,你离BAT大厂不远了
每一个程序员都有一个梦想,梦想着能够进入阿里、腾讯、字节跳动、百度等一线互联网公司,由于身边的环境等原因,不知道 BAT 等一线互联网公司使用哪些技术?或者该如何去学习这些技术?或者我该去哪些获取这些技术资料?没关系,平头哥一站式服务,上面统统不是问题。平头哥整理了 BAT 等一线大厂的必备技能,并且帮你准备了对应的资料。对于整理出来的技术,如果你掌握的不牢固,那就赶快巩固,如果你还没有涉及,现在...
java设计模式下载
java设计模式 权威的Java设计模式! 相关下载链接:[url=//download.csdn.net/download/zsb545128/4309450?utm_source=bbsseo]//download.csdn.net/download/zsb545128/4309450?utm_source=bbsseo[/url]
hibernate-3.5.6 源码下载
hibernate-3.5.6 源码,大家可以下载参考下,这里就不要积分了 相关下载链接:[url=//download.csdn.net/download/a317207/6884165?utm_source=bbsseo]//download.csdn.net/download/a317207/6884165?utm_source=bbsseo[/url]
鸟哥的Linux基础第四版下载
书中包含了鸟哥从完全不懂Linux 到现在的所有学习历程,鸟哥将这几年来的所知所学倾囊相授,以浅显易懂的文字带领您进入Linux 的世界。 相关下载链接:[url=//download.csdn.net/download/aboboo5200/10846609?utm_source=bbsseo]//download.csdn.net/download/aboboo5200/10846609?utm_source=bbsseo[/url]
相关热词 c# 去除空格 c#读取tiff未bmp c# 识别回车 c#生成条形码ean13 c#子控制器调用父控制器 c# 写大文件 c# 浏览pdf c#获取桌面图标的句柄 c# list反射 c# 句柄 进程
我们是很有底线的