Android Studio 编译出错,求助!万分感谢! [问题点数:40分]

Bbs1
本版专家分:0
Blank
GitHub 绑定GitHub第三方账户获取
结帖率 0%
Bbs1
本版专家分:0
Android错误总结
<em>Android</em>错误总结博客撰写人:It一zhai男 转载请标明地址:http://blog.csdn.net/u013293125/article/details/52636929最近一直想将自己编写程序时遇到的错误总结一下,但因为诸多原因一直都没付诸行动。这个错误总结本人将会不断更新,以下错误是本人遇到并解决了,编程工具<em>Android</em> studio 2.0。错误提示一:Error:Executi
Error:Could not download guava.jar (com.google.guava:guava:19.0): No cached version available for of
今天从git导入demo 报错 Error:Could not download guava.jar (com.google.guava:guava:19.0): No cached version available for offline mode 不能下载,guava.jar 自己的处理方法: 步骤1:找到File - Other settings - Default se
关于Mac os gradle 编译时报‘could not download gradle.jar…’的错误问题解决
报这个错误的主要原因是没有对应的gradle的jar包 需要分别在目录                 Users/apple /.gradle/wrapper 和android studio的目录     <em>Android</em> <em>Studio</em>.app/Contents/gradle 下都放上对应的gradle的jar包就可以解决问题了。 关于gradle的jar包版本查看在项目的gradle/w
AndroidStudio Gradle报错(org.gradle.api.ProjectConfigurationException: A problem occurred configuring)
问题 1、org.gradle.api.ProjectConfigurationException: A problem occurred configuring… 2、<em>Android</em><em>Studio</em> 运行按钮为灰色 原因 有些jar包不能正常下载 解决方式 第一步:修改项目的build.gradle文件中,修改repositories配置为 repositories { maven{ url '...
解决AndroidStudio编译时报错:org.gradle.api.ProjectConfigurationException;编译报错Read Time out
问题一: org.gradle.api.ProjectConfigurationException: A problem occurred configuring root project ‘app’. 错误:<em>编译</em>报错Read Time out , 分析一: 1.看log是 下载jar包时候超时了, org.gradle.api.ProjectConfigurationException: A p...
Error:A problem occurred configuring project ':app'. > failed to find Build
使用android studio进行build时出现此错误Error:A problem occurred configuring project ':app'
AndroidStudio Could not find XXXJar Searched in the following Locations错误解决
<em>Android</em> <em>Studio</em> 自带Jcenter 指向的URL错误的坑 这个惨案的起因是我需要导入一个jar包,不得不说,大概是本人太菜,所以在<em>Android</em><em>Studio</em>中的导包总是很愚蠢,这就是我导入的包,这里点击OK,然后开始sync同步然后build工程。 然后嘛,就出了问题,而且并不是什么连不上网,连不上服务器的问题,到最后我发现错误的原因真是蠢到令人怀疑这个东西存在的意义是什么。 错误...
solve Error:Could not find common.jar (android.arch.core:common:1.0.0). Searched in the following
Error:Could not find common.jar (android.arch.core:common:1.0.0).Searched in the following locations:    https://jcenter.bintray.com/android/arch/core/common/1.0.0/common-1.0.0.jar对于这个问题,问题出在app build...
A problem occurred configuring project ':app'. > failed to find Build Tools revision 23.0.1
在初学react-native时,执行命令react-native run-android会报如下错误: react-native run-android Starting JS server... Building and installing the app on the device (cd android && ./gradlew installDebug... FAILU
第一次使用Gradle构建Java程序
目录结构│ build.gradle └─src └─main └─java └─com └─manning └─gia └─todo │ ToDoApp.java
flutter Could not download guava.jar
问题出现:添加了path_provider库 path_provider: ^0.5.0 解决: 1、新建环境变量 PUB_HOSTED_URL=&gt;https://pub.flutter-io.cn FLUTTER_STORAGE_BASE_URL=&gt; https://storage.flutter-io.cn 可能出现问题:gradle需要至少3.3版本,找到android目录下的b...
解决AndroidStudio编译时报错:org.gradle.api.ProjectConfigurationException
修改项目外gradle配置   repositories {         jcenter()         maven{url 'http://maven.aliyun.com/nexus/content/groups/public/'}         google()     }  repositories {         jcenter()         maven{url ...
Starting a Gradle Daemon, 5 busy and 1 incompatible and 1 stopped Daemons could not be reused, use -...
执行gradle build出的问题,查看hs_err_pid11064.log日志文件发现,是电脑的RAM不足导致
androidstudio运行时总是报错
-
Android Studio运行时报错:Could not resolve all dependencies for configuration ':app:_
第一次用<em>Android</em> <em>Studio</em>开发。但在<em>Android</em> <em>Studio</em>运行时报错: Could not resolve all dependencies for configuration ':a
Android Studio报错:Error:Could not find com.android.tools.build:gradle:4.1 记一次不长记性的坑
看字面意思,这个问题是Gradle没有对应版本。在搜索引擎失效之后,尝试自己解决。 有一点很重要,先保证自己的<em>Android</em> <em>Studio</em>是最新的稳定版本!因为版本更新会修复很多bug,说不定遇到报错就是某个bug引起的。 Could not find com.android.tools.build:gradle:3.0.0. 首先,看报错,大概是长这样的: Error:Could ...
Could not resolve all dependencies for configuration ':classpath'.
Error:Gradle: A problem occurred configuring root project 'MobileShopping'. > Could not resolve all dependencies for configuration ':classpath'.    > Could not resolve com.android.tools.build:gradle
Android Studio遇到报错:cannot delete xxx file
当rebuild 或者 clean 工程的时候,会出现 cannot delete 某个文件的报错: Error:Execution failed for task ':app:clean'. > Unable to delete directory: D:\My_projects\<em>Android</em>_Projects\TestLibJpeg2\app\build 不要方,也许是这个文件被其
Guava的Jar包(guava-26.0-jre.jar)
Guava是Google公司开发的一款适用于Java的工具类集合。
Android Studio无法调试运行app的解决
----------------------------------------------------------------------------------------------- 遇到的问题: 问题1. 新建一个名为HelloWorld的project后无论链接真机调试还是用<em>Android</em> <em>Studio</em>自带的模拟器调试,均无任何结果,app安装不到真机或者模拟机上面。(注:真机和
android studio中出现gradle编译失败: Could not resolve all dependencies for configuration ':app:_debugApkCop
1.原因 Error:A problem occurred configuring project ':app'. &gt; Could not resolve all dependencies for configuration ':app:_debugApkCopy'. &gt; Could not resolve com.tencent.bugly:crashreport:lates...
kotlin_version解决Error:Unable to find method 'org.gradle.api.internal.project.ProjectInternal.g
ext.kotlin_version = '1.1.2-4'便可解决如果不是kotlin 的事情的话 请接着往下看错误描述今天在Github上面下载了一份代码,然后导入到<em>Android</em> <em>Studio</em>中直接报了如下图所示的错误: 错误描述如下:Error: Unable to find method ‘org.gradle.api.internal.project.ProjectInternal...
Adroid Studio无法找到maven_push.gradle文件
-
今天写项目时遇到了一个问题could not delete path'......'\output\jars\classes.jar 没法运行,也没法打包
原因暂时不明,之前是在网上下了个demo,然后让下载一些新的各种巴拉巴拉之类的文件,不然运行不起来 我就下载了,出现了这个问题!   在bilid里提示的是这个错 自己找了一会问题,然后我是自己项目里运行的时候出的这个错,里面拷贝的有之前下的demo的文件 以为是文件问题,注释了也不可以,然后就把代码恢复到了下午刚开始写的时候   发现依然不可以,然后自己再网上搜到了一些,发现了...
java.io.IOException: Could not delete path 'C:\Users\Administrator\AndroidStudioProjects\SuperMarket
java.io.IOException: Could not delete path 'C:\Users\Administrator\<em>Android</em><em>Studio</em>Projects\SuperMarket\app\build\intermediates\transforms\dexBuilder\debug\56\com\android\tools\ir'. 第三方包错误,手动删除这个目录下的ir文
gradle配置不成功,求助
Error:Could not find com.android.tools.build:gradle:22.0.1. Searched in the following locations: htt
关于gradle版本问题导致的一系列奇葩问题探讨!
相信网友们遇到了各种奇葩的问题,现在应该都解决了把,因为现在的版本没出现这种问题了,应该都修复了。 时间往前推1个月,问题可是n多啊,什么插件太老,用了最新的又出现另外一个问题,结果我一个一个版本的gradle,和android plugin 版本的实验发现最新版都是问题后面降级老版本实验才最终搞定, 现在呢,最新版应该没啥大问题,前不久不过遇到了debug运行模式tabhost,facebo
升级Android Studio3.0 Error:A problem occurred configuring project ':app'. > android-apt plugin is inc
Error:A problem occurred configuring project ':app'. > android-apt plugin is incompatible with the <em>Android</em> Gradle plugin. Please use 'annotationProcessor' configuration instead.原因 原来项目里使用的是android-ap
Andrid Studio Gradle sync failed: A problem occurred configuring project ':app' 解决方法
我在<em>Android</em> <em>Studio</em>中进行Gradle sync 时出现了这个错误,<em>Android</em> <em>Studio</em> <em>出错</em>提示是 Gradle sync failed: A problem occurred configuring project ‘:app’,而错误日志的最后几行 是这样子的 2018-10-30 21:05:30,041 [thread 106] WARN - ect.sync.i...
A problem occurred configuring project ....
-
Guava19.0已经下载,不知怎么导入eclipse
高手教我一下,谢谢了
AS 打包问题求助Could not download kotlin-stdlib.jar
程序出现这个错误,这个安装包我下载下来了,不知道放在哪里,然后怎么操作? 安卓包版本:kotlin-stdlib-1.2.0
Could not download fastutil.jar (it.unimi.dsi:fastutil:7.2.0): No cached version available for offli
把这段代码加入 build.gradle buildscript { repositories { maven{ url ‘http://maven.aliyun.com/nexus/content/groups/public/’} google() } } allprojects { repositories { maven{ url ‘http://maven.aliyun.com/nexus...
【我的Android进阶之旅】解决AndroidStudio编译时报错:Timeout waiting to lock artifact cache .
1、 错误描述今天在<em>Android</em> <em>Studio</em>中,使用gradle命令的时候,出现了如下所示的错误:D:\GitLab Source\XTCLint>gradlew clean uploadArchives --stacktrace Starting a Gradle Daemon, 1 busy and 1 incompatible Daemons could not be reused, us
Android Studio报错a problem occurred configuring project ' app'. java.lang.nullpointerexception
今天换了台新电脑,把老电脑上的android studio项目打成压缩包,拷贝到新电脑上解压运行, 结果给我报了个 a problem occurred configuring project ’ :library’. java.lang.nullpointerexception 原来我项目中使用了c++的库,但是新装的android studio没有自动安装ndk插件,导致无法<em>编译</em>c++文件。 ...
react native开发Android 篇——运行错误收集
react native开发<em>Android</em> 篇——运行报错:Could not read path 报错内容:Could not read path 'C:\Users\123\Desktop\react_native_app\DaysMatter\android\app\build\generated\not_namespaced_r_class_sources\debug\processDeb...
Android Studio编译错误提示信息
-
使用androidstudio当遇上gradle编译失败时,如何才能看到详细的错误信息?
使用以下命令中的其中一个即可1.gradlew compileDebug --stacktrace2.gradlew compileDebug --stacktrace -info3.gradlew compileDebug --stacktrace -debug 4.(推荐)gradlew compileDebugSources --stacktrace -info...
androidstudio编译失败时查错方法
例如我遇到的错误为Execution failed for task ‘:app:processDebugResources’ 但没有显示到底是哪里错了。 你可以尝试执行如下命令: ./gradlew assembleDebug --stacktrace 有三个参数可选: 1. –stacktrace 获取堆的跟踪信息 2. –debug 获取更多的log信息 3. –scan...
Error:Could not find com.android.tools.build:gradle-core:2.3.3. Searched in the following locations:
-
Android Studio 使用中 遇到的那些奇奇怪怪的问题
版权声明:1、本BLOG的目的、形式及内容。   此BLOG为个人维护BLOG,内容均来自 原创及互连网转载。最终目的为收集整理自己需要的文章技术等内容,不涉及商业用途。\r\n 2、有关原创文章的版权   本BLOG上原创文章未经本人许可,不得用于商业用途及传统媒体。网络媒体转载请注明出处,否则属于侵权行为。\r\n 3、有关本站侵权   本BLOG所转载的内容,均是本人未发现有对文章版权声明的...
guava.jar包 运行错误
-
stm32cubemx生成不了keil工程?but MDK-ARM project generation have a problem
而且我的路径也没有中文啊,这是怎么回事,求大神们帮帮忙
Android Studio下“Error:Could not find com.android.tools.build:gradle:2.2.1”的解决方法
今天更新<em>Android</em> <em>Studio</em>后打开Project,报错: Error:Could not find com.android.tools.build:gradle:2.2.1. Searched in the following locations:     file:/D:/Program Files/<em>Android</em>/android-studio/gradle/m2repos
gradle错误“Could not resolve all dependencies for configuration”
在<em>Android</em> <em>Studio</em>中执行 gradle clean或者<em>编译</em>项目的时候,会报如下的错误: FAILURE: Build failed with an exception. * What went wrong: A problem occurred configuring project ':app'. > Could not resolve all depende
gradle build出错,不知道这是为什么
-
IDEA导入gradle文件报错
IDEA版本:2016.1.1 纠结了很久,没弄出来     昨天还是好好的,今天就不行了。求解决
导入RecyclerView-v7的时候gradle build出错
-
IDEA新建一个Gradle项目时,artifacts.ResolveException ModuleVersionResolveException
我用IDEA新建一个Gradle项目时,提示错误: Web project import errors Warning:root project 'test2': Web Facets/A
Android Studio;Gradle:unable to delete file
-
Could not delete path 'E:\xx\xx\xxapp\build\intermediates\transforms\mergeJar
项目运行中,无意见出现这个问题,查找好多,都没解决最后还是使出杀手锏,删除.gradle和.build下的所有文件。之后clean 重构项目。再次运行才一切正常能够正常运行。...
Could not find common.jar (android.arch.core:common:1.0.0). Searched in the following locations:
在我解决Could not find com.android.tools.build:gradle:3.0.1这个问题,也就是刚刚写的博客之后,又出现了个Could not find com.android.tools.build:gradle:3.0.1的问题,其实解决方法也很简单,如下: // Top-level build file where you can add configur...
Android Studio 常见问题
1.Error:A problem occurred configuring project ':MaterialPreference'. > Could not resolve all dependencies for configuration ':MaterialPreference:_debugCompile'.    > Could not find com.android.supp
android studio1.4编译报错
尝试新版本, os:win10 jdk 7u80 安装完毕后,创建新应用,<em>编译</em>报错,有如下信息。还请高手给些指点。重装也没有起作用。 Error:A problem occurred configur
AS导入项目报Dagger2错误:Could not download dagger-compiler.jar (com.google.dagger:dagger-compiler:2.15)
具体错误提示为: Error:Could not resolve all files for configuration ':app:debugAnnotationProcessorClasspath'. &amp;gt; Could not download dagger-compiler.jar (com.google.dagger:dagger-compiler:2.15)    &amp;gt; Cou...
AndroidStudio配置常见问题及解决
1,"Unable to access <em>Android</em> SDK add-on list..." 解决:直接点击cancel,取消后进入系统在SDK Manager中重新定位sdk文件夹的位置 2,第一次打开AS后出现”Could not download junit.jar (junit:junit:4.12)“ 解决:重新下载junit4.12,并将其放在...\<em>Android</em> S
以module形式导入library出错:Error:A problem occurred configuring project ':library'.
直入主题:在我项目开发时,需要导入第三方的library,在<em>Android</em> studio中以module形式导入到项目中,<em>编译</em>运行时,报了如下的错误:   经过查找,产生这个问题的原因有很多,后来发现,我的问题是因为导入library的build.gradle中有这样一段:   这个(红框框起来的代码)是引用NDK中的ABI文件,这时我发现我的<em>Android</em> studio中没有安装NDK。...
java.io.IOException: Could not delete path。。。。。。
android studio<em>编译</em>时提示:java.io.IOException: Could not delete path 'E:\<em>Android</em>WorkSpace\。。。。\rtu\build\generated\source\r\debug\android\support'. 原因:上次<em>编译</em>的缓存没清空导致,可直接手动clean,或者进入android目录下:gradle clean...
android studio 引入guava
官方配置文档  https://github.com/google/guava/wiki/UseGuavaInYourBuilddependency 直接用下面那个就好了<em>编译</em>之后报错  原文连接 :https://www.jianshu.com/p/d5d3a92e5e1dWarning:Conflict with dependency 'com.google.code.findbugs:jsr3...
android 中External Libraries中添加出问题
-
android clean时出现错误
-
Spark 开发环境搭建(1)IDEA Gradle的安装部署、使用
Spark 开发环境搭建(1)使用IDEA Gradle的方式1,JAVA环境检查 C:\Windows\System32>java -versionjava version "1.8.0_121"Java(TM) SE Runtime Environment (build 1.8.0_121-b13)Java HotSpot(TM) 64-Bit Server VM (build 25.121-
求问,Androidstudio 出现这种报错应该怎么办
Failed to resolve: com.android.databinding:baseLibrary:3.1.2 Failed to resolve: com.android.databind
A problem occurred configuring project ':app'. > Failed to notify project evaluation listener. >
出现以下错误的解决方法:* What went wrong:A problem occurred configuring project ':app'.&amp;gt; Failed to notify project evaluation listener.   &amp;gt; Could not initialize class com.android.sdklib.repository.<em>Android</em>Sd...
Android studio引入依赖的时候出现问题
我在<em>Android</em> studio引入依赖的时候出现了问题,我当前现在的SDK版本分别是23,22,19三个版本,例如:当我引入v7包的时候,应该能在choose library dependency中
Error:A problem occurred configuring project ':app'. &amp;gt; NDK not configured
问题:  Error:A problem occurred configuring project ':app'.  &amp;gt; NDK not configured. D:\<em>Android</em>\sdk\ndk-bundle  Download it with SDK manager.解决方法:1、Tools -&amp;gt; <em>Android</em> -&amp;gt; SDK Manager2、local.properti...
android studio打包的时候出现问题了,求大神解决啊
Error:Execution failed for task ':app:dexRelease'. > java.util.zip.ZipException: error in opening zi
Gradle报错:java.io.IOException: Unable to establish loopback connection
先说下问题原因: 总结起来就是jvm无法访问127.0.0.1 有可能出现的情况: 1.java被禁网了。。。。我就是这样浪费了三天时间 2.防火墙问题 3.ipv6的问题 …其他的反正跟网络有关的问题 错误信息大概如下Starting a Gradle Daemon, 1 incompatible and 1 stopped Daemons could not be reused, use
在安卓studio中运行项目总是报错,有人知道怎么解决吗?
-
React Natived打包报错java.io.IOException: Could not delete path '...\android\support\v7'解决
问题详情React Native打包apk时在第二次<em>编译</em>时候报错:java.io.IOException: Could not delete path 'D:\mycode\reactnative\SecondTest\android\app\build\generated\source\r \release\android\support\v7问题解决直观上看是没有删除某个文件,产生的IOExc...
guava-19.0.jar
Guava工程包含了若干被Google的 Java项目广泛依赖 的核心库,例如:集合 、缓存 、原生类型支持 、并发库 、通用注解 、字符串处理 、I/O 等等。 所有这些工具每天都在被Google的
解决:Please specify version of Web Project through configuration property of war plugin。
我出现报错的位置是在创建了一个maven war包的情况下,maven项目的pom.xml文件首行报错:Cannot detect Web Project version. Please specify version of Web Project through &amp;lt;version&amp;gt; configuration property of war plugin. E.g.: &amp;lt;plu...
AndroidStudio 报错
Starting a Gradle Daemon, 2 incompatible Daemons could not be reused, use --status for details FAILURE: Build failed with an exception. * What went wrong: Unable to start the daemon process. This pr...
提供 guava-19.0.jar 的jar包的下载链接云盘
guava-19.0.jar 的jar包下载云盘。如下: 链接:http://pan.baidu.com/s/1c2khCxa 密码:5o65 里面一个jar包,一个相当于是源码包,里面的数据更全点。都是19版本的。 github开源项目:https://github.com/google/guava/wiki/Release19 英文的api:http://google.github.io/guava/releases/19.0/api/docs/ 请叫我大师兄
gradle : Resolve dependencies ':classpath'
-
intellij idea 创建Android提示Could not download protobuf-java.jar或者gradle project sync failed.basic func
提示:Could not get resource 'https://jcenter.bintray.com/com/google/protobuf/protobuf-java/3.4.0/protobuf-java-3.4.0.jar' 方法: 1、手动打开网址https://jcenter.bintray.com/com/google/protobuf/protobuf-java/3.4....
AndroidStudio编译出现 Could not download auto-value.jar(...):No cached version available for offline mod
前天下午出现一个比较蛋疼的问题      可能是AS的问题 gradle的问题 AS下载不了jar包,于是我开始上网各种百度,刷机,重装。。。。 注意:根本就不是其他人所说的关闭离线模式,至少在我这里是行不通的!   解决方法 你可能需要一个翻墙工具 我用了ssr 打开srr,确保你的链接能用,登录下google看下能不能用。 能用的话 然后再设置中如下   ...
AS Gradle构建失败异常:Could not download gradle.jar (io.fabric.tools:gradle:1.25.4)
<em>Android</em> <em>Studio</em> 项目Gradle构建失败异常一:报错如下: Error:A problem occurred configuring project ':app'.&amp;gt; Could not resolve all dependencies for configuration ':app:classpath'.&amp;gt; Could not download gradle.ja...
记录使用gradle编译spring源码时发生的错误
D:\Program Files\spring-framework\spring-beans&amp;gt;gradle cleanidea eclipseStarting a Gradle Daemon, 4 incompatible and 1 stopped Daemons could not be reused, use --status for detailsFAILURE: Build fai...
Android Things:撸起袖子来创建第一个Things工程
在前面的章节,我们利用官方的sample-simplepio项目的blink模块,给大家演示了如何导入和运行现成的<em>Android</em> Things工程。那么这个章节,我们来手把手的给大家演示,如何从零开始创建、开发和运行一个<em>Android</em> Things项目。 1.前期准备 在你开始创建你的<em>Android</em> Things项目之前,你必须完成以下事情: 更新你的SDK工具为24或者更高版本,更新的SDK工具可以让你能构建和测试Things应用。 更新你的SDK为<em>Android</em> 7.0(API 24)或者更高,
* What went wrong: A problem occurred configuring project ':app'. > SDK location not found. Define l
  错误提示:    问题定位:        经过查看错误日志,发现是没有找到SDK的路径所导致的。   解决办法:       1、在react native 工程中的android根目录下创建一个local.properties 文件,并在其中加入如下代码,sdk.dir=你本地SDK的路径,我的是在D:\<em>Android</em>\android_sdk ,修改为你自己的即可 s...
Error:A problem occurred configuring project ':app'. > Could not resolve all
<em>编译</em>运行时报错: Error:A problem occurred configuring project ':app'. > Could not resolve all 打开peoject的gradle文件检查: allprojects { repositories { jcenter() } }是否在,不在的话添加上再次<em>编译</em>。
rn 启动项目失败:A problem occurred configuring project ':app'. (二)
再配置好sdk后,遇到此问题解决办法:从下载好的sdk中,找到sdkmanager,打开后下载需要的sdk组件
A problem occurred configuring project ':react-native-camera'. > The SDK Build Tools revision
 A problem occurred configuring project ':react-native-camera'.      &amp;gt; The SDK Build Tools revision (23.0.1) is too low for project ':react-native-camera'. Minimum required is 25.0.0在androidStoudio...
Error:A problem occurred configuring project ':app'. > failed to find target with hash string 'andro
在导入安卓项目时,报如题所示错误:Error:A problem occurred configuring project ':app'.&amp;gt; failed to find target with hash string 'android-22' in: C:\Program Files\<em>Android</em>\sdk大致意思读个七七八八:在 C:\Program Files\<em>Android</em>\sdk下...
更新AS2.3.1后更新慢及更新好后出现Gradle sync failed: Failed to find Build Tools revision 26.0.1的解决办法
问题 <em>Android</em> <em>Studio</em>2.3.1更新后,我的AS版本如下图,无论自动Sync Project with Gradle Files,还是手动加载gradle-3.3-all.zip文件,也不论你解压不解压,也无论你是放在如下文件夹,还是放在自定义的文件夹。 都会出现Gradle sync failed: Failed to find Build Tools r
解决Jenkins构建Android app无法找到SDK路径问题
默认Jenkins没有设置<em>Android</em> SDK环境的选项,所以构建App时会报错。 报错信息如下:01:52:21.861 [INFO] [org.gradle.api.Project] Parsing the SDK, no caching allowed 01:52:21.872 [ERROR] [org.gradle.BuildExceptionReporter] 01:52:21.87
Android Studio 编译常见问题解决办法
1.dexDebug ExecException finished with non-zero exit value 2 需要在gradle中配置下面的代码,原因是引用了多个libraries文件 defaultConfig { multiDexEnabled true } 2.Exe
Error:Could not download hamcrest-core.jar (org.hamcrest:hamcrest-core:1.3): No cached version avai
创建好项目后,编辑一部分代码<em>编译</em>时发生如上错误,通过查找百度和查找资料发现,是因为最新的创建项目会使用junit库来进行代码测试,在下载这个库的内容的时候发现他引用了hamcrest这个框架,不过国内下载这个框架的hamcrest-core.jar不成功(博主电脑没有翻墙)。  尝试方法1 In my experience, When I created a new project I encou...
Failed to find Build Tools revision 26.0.1
Error:A problem occurred configuring project ':app'. > Failed to find Build Tools revision 26.0.1 在build.gradle 中buildToolsVersion 如何修改。看本地安装了哪些版本的 进入文件夹<em>Android</em> SDK 目录下build-tools,修改为里面有
解决Android Studio中Gradle版本不对应无法调试app的问题
遇到的问题 Windows操作系统下,在导入一个<em>Android</em>工程到<em>Android</em> <em>Studio</em>中时,调试时Gradle拨错,错误提示如下: -------------------------------------------------------------------------------------------- FAILURE: Build failed with an exc
spring源码导入eclipse,A problem occurred configuring project ':spring-orm-hibernate4'.
今天下了下spring的源码,打算深入了解下spring的机制,在源码导入eclipse的过程中,遇到了一些问题,现把解决过程中查阅到的博客共享一下,方便遇到同样问题的同学做个参考: http://blog.csdn.net/gksrxn/article/details/14105245 这里讲的是源码导入的过程,IDE我使用的还是eclipse,在执行gradle命令的时候,会出现以下错误:
ReactNative android 之 (A problem occurred configuring project 'app'.异常)
ReactNative android 之 A problem occurred configuring project ‘:app’.异常异常信息如下:A problem occurred configuring project ':app'. > You have not accepted the license agreements of the following SDK component
程序员真是太太太太太有趣了!!!
网络上虽然已经有了很多关于程序员的话题,但大部分人对这个群体还是很陌生。我们在谈论程序员的时候,究竟该聊些什么呢?各位程序员大佬们,请让我听到你们的声音!不管你是前端开发...
思科3550技术文档-速度限制下载
思科3550技术文档之速度限制,基于3550-emi的qos 相关下载链接:[url=//download.csdn.net/download/jiangzhaoqhd/2032685?utm_source=bbsseo]//download.csdn.net/download/jiangzhaoqhd/2032685?utm_source=bbsseo[/url]
新视野大学英语答案下载
新视野大学英语课后答案大家一起分享... 相关下载链接:[url=//download.csdn.net/download/chenqingwen/435747?utm_source=bbsseo]//download.csdn.net/download/chenqingwen/435747?utm_source=bbsseo[/url]
双三次B样条曲面算法下载
应用c++ MFC实现双三次B样条曲面算法,配套清华大学出版社的《计算机图形学基础教程》。 相关下载链接:[url=//download.csdn.net/download/xingyuan22338/1778315?utm_source=bbsseo]//download.csdn.net/download/xingyuan22338/1778315?utm_source=bbsseo[/url]
相关热词 c#二进制字符转字节 c# rc4 c#中md5加密 c# 新建mvc项目 c# 引用mysql c#动态加载非托管dll c# 两个表数据同步 c# 返回浮点json c# imap 链接状态 c# 漂亮字
我们是很有底线的