求助~项目导入时报错:程序包org.junit不存在

Troyturk Troyturk 墨衍会员 · AI 创作全网分发 墨衍智能分发 通过墨衍一键同步至各平台 可同步平台 CSDN微信公众号微博知乎掘金百家号博客园抖音小红书 你的文章也可以这样分发 墨衍会员 ¥399起/年,写一次发全网 我也要 + 加入社区
网上下载下来的例子导入的时候报错:程序包org.junit不存在
可是我看到pom.xml已经有:

<dependency>
<groupId>junit</groupId>
<artifactId>junit</artifactId>
<version>4.12</version>
<scope>test</scope>
</dependency>

maven dependency里面也看到junit的jar包了

错误代码:

[ERROR] COMPILATION ERROR :
[INFO] -------------------------------------------------------------
[ERROR] /E:/download from the net/gomeTest/src/main/java/com/ruishenh/redis/example/JedisUtilTest.java:[3,17] 程序包org.junit不存在
[ERROR] /E:/download from the net/gomeTest/src/main/java/com/ruishenh/redis/example/JedisUtilTest.java:[4,17] 程序包org.junit不存在
[ERROR] /E:/download from the net/gomeTest/src/main/java/com/ruishenh/redis/example/JedisUtilTest.java:[19,10] 找不到符号
符号: 类 Before
位置: 类 com.ruishenh.redis.example.JedisUtilTest
[ERROR] /E:/download from the net/gomeTest/src/main/java/com/ruishenh/redis/example/JedisUtilTest.java:[28,10] 找不到符号
符号: 类 Test
位置: 类 com.ruishenh.redis.example.JedisUtilTest
[ERROR] /E:/download from the net/gomeTest/src/main/java/com/ruishenh/redis/example/JedisUtilTest.java:[36,10] 找不到符号
符号: 类 Test
位置: 类 com.ruishenh.redis.example.JedisUtilTest
[ERROR] /E:/download from the net/gomeTest/src/main/java/com/ruishenh/redis/example/JedisUtilTest.java:[67,10] 找不到符号
符号: 类 Test
位置: 类 com.ruishenh.redis.example.JedisUtilTest
[ERROR] /E:/download from the net/gomeTest/src/main/java/com/ruishenh/redis/example/JedisUtilTest.java:[98,10] 找不到符号
符号: 类 Test
位置: 类 com.ruishenh.redis.example.JedisUtilTest
[ERROR] /E:/download from the net/gomeTest/src/main/java/com/ruishenh/redis/example/JedisUtilTest.java:[115,10] 找不到符号
符号: 类 Test
位置: 类 com.ruishenh.redis.example.JedisUtilTest
[ERROR] /E:/download from the net/gomeTest/src/main/java/com/ruishenh/redis/example/JedisUtilTest.java:[131,10] 找不到符号
符号: 类 Test
位置: 类 com.ruishenh.redis.example.JedisUtilTest
[INFO] 9 errors
[INFO] -------------------------------------------------------------
[INFO] ------------------------------------------------------------------------
[INFO] BUILD FAILURE
[INFO] ------------------------------------------------------------------------
[INFO] Total time: 2.101 s
[INFO] Finished at: 2015-09-18T10:01:05+08:00
[INFO] Final Memory: 15M/196M
[INFO] ------------------------------------------------------------------------
[ERROR] Failed to execute goal org.apache.maven.plugins:maven-compiler-plugin:3.1:compile (default-compile) on project gomeTest: Compilation failure: Compilation failure:
[ERROR] /E:/download from the net/gomeTest/src/main/java/com/ruishenh/redis/example/JedisUtilTest.java:[3,17] 程序包org.junit不存在
[ERROR] /E:/download from the net/gomeTest/src/main/java/com/ruishenh/redis/example/JedisUtilTest.java:[4,17] 程序包org.junit不存在
[ERROR] /E:/download from the net/gomeTest/src/main/java/com/ruishenh/redis/example/JedisUtilTest.java:[19,10] 找不到符号
[ERROR] 符号: 类 Before
[ERROR] 位置: 类 com.ruishenh.redis.example.JedisUtilTest
[ERROR] /E:/download from the net/gomeTest/src/main/java/com/ruishenh/redis/example/JedisUtilTest.java:[28,10] 找不到符号
[ERROR] 符号: 类 Test
[ERROR] 位置: 类 com.ruishenh.redis.example.JedisUtilTest
[ERROR] /E:/download from the net/gomeTest/src/main/java/com/ruishenh/redis/example/JedisUtilTest.java:[36,10] 找不到符号
[ERROR] 符号: 类 Test
[ERROR] 位置: 类 com.ruishenh.redis.example.JedisUtilTest
[ERROR] /E:/download from the net/gomeTest/src/main/java/com/ruishenh/redis/example/JedisUtilTest.java:[67,10] 找不到符号
[ERROR] 符号: 类 Test
[ERROR] 位置: 类 com.ruishenh.redis.example.JedisUtilTest
[ERROR] /E:/download from the net/gomeTest/src/main/java/com/ruishenh/redis/example/JedisUtilTest.java:[98,10] 找不到符号
[ERROR] 符号: 类 Test
[ERROR] 位置: 类 com.ruishenh.redis.example.JedisUtilTest
[ERROR] /E:/download from the net/gomeTest/src/main/java/com/ruishenh/redis/example/JedisUtilTest.java:[115,10] 找不到符号
[ERROR] 符号: 类 Test
[ERROR] 位置: 类 com.ruishenh.redis.example.JedisUtilTest
[ERROR] /E:/download from the net/gomeTest/src/main/java/com/ruishenh/redis/example/JedisUtilTest.java:[131,10] 找不到符号
[ERROR] 符号: 类 Test
[ERROR] 位置: 类 com.ruishenh.redis.example.JedisUtilTest
[ERROR] -> [Help 1]
...全文

相关推荐

评论 7
收藏 已收藏
分享
返回顶部
Troyturk
Web 开发 81,108 成员 341,721 内容