android studio 运行程序时 报错:finished with non-zero exit value 1 [问题点数:50分,结帖人q197585312]

一键查看最优答案

确认一键查看最优答案?
本功能为VIP专享,开通VIP获取答案速率将提升10倍哦!
Bbs1
本版专家分:0
结帖率 83.33%
Bbs7
本版专家分:23344
版主
Blank
技术圈认证 博客专家完成年度认证,即可获得
Blank
微软MVP 2014年4月 荣获微软MVP称号
2013年4月 荣获微软MVP称号
2012年4月 荣获微软MVP称号
2011年4月 荣获微软MVP称号
2010年4月 荣获微软MVP称号
Blank
红花 2008年12月 移动平台大版内专家分月排行榜第一
Blank
蓝花 2009年3月 移动平台大版内专家分月排行榜第三
2009年1月 移动平台大版内专家分月排行榜第三
2008年11月 移动平台大版内专家分月排行榜第三
Bbs5
本版专家分:3947
版主
Blank
签到新秀 累计签到获取,不积跬步,无以至千里,继续坚持!
Blank
回归勋章 授予重新回归CSDN的真爱粉用户,我们不会让你失望哒!
Blank
GitHub 绑定GitHub第三方账户获取
Blank
红花 2015年7月 移动开发大版内专家分月排行榜第一
Bbs6
本版专家分:5074
Blank
红花 2015年9月 移动开发大版内专家分月排行榜第一
Bbs7
本版专家分:24438
Blank
GitHub 绑定GitHub第三方账户获取
Blank
红花 2018年12月 移动开发大版内专家分月排行榜第一
2018年11月 移动开发大版内专家分月排行榜第一
2018年10月 移动开发大版内专家分月排行榜第一
2018年3月 移动开发大版内专家分月排行榜第一
2018年1月 移动开发大版内专家分月排行榜第一
2017年12月 移动开发大版内专家分月排行榜第一
2017年11月 移动开发大版内专家分月排行榜第一
2017年10月 移动开发大版内专家分月排行榜第一
2017年9月 移动开发大版内专家分月排行榜第一
2015年11月 移动开发大版内专家分月排行榜第一
2015年10月 移动开发大版内专家分月排行榜第一
Blank
黄花 2019年7月 移动开发大版内专家分月排行榜第二
2018年4月 移动开发大版内专家分月排行榜第二
2016年4月 移动开发大版内专家分月排行榜第二
Blank
蓝花 2017年8月 移动开发大版内专家分月排行榜第三
2016年7月 移动开发大版内专家分月排行榜第三
2015年12月 移动开发大版内专家分月排行榜第三
Bbs1
本版专家分:0
Bbs1
本版专家分:0
Bbs1
本版专家分:0
Bbs7
本版专家分:24438
Blank
GitHub 绑定GitHub第三方账户获取
Blank
红花 2018年12月 移动开发大版内专家分月排行榜第一
2018年11月 移动开发大版内专家分月排行榜第一
2018年10月 移动开发大版内专家分月排行榜第一
2018年3月 移动开发大版内专家分月排行榜第一
2018年1月 移动开发大版内专家分月排行榜第一
2017年12月 移动开发大版内专家分月排行榜第一
2017年11月 移动开发大版内专家分月排行榜第一
2017年10月 移动开发大版内专家分月排行榜第一
2017年9月 移动开发大版内专家分月排行榜第一
2015年11月 移动开发大版内专家分月排行榜第一
2015年10月 移动开发大版内专家分月排行榜第一
Blank
黄花 2019年7月 移动开发大版内专家分月排行榜第二
2018年4月 移动开发大版内专家分月排行榜第二
2016年4月 移动开发大版内专家分月排行榜第二
Blank
蓝花 2017年8月 移动开发大版内专家分月排行榜第三
2016年7月 移动开发大版内专家分月排行榜第三
2015年12月 移动开发大版内专家分月排行榜第三
Bbs1
本版专家分:0
Bbs6
本版专家分:5074
Blank
红花 2015年9月 移动开发大版内专家分月排行榜第一
Bbs1
本版专家分:0
Bbs1
本版专家分:0
Bbs1
本版专家分:0
Bbs1
本版专家分:0
Bbs1
本版专家分:0
Bbs1
本版专家分:0
Bbs1
本版专家分:0
Bbs1
本版专家分:0
Bbs1
本版专家分:0
Bbs1
本版专家分:0
Bbs1
本版专家分:0
Bbs1
本版专家分:5
Bbs1
本版专家分:5
Bbs1
本版专家分:0
Bbs1
本版专家分:0
Bbs1
本版专家分:0
关于首次创建AIDL出现finished with non-zero exit value -1073741819错误的解决方案
完整错误提示: ERROR: Process 'command 'D:\AndroidSdk\build-tools\29.0.0\aidl.exe'' <em>finished</em> with <em>non-zero</em> <em>exit</em> <em>value</em> -<em>1</em>07374<em>1</em>8<em>1</em>9 这时我在build.gradle中的部分配置: compileSdkVersion 29 buildToolsVersion "29....
AIDL编译错误: 'aidl.exe'' finished with non-zero exit value 1
在学习AIDL时,实现服务端后,将服务端ADIL接口拷贝到客户端时编译出现错误:Process 'command 'D:\ProgramFiles\Android\Sdk\build-tools\27.0.3\aidl.exe'' <em>finished</em> with <em>non-zero</em> <em>exit</em> <em>value</em> <em>1</em>在网上查了一些资料后,没有找到能符合我自己情况的答案,不过基本可以肯定的是AIDL文件有错误,收集...
aidl.exe'' finished with non-zero exit value 1问题解决
PS:Android Studio用AIDL时,碰到一个非常棘手的问题,但是百度之,压根非法解决,翻墙出去,终于找到了一篇解决问题的文章,特地转载之。 之前使用aidl传递的都是基本的数据类型比如int 、boolean之类的还有就是String类型的参数,并没有传递自己定义的class。 最近在开发的过程中重构代码时遇到了这个问题,网上也有文章提供了解决的办法,不过不太全面。我
求助!!!编译通过,运行报错jdk.exe'' finished with non-zero exit value 1
<em>报错</em>:Error:Execution failed for task ':app:transformClassesWithMultidexlistForDebug'. > com.<em>android</em>.bu
Process 'command 'xxx.java.exe'' finished with non-zero exit value 2
编译过程中一直提示这个错误,尝试解决,也从网上看各种解决方案,最后发现是因为在 gradle 配置中在dependencies中依赖了一个lib库: compile project(':framework_door') 同时在libs文件夹下放了这个库的jar文件包导致同一个的两次引用错误,这个是不是错误提示中最后面的 <em>value</em> 2 中的2 就代表这个错误,还不得而知,仅是猜测。在我的项目中...
用cordova打包中cordova build android这步出现了问题,问题描述如下,如何解决?
Error: cmd: Command failed with <em>exit</em> code <em>1</em> Error output: java.lang.UnsupportedClassVersionError: com/<em>android</em>/dx/command/Main : Unsupported major.minor version 52.0 at java.lang.ClassLoader.defineClass<em>1</em>(Native Method) at java.lang.ClassLoader.defineClass(ClassLoader.java:800) at java.security.SecureClassLoader.defineClass(SecureClassLoader.java:<em>1</em>42) at java.net.URLClassLoader.defineClass(URLClassLoader.java:449) at java.net.URLClassLoader.access$<em>1</em>00(URLClassLoader.java:7<em>1</em>) at java.net.URLClassLoader$<em>1</em>.run(URLClassLoader.java:36<em>1</em>) at java.net.URLClassLoader$<em>1</em>.run(URLClassLoader.java:355) at java.security.AccessController.doPrivileged(Native Method) at java.net.URLClassLoader.findClass(URLClassLoader.java:354) at java.lang.ClassLoader.loadClass(ClassLoader.java:425) at sun.misc.Launcher$AppClassLoader.loadClass(Launcher.java:308) at java.lang.ClassLoader.loadClass(ClassLoader.java:358) at sun.launcher.LauncherHelper.checkAndLoadMain(LauncherHelper.java:482) Exception in thread "main" java.lang.UnsupportedClassVersionError: com/<em>android</em>/dx/command/Main : Unsupported major.minor version 52.0 at java.lang.ClassLoader.defineClass<em>1</em>(Native Method) at java.lang.ClassLoader.defineClass(ClassLoader.java:800) at java.security.SecureClassLoader.defineClass(SecureClassLoader.java:<em>1</em>42) at java.net.URLClassLoader.defineClass(URLClassLoader.java:449) at java.net.URLClassLoader.access$<em>1</em>00(URLClassLoader.java:7<em>1</em>) at java.net.URLClassLoader$<em>1</em>.run(URLClassLoader.java:36<em>1</em>) at java.net.URLClassLoader$<em>1</em>.run(URLClassLoader.java:355) at java.security.AccessController.doPrivileged(Native Method) at java.net.URLClassLoader.findClass(URLClassLoader.java:354) at java.lang.ClassLoader.loadClass(ClassLoader.java:425) at sun.misc.Launcher$AppClassLoader.loadClass(Launcher.java:308) at java.lang.ClassLoader.loadClass(ClassLoader.java:358) at sun.launcher.LauncherHelper.checkAndLoadMain(LauncherHelper.java:482) Exception in thread "main" FAILURE: Build failed with an exception. * What went wrong: Execution failed for task ':transformClassesWithDexForDebug'. > com.<em>android</em>.build.api.transform.TransformException: java.lang.RuntimeException: com.<em>android</em>.ide.common.process.ProcessException: java.util.concurrent.ExecutionException: com.<em>android</em>.ide.common.process.ProcessException: org.gradle.process.internal.ExecException: Process 'command 'C:\Program Files\Java\jdk<em>1</em>.7.0_80\bin\java.exe'' <em>finished</em> with <em>non-zero</em> <em>exit</em> <em>value</em> <em>1</em> * Try: Run with --stacktrace option to get the stack trace. Run with --info or --debug option to get more log output. 我的JDK版本是<em>1</em>.7.0_80 <em>android</em>-23
Android Studio各种坑爹之:finished with non-zero exit value 1和Return code 1 for dex process.
<em>android</em> { compileSdkVersion 25 buildToolsVersion "25.0.0" //添加如下代码即可解决 dexOptions { javaMaxHeapSize "4g" }}
Andriod Studio 编译报错 finished with non-zero exit value 1
Execution failed for task ':app:preDexDebug'.&amp;gt; com.<em>android</em>.ide.common.process.ProcessException: org.gradle.process.internal.ExecException: Process 'command 'C:\Program Files (x86)\Java\jdk<em>1</em>.7.0_4...
NDK报错:Process 'command 'D:\SDK\ndk-bundle/ndk-build.cmd'' finished with non-zero exit value 2
由于换了笔记本,在新笔记本中编译NDK时,报了如下错误: Process 'command 'D:\SDK\ndk-bundle/ndk-build.cmd'' <em>finished</em> with <em>non-zero</em> <em>exit</em> <em>value</em> 2 笔记本电脑是新下的<em>1</em>7版NDK,在网上查阅资料,并验证,换成ndk_r<em>1</em>0e就不会报这个错误了。 下载地址: ndk_r<em>1</em>0e(Jan 20<em>1</em>5) Wind...
Android Studio在编译或者运行报错 finished with non-zero exit value 1
在Android Studio <em>运行</em>或者编译的时候出现如图的<em>报错</em>,然后看代码也没有什么大问题,百度上也是众说纷纭,有说是依赖冲突的,有说是版本不一致的,有说资源文件<em>报错</em>的,我尝试了多种方法最后发现还是资源文件出现的问题,下面分享一波我的解决办法。 <em>1</em>.控制台<em>报错</em>是 <em>finished</em> with <em>non-zero</em> <em>exit</em> <em>value</em> <em>1</em> (翻译一下就是:以非零退出值<em>1</em>结束)于是就很懵。 ...
emulator: Process finished with exit code 1
机型lenovo 小新锐7000  windows<em>1</em>0 安装Android Studio过程中遇到了好多的问题,总算装好啦,把问题动总结了一下;安装的过程中一定要充满耐心的重启与安装(沧桑脸...) <em>1</em>.启动模拟器失败时的<em>报错</em>信息  emulator: Process <em>finished</em> with <em>exit</em> code <em>1</em>;  emulator: ERROR: x86 emulation c...
Android\Sdk\build-tools\28.0.2\aidl.exe'' finished with non-zero exit value 1(或者27.0.3等)关于AIDL初学的坑
本文是参照《Android开发艺术探索》 一、.建实体类Book <em>1</em>.新建一个文件夹aidl(名字自己决定其他也行),注意:实体类的包名和aidl文件包名一定要相同,直接新建aidl文件Android Studio会生成一个包名和主目录相同的文件,直接看图 2.比如我要新建一个名为IBookManager的aidl文件,直接新建的会生成没有绿色部分(后来可以自己修改)的样子,我是直接新建...
finished with non-zero exit value 2
刚新建安卓项目就出现以下的问题是怎么回事?? ubuntu系统,已换sun jdk, Error:Process 'command '/usr/local/<em>android</em>-<em>studio</em>/jre/bin/java'' <em>finished</em> with <em>non-zero</em> <em>exit</em> <em>value</em> 2 问题二:JDK/bin与<em>android</em>-<em>studio</em>/jre/bin里面的内容是相同的,有什么作用?
AndroidStudio3.1构建工程出错Failed to execute aapt
我是刚从Studio2.2升级到3.<em>1</em>,就出现这样的问题。如果不写 `<em>android</em>.enableAapt2=false` 就会出现build failed,但是写了的话还是无法生成apk。grad
finished with non-zero exit value 2头疼
Error:Execution failed for task ':app:dexDebug'. > com.<em>android</em>.ide.common.process.ProcessException: org.gradle.process.internal.ExecException: Process 'command 'D:\Java\jdk<em>1</em>.7.0_80\bin\java.exe'' <em>finished</em> with <em>non-zero</em> <em>exit</em> <em>value</em> 2 在网上查了,好多人说是jar包重复,但是在logcat里也不打印是哪个jar包的信息重复。。。头疼。。。 项目里v4包和v7包: compile 'com.<em>android</em>.support:support-v4:23.0.0' compile 'com.<em>android</em>.support:appcompat-v7:23.0.0' 有两个问题, <em>1</em>.这里有个v7包,但是我依赖的项目里也有个v7包,两个版本不一样,但是我删除了本项目里的v7和统一了两个v7,都不行, 2.这个项目依赖了两个库工程,例如C项目依赖了A和B,但是同时A又依赖了B项目。然后在C项目里再写依赖关系的时候需不需要把A和B都依赖进来?
完美解决Android编译时出现aapt.exe finished with non-zero exit value 1 吐血整理
问题描述 楼主几周前搞的一个项目,源代码:https://github.com/nikolajohn/NFC-Based-Multiplexed-Sensor 最近由于课题组需要,重新拿起这个项目使用 但是在打开时却出现了很神奇的<em>报错</em>: <em>报错</em>信息很简洁,当然<em>报错</em>信息的简洁也意味着你拿到的信息很少 Process 'command 'C:\Users\Administrator\Ap...
finished with non-zero exit value 1,冲突
<em>android</em> <em>studio</em> 添加这两个依赖的时候: compile 'com.zhouyou:rxeasyhttp:2.<em>1</em>.5' compile 'com.zhouyou:easyrecyclerview:<em>1</em>.0.6' 总是报下面的错误,各种度娘都解决不了,但是只是引用其中一个的话就没有问题,纠结了一上午。 Error:org.gradle.process.internal.ExecEx...
java.exe finished with non-zero exit value 1 问题引申
今天导入layoutlib.jar,在eclipse上没有啥问题,但是在<em>android</em> <em>studio</em> 上就是如下的问题: Error:Execution failed for task ':dexAppDebug'.> com.<em>android</em>.ide.common.process.ProcessException: org.gradle.process.internal.ExecE
aapt.exe'' finished with non-zero exit value -1073741819
这个错误<em>exit</em> <em>value</em>不是<em>1</em>,编译apk时<em>报错</em>;似乎是2<em>1</em>.0.0的错误,2<em>1</em>.0.2修正了这个错误,把SDK Build-tools升级到2<em>1</em>.0.2,这个问题就没有了;
Android Studio 运行时出现 finished with non-zero exit value 2 错误分析
错误日志: com.<em>android</em>.ide.common.process.ProcessException: org.gradle.process.internal.ExecException: Process 'command '/Library/Java/JavaVirtualMachines/jdk<em>1</em>.7.0_7<em>1</em>.jdk/Contents/Home/bin/java'' <em>finished</em>
导入 Glide工程 报错如下
Gradle 'glide-master' project refresh failed Error:Process 'command 'git'' <em>finished</em> with <em>non-zero</em> <em>exit</em> <em>value</em> <em>1</em>28
Android Aapt异常总结和处理
Aapt异常总结和处理一:升级Android <em>studio</em> 到3.0的问题    升级到Android <em>studio</em>3.0之后爆出Aapt2Exception异常,显示如下所示:这样的话我们只需要在gradle.properties对象的文件下进行配置代码:<em>android</em>.enableAapt2=false如下图所示:在这个文件进行配置,然后配置界面如下所示:这就是配置的代码展示。哈哈,是不是很神...
【解决】exited with a non-zero exit code 1
安装好集群后<em>运行</em>hadoop-mapreduce-examples.jar <em>报错</em>,比对cdh配置后,发现少了yarn.application.classpath,conf目录一定要配置,否则也会出现以上错误。 yarn-site.xml添加 &lt;property&gt; &lt;name&gt;yarn.application.classpath&lt;/n...
安卓反编译工具aapt的使用
我想在我的app里面调用第三方app,所以我要获得第三方应用的包名和入口Activity类名,于是接触了appt.exe的使用: 命令行进入appt.exe的文件路径 aapt.exe是在放在SDK路径下面的build-tools的: 2.进入到这之后执行反编译命令: ????了, 找到了包名和启动类名 ...
Process 'command 'E:\AndroidSDK\ndk-bundle/ndk-build.cmd'' finished with non-zero exit value 2问题的解决
主要是ndk的版本不一致导致,可以使用和源码提供者一样的ndk版本号。 参考博客: https://blog.csdn.net/Alex_yuan666/article/details/8379<em>1</em>670
finished with non-zero exit value 3,gradle编译异常小结
转载自:http://www.jacpy.com/20<em>1</em>6/04/22/<em>android</em>-<em>studio</em>-error-collection.html 在使用<em>android</em> <em>studio</em>过程中,使用gradle编译的时候总会出现一些问题,下面是几个常见问题的解决方法。 被编译的代码或资源有问题( <em>finished</em> with <em>non-zero</em> <em>exit</em> <em>value</em> <em>1</em>):出现这种编译异常表现是 <em>exit</em>
安卓ADB和aapt工具
安卓ADB和aapt工具安卓ADB和aapt工具安卓ADB和aapt工具安卓ADB和aapt工具
安卓aapt.exe
用于安卓项目sdk=》platform-tools中缺失的aapt.exe文件。解决安卓项目中R文件<em>报错</em>的问题,不一定能解决R<em>报错</em>的情况,但是一种希望。
Android Error:AAPT: error: resource android:attr/colorError not found
Android resource linking failed G:\work\viewPager\app\build\intermediates\incremental\mergeDebugResources\merged.dir\<em>value</em>s\<em>value</em>s.xml:622: error: resource color/colorPrimary (aka com.example.viewpage...
finished with non-zero exit value 1"错误的解决方案">Android Studio编译AIDL文件时报"finished with non-zero exit value 1"错误的解决方案
一、 错误日志 修改AIDL中的方法入参后出现以下编译错误: Process 'command '/home/zengyu/Android/Sdk/build-tools/26.0.3/aidl'' <em>finished</em> with <em>non-zero</em> <em>exit</em> <em>value</em> <em>1</em> 二、 问题原因 AIDL不支持方法重载,编译时以方法名为标识在对应java文件中生成方法,所以修改AIDL中的方法入...
Gradle task
本文来自网易云社区作者:孙有军 <em>1</em>:gradle脚本是使用groovy语言写的(DSL),groovy中有一个重要的概念闭包(Closure),Closure是一段单独的代码块,它可以接收参数,返回值,也可以被赋值给变量。eg://无参数def Closure<em>1</em> = { println 'Hello world' } Closure<em>1</em>()// 执行闭包,输出Hello world//一个参数de...
android studio项目运行失败 finished with non-zero exit value 1 的解决办法
<em>android</em> <em>studio</em>项目<em>运行</em>失败 <em>finished</em> with <em>non-zero</em> <em>exit</em> <em>value</em> <em>1</em> 的解决办法
Process finished with exit code -1
tf_embedding = tf.Variable(tf.to_float(self.embeddings), trainable=True, name="W"),embeddings是词向量。代码
Process 'command '\***\build-tools\27.0.3\aidl.exe'' finished with non-zero exit value 1
在Android Studio中使用AIDL时,需要现在main下创建aidl包,然后将.aidl文件拷贝到该包下,目录如下: 然后在java包中写好对应的代码以后,编译发现<em>报错</em>,<em>报错</em>信息如下: Process 'command '\***\build-tools\27.0.3\aidl.exe'' <em>finished</em> with <em>non-zero</em> <em>exit</em> <em>value</em> <em>1</em> 点击左边会在右边...
cordova Process finished with exit code -1
http://www.<em>android</em>devtools.cn/#gradle cordova Process <em>finished</em> with <em>exit</em> code -<em>1</em>   安装完cordova之后,创建一个测试项目后,<em>运行</em>报Process <em>finished</em> with <em>exit</em> code -<em>1</em>,经过查找原因,是因为gradle没有安装,在http://www.<em>android</em>devtoo
Android Studio 模拟器打不开解决方法
The emulator process for AVD Nexus_5_API_24 was killed. emulator: ERROR: x86_64 emulation currently requires hardware acceleration! Android Studio Emulator: Process <em>finished</em> with <em>exit</em> code <em>1</em> 这...
Android Studio 模拟器第一次启动不了
本人做服务器端的,以前有接触过Android,但是以前是使用eclipse做的开发,后面3年没有碰过Android了,现在用的都是Android Studio工具,今天下载了个来玩玩,安装好后,把SDK路径给改到别的盘上了,并且从原来的C盘中的sdk文件复制到修改后的目录下,其他都正常,反正一直没启动过,后来想用自带的模拟器调试的时候启动才发现模拟器启动不了,请问大神们有什么解决方案吗? 日志打印如下: Emulator: emulator: ERROR: x86_64 emulation currently requires hardware acceleration! Emulator: Process <em>finished</em> with <em>exit</em> code <em>1</em> 网上搜了,各说纷纭,最后没有解决
Android Studio报错:Process command aapt finished with non-zero exit value 1
错误信息 Process ‘command ‘***Android/sdk/build-tools/23.0.<em>1</em>/aapt” <em>finished</em> with <em>non-zero</em> <em>exit</em> <em>value</em> <em>1</em> Gradle依赖的版本与External Libraries 里面的版本不一致,导致项目出现问题。 解决方案 Gradle强制依赖解析策略,指定某版本必须依赖。 c...
使用studio的编译项目的时候,报:\aapt.exe'' finished with non-zero exit value 1
弄了快一周了,还没有找到解决方案,万能的csdn。 这是报的错误: Information:Gradle tasks :easeUI:preBuild UP-TO-DATE :easeUI:preRe
彻底解决Process 'command '\ndk-bundle\ndk-build.cmd'' finished with non-zero exit value 2
问题描述: Process 'command 'B:\ProgramFiles\Android\sdk\ndk-bundle\ndk-build.cmd'' <em>finished</em> with <em>non-zero</em> <em>exit</em> <em>value</em> 2 在网上搜索该问题,都说是ndk版本的问题,新的版本会出现该问题,下载老的版本解压缩后放到ndk-bundle目录下就好了,我下载了一个<em>1</em>0的版本放到ndk-bundl...
Android 创建 AIDL 编译报错 finished with non-zero exit value 1 的几种解决方式
出现这种错误有三种可能性: <em>1</em>、包错误 2、自定义类型未使用 in,out 参数 3、创建了同名不同参数的方法 基本上都是这三种问题引发的上述编译异常,耐心细致排查,基本可以解决问题。   正确的文件放置位置如下: Java 文件放在 下面的 aidl 包中,aidl 文件放在上面的 aidl   package com.shanks.multiprocessdemo.aid...
android studio finished with non-zero exit value 1value 2解决办法
解决<em>android</em><em>studio</em>中出现<em>finished</em> with <em>non-zero</em> <em>exit</em> <em>value</em> <em>1</em>,或者<em>finished</em> with <em>non-zero</em> <em>exit</em> <em>value</em> 2的问题
finished with non-zero exit value 1"的原因和解决方法">出现"xxxx finished with non-zero exit value 1"的原因和解决方法
原因: <em>1</em>、依赖重复了 2、v4、v7包与compileVersion版本不一致 3、缺少资源文件 解决: 修改v4包、v7包到与compileVersion一致; 终端执行: gradlew processDebugResources --debug 查看输出的log信息 ...
androidStudio出现Executing tasks: [:app:assembleDebug]等错误不能运行程序
<em>android</em>Studio出现Executing tasks: [:app:assembleDebug]等错误不能<em>运行</em>程序
报错ndk-build.cmdfinished with non-zero exit value 2
请问大神,Error:Execution failed for task ':libuvccamera:ndkBuild'. > Process 'command 'D:\work\ndk\<em>android</em>-ndk-r<em>1</em>3b/ndk-build.cmd'' <em>finished</em> with <em>non-zero</em> <em>exit</em> <em>value</em> 2这个如何解决,谢谢
Process 'command 'D:\SDK\ndk-bundle/ndk-build.cmd'' finished with non-zero exit value 2
从AndroidStudio直接的ndk版本过高,换成ndk_r<em>1</em>0e就不会报这个错误了,这个亲测可以解决这个问题。 网上也有说降级到<em>1</em>4,<em>1</em>5也能解决,还待测试。 下载地址: ndk_r<em>1</em>0e(Jan 20<em>1</em>5) Windows32-bit : http://dl.google.com/<em>android</em>/ndk/<em>android</em>-ndk-r<em>1</em>0e-windows-x86.exe Windo...
finished with non-zero exit value 1">Android Studio Process 'command "...\aapt.exe'' finished with non-zero exit value 1
错误:Process 'command &quot;...\build-tools\27.0.3\aapt.exe'' <em>finished</em> with <em>non-zero</em> <em>exit</em> <em>value</em> <em>1</em> org.gradle.initialization.ReportedException: org.gradle.internal.exceptions.LocationAwareException: Executi...
Android编译时出现aapt.exe finished with non-zero exit value 1错误的解
自定义控件完成之后,<em>运行</em>的时候出现下图中的错误,试过网上的各种解决方法,还是没有把问题解决,通过一上午的时间终于找到解决方法,把解决方法 和 找到引起错误的原因,做一个记录,方便以后学习。  点击Run  tasks 可以查看详细的信息,如下: org.gradle.api.tasks.TaskExecutionException: Execution failed for task ':...
学习android jni 总提示ndk-build.cmd' finished with non-zero exit value 2
最近学习<em>android</em> jni的时候总是提示Process 'command 'E:\<em>android</em>\<em>android</em>-ndk-r<em>1</em>0b\ndk-build.cmd'' <em>finished</em> with n
编译器报错finished with non-zero exit value 1”及floatingActionButton没有实例化的解决
时隔很久没写博客的我又回来了。这两天敲代码过程中遇到了2个问题,上网查了查,回答的都很多,但很乱,反正我看了半天,对着自己的代码也改了改,有个还是没解决。 好在最后,突然灵光一现,哈哈,想到了。所以今天就想就这2个问题,写下我的做法和网上其他的一些答案供大家参考参考,多试试,说不定你的问题的解决方法就在这里哦。 问题<em>1</em>:编译器报如下错: Process 'command 'C:\Progr
Process 'command 'D:\android-ndk-r10\ndk-build.cmd'' finished with non-zero exit value 2
<em>android</em> <em>studio</em> 根据Gradle配置自动生成Android.mk 位于app\build\intermediates\ndk\debug下。 如果只有c/cpp文件,直接这样编译的话,会<em>报错</em>,这应该是<em>android</em> <em>studio</em> 在这种情况自动生成Android.mk 时的一个bug,见编译错误。 Error:Execution failed for task ':nativea
Process 'command 'E:\Android\ide\jdk-8u131\bin\java.exe'' finished with non-zero exit value 1
AndroidStudio3.0 打包<em>报错</em>: Process 'command 'E:\Android\ide\jdk-8u<em>1</em>3<em>1</em>\bin\java.exe'' <em>finished</em> with <em>non-zero</em> <em>exit</em> <em>value</em> <em>1</em> 网上寻找了许多种版本的解决方法,还是没能解决问题。 依据题面意思,问题出现在JDK上,当前环境使用的JDK<em>1</em>.8版本 试着将JDK<em>1</em>.8版本替换为AS自带...
finished with non-zero exit value *问题解决
解决方法一: 检查依赖的jar包和lib,查看跟项目是否有冲突包, 如果是<em>android</em>包下的**.exe <em>finished</em> with <em>non-zero</em> <em>exit</em> <em>value</em> <em>1</em> 基本都是这个问题。解决方法二: 查看sdk版本和build版本是否统一 解决方法三: 如果出现java.exe <em>finished</em> with n
process finished with exit code -1?
第一次使用JBUILDER 出现: -- IOException starting Java runtime process -- java.io.IOException: CreateProcess
关于finished with non-zero exit value 1、2、3的bug解决总结
在最近的一个项目中碰到好几次<em>finished</em> with <em>non-zero</em> <em>exit</em> <em>value</em> <em>1</em>、<em>finished</em> with <em>non-zero</em> <em>exit</em> <em>value</em> 2、<em>finished</em> with <em>non-zero</em> <em>exit</em> <em>value</em> 3这种莫名其妙的bug导致程序编译不过去。现在闲下来了总结一下解决办法: <em>finished</em> with <em>non-zero</em> <em>exit</em> <em>value</em> 2:出现这种bu
Information:Gradle tasks [:app:assembleDebug] :app:preBuild UP-TO-DATE :app:preDebugBuild UP-TO-DATE
今天搞了一个项目,编译时就<em>报错</em>,再网上百度了好久都没找到原因,最后看到一些英文评论里面说有可能是buildToolsVersion的问题                            然后查了一下sdk里面的buildToolsVersion,把上面那个buildToolsVersion  '24'   改成了'23.0.<em>1</em>' 然后再编译就通过了,有这种问题的朋友可以
Android studio build时候报错
FAILURE: Build failed with an exception. * What went wrong: A problem occurred configuring root project 'MyApplication'. > Could not resolve all dependencies for configuration ':classpath'. > Could not resolve com.<em>android</em>.tools.build:gradle:<em>1</em>.5.0. Required by: :MyApplication:unspecified > Could not resolve com.<em>android</em>.tools.build:gradle:<em>1</em>.5.0. > Could not get resource 'https://jcenter.bintray.com/com/<em>android</em>/tools/build/gradle/<em>1</em>.5.0/gradle-<em>1</em>.5.0.pom'. > Could not GET 'https://jcenter.bintray.com/com/<em>android</em>/tools/build/gradle/<em>1</em>.5.0/gradle-<em>1</em>.5.0.pom'. > Connection to https://jcenter.bintray.com refused * Try: Run with --stacktrace option to get the stack trace. Run with --info or --debug option to get more log output. BUILD FAILED Total time: 45.925 secs Process <em>finished</em> with <em>exit</em> code <em>1</em> 本地是有gradle的,但是好像build的时候还需要去下载似的 这个是<em>运行</em>出来的gradlew compileDebug --stacktrace 出来的Log信息,求指教 D:\work\Android<em>studio</em>\project\MyApplication>gradlew compileDebug --stacktrace Downloading https://services.gradle.org/distributions/gradle-2.8-all.zip Exception in thread "main" java.net.UnknownHostException: services.gradle.org at java.net.AbstractPlainSocketImpl.connect(AbstractPlainSocketImpl.java:<em>1</em>84) at java.net.PlainSocketImpl.connect(PlainSocketImpl.java:<em>1</em>72) at java.net.SocksSocketImpl.connect(SocksSocketImpl.java:392) at java.net.Socket.connect(Socket.java:589) at sun.security.ssl.SSLSocketImpl.connect(SSLSocketImpl.java:649) at sun.security.ssl.BaseSSLSocketImpl.connect(BaseSSLSocketImpl.java:<em>1</em>73) at sun.net.NetworkClient.doConnect(NetworkClient.java:<em>1</em>80) at sun.net.www.http.HttpClient.openServer(HttpClient.java:432) at sun.net.www.http.HttpClient.openServer(HttpClient.java:527) at sun.net.www.protocol.https.HttpsClient.(HttpsClient.java:275) at sun.net.www.protocol.https.HttpsClient.New(HttpsClient.java:37<em>1</em>) at sun.net.www.protocol.https.AbstractDelegateHttpsURLConnection.getNewHttpClient(AbstractDelegateHttpsURLConnection.java:<em>1</em>9<em>1</em>) at sun.net.www.protocol.http.HttpURLConnection.plainConnect0(HttpURLConnection.java:<em>1</em><em>1</em>03) at sun.net.www.protocol.http.HttpURLConnection.plainConnect(HttpURLConnection.java:997) at sun.net.www.protocol.https.AbstractDelegateHttpsURLConnection.connect(AbstractDelegateHttpsURLConnection.java:<em>1</em>77) at sun.net.www.protocol.http.HttpURLConnection.getInputStream0(HttpURLConnection.java:<em>1</em>5<em>1</em><em>1</em>) at sun.net.www.protocol.http.HttpURLConnection.getInputStream(HttpURLConnection.java:<em>1</em>439) at sun.net.www.protocol.https.HttpsURLConnectionImpl.getInputStream(HttpsURLConnectionImpl.java:254) at org.gradle.wrapper.Download.downloadInternal(Download.java:58) at org.gradle.wrapper.Download.download(Download.java:44) at org.gradle.wrapper.Install$<em>1</em>.call(Install.java:6<em>1</em>) at org.gradle.wrapper.Install$<em>1</em>.call(Install.java:48) at org.gradle.wrapper.ExclusiveFileAccessManager.access(ExclusiveFileAccessManager.java:65) at org.gradle.wrapper.Install.createDist(Install.java:48) at org.gradle.wrapper.WrapperExecutor.execute(WrapperExecutor.java:<em>1</em>28) at org.gradle.wrapper.GradleWrapperMain.main(GradleWrapperMain.java:6<em>1</em>)
Process 'command 'D:\IDE\SDK\build-tools\28.0.3\aapt.exe'' finished with non-zero exit value 1问题分析解决
当在Android Studio的XML布局文件写错属性或单词拼错时,会出现如下所列的错误,而AS编辑器又没任何提示: 再次点击下方的“Run build”,也只能得到:app:processDebugResources任务执行失败的信息,但并没有什么软用。 从错误信息中我们无法得到是哪个文件出错,当我们修改的xml文件较多时,我们连哪个文件出错都不知道,那么我们改如何找到具体原因呢,...
Process 'command 'D:\Android\sdk\build-tools\25.0.0\aapt.exe'' finished with non-zero exit value 1
一个很蛋疼的错。 出现这个问题的原因本人遇到两种; 第一种:v7或者v4包重复,查看自己项目依赖的第三方库是否重复依赖的v7或者v4包; 第二种:自己的资源文件中命名不规范或者引用资源的时候有误导致R文件找不到,如图: ...
使用AIDL遇到的错误Process command ..aidl.exe finished with non-zero exit value 1
AIDL传对象 创建bean,实现Parcelable(app/main/aidl相同目录下创建同名aidl文件) 例如: package com.zyh.aidl; parcelable Person; //interface Person { // //} Process 'command 'D:\Studio\SDK\build-tools\27.0.3\aidl.exe'' finis...
AndroidStudio之Process 'command '\build-tools\28.0.2\aapt.exe'' finished with non-zero exit value 1
要定位出错的图片资源,首先要看这篇博客: https://blog.csdn.net/qq_37492806/article/details/837<em>1</em>6454
Information:Gradle tasks [:app:assembleDebug] Error:Execution failed for task ':app:transformClasses
问题:Information:Gradle tasks [:app:assembleDebug] Error:Execution failed for task ':app:transformClassesWithDexForDebug'. > com.<em>android</em>.build.api.transform.TransformException: com.<em>android</em>.ide.common.pro
Process 'command 'C:\***\build-tools\28.0.2\aidl.exe'' finished with non-zero exit value 1
Process 'command 'C:\All_install_directory\AndroidStudioSDK\build-tools\28.0.2\aidl.exe'' <em>finished</em> with <em>non-zero</em> <em>exit</em> <em>value</em> <em>1</em> 最近在编译AIDL文件的时候一直<em>报错</em>。我使用的是数据类型是实现 **Parcelable**接口的对象。百度了一圈发现解决办法是说什么AIDL文件的...
Process 'command 'F:\sdk\build-tools\26.0.2\aapt.exe'' finished with non-zero exit value 1
AndroidStudio升级到3.0新建一个项目,导入github上面的一个项目<em>报错</em>。 AndroidStudio升级到3.0新建一个项目,导入github上面的一个项目<em>报错</em>。导入的项目是 compile 'com.youth.xframe:xframe:<em>1</em>.<em>1</em>.2' 结果就<em>报错</em>了,具体错误如下 C:\Users\cb\.gradle\caches\transforms-<em>1</em>\fi...
androidStudio出现Executing tasks: app:assembleDebug
打正式包时有时会出现Executing tasks: [:app:assembleDebug 错误。因为你gradle文件配置有问题。 例如我上次在module的gradle中添加了单元测试的配置信息,原则上正式版不应该包含测试信息testApplicationId“com.cn.skypiea.test" testInstrumentationRunner "<em>android</em>.test.Inst
彻底解决aapt2异常
    升级<em>android</em> <em>studio</em> 3.0后,在创建新项目时会报一个异常,Error:com.<em>android</em>.tools.aapt2.Aapt2Exception: AAPT2 error: check logs for details 。具体如下图所示:    就上网查找解决办法,因为自己是AS3.0版本一出就更新了,还没有人贴出解决方案。就这样,我卡住了,烂摊子一放就是一个多月。    ...
Process 'command 'D:\AndroidNDK\android-ndk-r16b/ndk-build.cmd'' finished with non-zero exit value 2
 Process 'command 'D:\AndroidNDK\<em>android</em>-ndk-r<em>1</em>6b/ndk-build.cmd'' <em>finished</em> with <em>non-zero</em> <em>exit</em> <em>value</em> 2  Process 'command 'D:\AndroidNDK\<em>android</em>-ndk-r<em>1</em>6b/ndk-build.cmd'' <em>finished</em> with <em>non-zero</em> <em>exit</em> valu...
Process 'command '/***/Android/sdk/build-tools/27.0.3/aidl'' finished with non-zero exit value 1
在添加ALDL文件后进行编译的时候会报上面的错误如下图:如图上的右边的提示,点击左边会在右边提示如下错误信息:org.gradle.api.tasks.TaskExecutionException: Execution failed for task ':app:compileDebugAidl'. at org.gradle.api.internal.tasks.execution.Execu...
关于Flutter应用程序的AndroidX兼容性
问题阐述 Android代码通常使用 <em>android</em>.support 库来确保向后兼容性。这些<em>android</em>.support 库已弃用,并替换为 AndroidX。AndroidX具有与旧库相同的功能和一些附加功能,但不幸的是,这两组库是不兼容的。 尝试构建依赖于两组库的APK时,Gradle崩溃。类似如下错误: FAILURE: Build failed with an exception. ...
安卓编译出错: Process 'command 'C:\Java\jdk1.8.0_51\bin\java.exe'' finished with non-zero exit value 1 解决!
刚从eclipse转到Android <em>studio</em>,安装完成之后搭建了系统默认的hello world代码工程,却出现了以下错误: Process 'command 'C:\Java\jdk<em>1</em>.8.0_5<em>1</em>\bin\java.exe'' <em>finished</em> with <em>non-zero</em> <em>exit</em> <em>value</em> <em>1</em> 这尼玛,开始百度!基本无解啊,最后基本翻遍了,在github上看到了几个答案:
aapt.exe'' finished with non-zero exit value 1 ,报错解决总结
Error:Execution failed for task ':examination:processReleaseResources'. > com.<em>android</em>.ide.common.process.ProcessException: org.gradle.process.internal.ExecException: Process 'command 'D:\Program Files\Android\sdk\build-tools\23.0.2\aapt.exe'' <em>finished</em> with
相见恨晚的超实用网站
相见恨晚的超实用网站 持续更新中。。。
Windows2008server完美破解工具下载
Windows2008server完美破解工具,测试绝对可用 相关下载链接:[url=//download.csdn.net/download/leonzhlm/1890562?utm_source=bbsseo]//download.csdn.net/download/leonzhlm/1890562?utm_source=bbsseo[/url]
TL-WR740N V5V6V7_130704下载
TL-WR740N V5V6V7_130704升级固件,支持802.1x协议。 相关下载链接:[url=//download.csdn.net/download/a275761919/8605405?utm_source=bbsseo]//download.csdn.net/download/a275761919/8605405?utm_source=bbsseo[/url]
otpwin6420.2+rabbitmqserver3.7.3下载
otp_win64_20.2.exe+rabbitmq-server-3.7.3.exe rebbitmq 必备软件 相关下载链接:[url=//download.csdn.net/download/asd1024302/10263807?utm_source=bbsseo]//download.csdn.net/download/asd1024302/10263807?utm_source=bbsseo[/url]
相关热词 c#中dns类 c#合并的excel c# implicit c#怎么保留3个小数点 c# 串口通信、 网络调试助手c# c# 泛型比较大小 c#解压分卷问题 c#启动居中 c# 逻辑或运算符
我们是很有底线的