Aborted 134

C/C++ > C++ 语言 [问题点数:40分]
等级
本版专家分:10
结帖率 78.26%
xiaokuiing

等级:

Socket 连接错误之ECONNABORTED

最近做vue项目用到了axios请求数据,在轮询请求时经常会出现code:‘ECONNABORTED’。在博主的文章里找到了答案,是三次握手之后客户TCP的请求已关闭。瞬间泪流满面。。。 ECONNABORTED 该错误被描述为“software...

Ubuntu 16.04 LTS: apt-get update 失败处理 Aborted (core dumped)

在Ubuntu 16.04运行sudo apt-get update出现如下错误: rogn@ubuntu:~$ sudo apt-get update Get:1 http://us.archive.ubuntu.com/ubuntu xenial InRelease [247 kB] Get:2 http://us.archive.ub...

net::ERR_ABORTED 404

不着急我们进入主题。 先说说为什么导不进去,心急的同学可以直接查看解决方法 出现这个问题是springboot在启动的时候没有带上static下的js和css文件一起跑,还有可能出现只带一部分跑,楼主就踩的是第二个雷 //安利...

weblogic宕机crash问题解决分享

近期比較烦躁。系统频繁出现宕机。weblogic控制台打印出例如以下内容: # Afatal error has been detected by the Java Runtime Environment: # # SIGSEGV (0xb) at pc=0x0000003373c89afc,pid=21500, tid=...

MySQL Aborted告警案例分析

在MySQL的error log中,我们会经常性看到一些各类的Aborted connection错误,本文中会针对这类错误进行一个初步分析,并了解一个问题产生后的基本排查思路和方法。掌握这种方法是至关重要的,而不是出现问题了,去猜...

关于Gazebo运行报错Aborted (core dumped)的解决方案

在运行px4 stil的时候,涉及摄像头仿真的时候出现Aborted (core dumped),解决方案如下 http://gazebosim.org/tutorials?cat=install&tut=install_ubuntu&ver=7.0#Alternativeinstallation:step-by...

javax.net.ssl.SSLProtocolException: SSL handshake aborted: ssl=0xb7d84e10: Failure in SSL library...

04-22 18:55:30.661 3949-3949/com.umeng.soexample.liuhao20190422 I/aaaa: javax.net.ssl.SSLProtocolException: SSL handshake aborted: ssl=0xb7d84e10: Failure in SSL library, usually a protocol erro...

Troubleshooting: java.lang.RuntimeException: HMaster Aborted

When reinstall Cloudera cluster in thesame group of nodes, you must delete the file locates at /opt/cloudera/ from all nodes, or there will be following errorwhen the first run command try tostart

HttpWatch的Result中出现Aborted的原因分析[配图]

转载链接:http://www.cnblogs.com/yutiansanshou/archive/2013/02/01/2889486.html

解决 Mac Pycharm Process finished with exit code 134 (interrupted by signal 6: SIGABRT) 报错

一、错误描述: 1、环境: MacOS 15 Pycharm OpenCV 2、使用描述: ...Process finished with exit code 134 (interrupted by signal 6: SIGABRT) 但是可以在终端成功使用 3、报错分析: MacOS Cata...

cve-2019-0708 msf 执行报错解决

cve-2019-0708 msf 执行报错解决 ...报错信息如下,已经很明显了 Exploit aborted due to failure: bad-config: Set the most appropriate target manually ,没有正确设置好参数 msf5 exploit(windows/rdp/cve_2...

编译caffe报错:make: *** [runtest] 错误 134

make runtest报错:'[libprotobuf ERROR google/protobuf/text_format.cc:245] Error parsing text-format caffe.SolverParameter: 1:113: Message type "caffe.SolverParameter" has no field named "layer_wise_...

文件包含漏洞——配合文件上传漏洞

第一步:打开目标网站 第二步:上传一个一句话木马图片 选择一句话木马图片 上传成功之后,显示出图片的位置 访问一下图片看是否上传成功,发现成功上传 第三步:结合文件包含漏洞访问一句话木马图片,发现p......

2017-2018-2 20155315《网络对抗技术》Exp2:后门原理与实践

实验目的 学习建立一个后门连接。 教程 实验内容 使用netcat获取主机操作Shell,cron启动。 使用socat获取主机操作Shell, 任务计划启动。 使用MSF meterpreter(或其他软件)生成可执行文件,利用ncat或socat传送到...

文件包含漏洞——配合日志文件

此实验中用的是phpstudy2018 靶机IP地址:192.168.212.131 一、前提条件 phpstudy中日志功能默认关闭,得手动修改配置文件开启apache日志功能 重启phpstudy,访问日志文件存在 二、文件包含漏洞测试 ...

[gazebo_gui-2] process has died [pid 4588, exit code 134, cmd /opt/ros/kinetic/lib/gazebo_ros/gzc

当打算算使用gazebo工具导入urdf模型进行仿真,首先在一个终端输入: roscore 再在另一个终端输入: roslaunch pkg_name xxxxx.launch ...[gazebo_gui-2] process has died [pid 4588, exit code 134, cmd /op...

gazebo: [gazebo-2] process has died [pid 2476, exit code 134, cmd / ]

安装好ros系统和gazebo工具后,希望使用gazebo工具进行机械臂的仿真,(参考:https://blog.csdn.net/jinking01/article/details/79387639)按照以下命令进行: 1. 终端输入命令: roscore 2. 打开新的终端并切换...

Got timeout reading communication packets解决方法

Got timeout reading communication packets解决方法 ... ...[Note] Aborted connection xxxx to db:问题现象:在tail -f/data/logs/mysql/error.log日志中出现大量的如下信息(web用的是Zabbix,...

boost库asio错误码

boost库asio常见错误码 boost::asio::error::bad_descriptor (10009) 在一个已经关闭了的套...boost::asio::error::operation_aborted (995) 正在async_receive()异步任务等待时,本端关闭套接字 boost::asio::erro...

ros gazebo 仿真报错 exit code 134

[gazebo-2] process has died [pid 106436, exit code 134, cmd /opt/ros/indigo/lib/gazebo_ros/gzserver -e ode /home/math/ros_ws/src/baxter_simulator/baxter_gazebo/worlds/baxter.world __name:=ga...

ExitCodeExcetion excode=-1073741701:eclipes运行mapreduce在本地local模式下报错

这几天在mapreduce上摸爬滚打,可谓是困难重重 背景如下:mapreduce.framework.name默认为local,在本地(file:///)eclipses运行mapreduce作业,报错 万万没想到是因为bin下的winutils.exe不能运行 ...

Standby RAC遭遇ORA-1157,1111,1110导致实例crash处理

案例:Standby RAC遭遇ORA-1157,1111,1110导致实例crash处理 环境:RHEL 6.5 + Oracle RAC 11.2.0.4 + Dataguard 今天在实验环境的Pirmary RAC主库上做了一个增加表空间的操作,结果Standby RAC启动同步后直接...

打开gazebo进入baxter仿真环境运行简单例子

1、前记:为了尽快在ROS中操作Baxter机器人,需要可以的下载https://download.csdn.net/download/weixin_39090239/10726734  以下为学习中的记录一些记录,主要是遇到的一些问题和解决办法。 ...

Retrofit中如何正确的使用https?

很多文章对客户端https的使用都是很模糊的,不但如此,有些开发者直接从网上拷贝一些使用https的“漏洞”代码,无形之中让客户端处在一种高风险的情况下。今天我们就对有关https...证书锁定 简介首先来说说什么是证书锁

doublepulsar msf 执行报错解决

doublepulsar msf 执行报错解决 在检查服务器是否存在漏洞的过程中,发现exploit 报错, 报错信息如下,已经很明显了 Disable the DefangedMode option if you have authorization to proceed....

kali利用CVE_2019_0708(远程桌面代码执行漏洞)攻击win7

一、漏洞说明 2019年5月15日微软发布安全补丁修复了CVE编号为CVE-2019-0708的Windows远程桌面服务(RDP)远程代码执行漏洞,该漏洞在不需身份认证的情况下即可远程触发,危害与影响面极大。 目前,9月7日EXP代码已被...

Container exited with a non-zero exit code 134错误原因查找

问题:spark在yarn执行任务遇到如下的错误: ERROR YarnScheduler: Lost executor 17 on xxx: Container marked as failed: container_e84_1574035425015_31345_01_... Exit status: 134. Diagnostics: Exception ...

MySQL服务器端&客户端常见错误

目录(?)[+] 客户端 服务器端 ...1.ERROR 2013 (HY000) at line 1: Lost connection to MySQL server during query ...使用select 一个大表,query的过程中被主库kill掉会出现下面错误 ...2.ERROR 2006 (HY000): MySQL ...

Spring Boot之No session repository could be auto-configured, check your configuration问题解决

spring boot关于session repository初始化失败的问题解决。

percona-toolkit

摘要: 通过下面的这些命令在接触到新的数据库服务器的时候能更好更快的了解服务器和数据库的状况。 1:pt-summary:查看系统摘要报告 执行: pt-summary 打印出来的信息包括:CPU、内存、硬盘、网卡等信息,还...

相关热词 c# 两个form赋值 c#无符号整形转为有符号 a4纸大小 c# c# 图片合并 c# 脏字过滤 c#登录权限 c#设置excel列宽 c#透明度 c# 载入文件 adb c#