maven在instsall时报错,来大神帮忙看看

牙痛不要紧 2015-11-26 11:43:45
[INFO] Scanning for projects...
[INFO]
[INFO] ------------------------------------------------------------------------
[INFO] Building mymomo Maven Webapp 1.0
[INFO] ------------------------------------------------------------------------
[INFO]
[INFO] --- maven-resources-plugin:2.6:resources (default-resources) @ mymomo ---
[WARNING] Using platform encoding (GBK actually) to copy filtered resources, i.e. build is platform dependent!
[INFO] Copying 0 resource
[INFO]
[INFO] --- maven-compiler-plugin:3.1:compile (default-compile) @ mymomo ---
[WARNING] Error injecting: org.apache.maven.plugin.compiler.CompilerMojo
java.lang.NoClassDefFoundError: org/codehaus/plexus/compiler/util/scan/InclusionScanException
at java.lang.Class.getDeclaredConstructors0(Native Method)
at java.lang.Class.privateGetDeclaredConstructors(Class.java:2663)
at java.lang.Class.getDeclaredConstructors(Class.java:2012)
at com.google.inject.spi.InjectionPoint.forConstructorOf(InjectionPoint.java:245)
at com.google.inject.internal.ConstructorBindingImpl.create(ConstructorBindingImpl.java:99)
at com.google.inject.internal.InjectorImpl.createUninitializedBinding(InjectorImpl.java:657)
at com.google.inject.internal.InjectorImpl.createJustInTimeBinding(InjectorImpl.java:875)
at com.google.inject.internal.InjectorImpl.createJustInTimeBindingRecursive(InjectorImpl.java:798)
at com.google.inject.internal.InjectorImpl.getJustInTimeBinding(InjectorImpl.java:281)
at com.google.inject.internal.InjectorImpl.getBindingOrThrow(InjectorImpl.java:213)
at com.google.inject.internal.InjectorImpl.getProviderOrThrow(InjectorImpl.java:998)
at com.google.inject.internal.InjectorImpl.getProvider(InjectorImpl.java:1031)
at com.google.inject.internal.InjectorImpl.getProvider(InjectorImpl.java:994)
at com.google.inject.internal.InjectorImpl.getInstance(InjectorImpl.java:1044)
at org.eclipse.sisu.space.AbstractDeferredClass.get(AbstractDeferredClass.java:48)
at com.google.inject.internal.ProviderInternalFactory.provision(ProviderInternalFactory.java:86)
at com.google.inject.internal.InternalFactoryToInitializableAdapter.provision(InternalFactoryToInitializableAdapter.java:54)
at com.google.inject.internal.ProviderInternalFactory$1.call(ProviderInternalFactory.java:70)
at com.google.inject.internal.ProvisionListenerStackCallback$Provision.provision(ProvisionListenerStackCallback.java:115)
at org.eclipse.sisu.bean.BeanScheduler$Activator.onProvision(BeanScheduler.java:176)
at com.google.inject.internal.ProvisionListenerStackCallback$Provision.provision(ProvisionListenerStackCallback.java:126)
at com.google.inject.internal.ProvisionListenerStackCallback.provision(ProvisionListenerStackCallback.java:68)
at com.google.inject.internal.ProviderInternalFactory.circularGet(ProviderInternalFactory.java:68)
at com.google.inject.internal.InternalFactoryToInitializableAdapter.get(InternalFactoryToInitializableAdapter.java:46)
at com.google.inject.internal.InjectorImpl$2$1.call(InjectorImpl.java:1009)
at com.google.inject.internal.InjectorImpl.callInContext(InjectorImpl.java:1059)
at com.google.inject.internal.InjectorImpl$2.get(InjectorImpl.java:1005)
at com.google.inject.internal.SingletonScope$1.get(SingletonScope.java:36)
at org.eclipse.sisu.inject.LazyBeanEntry.getValue(LazyBeanEntry.java:81)
at org.eclipse.sisu.plexus.LazyPlexusBean.getValue(LazyPlexusBean.java:51)
at org.codehaus.plexus.DefaultPlexusContainer.lookup(DefaultPlexusContainer.java:263)
at org.codehaus.plexus.DefaultPlexusContainer.lookup(DefaultPlexusContainer.java:255)
at org.apache.maven.plugin.internal.DefaultMavenPluginManager.getConfiguredMojo(DefaultMavenPluginManager.java:546)
at org.apache.maven.plugin.DefaultBuildPluginManager.executeMojo(DefaultBuildPluginManager.java:121)
at org.apache.maven.lifecycle.internal.MojoExecutor.execute(MojoExecutor.java:208)
at org.apache.maven.lifecycle.internal.MojoExecutor.execute(MojoExecutor.java:153)
at org.apache.maven.lifecycle.internal.MojoExecutor.execute(MojoExecutor.java:145)
at org.apache.maven.lifecycle.internal.LifecycleModuleBuilder.buildProject(LifecycleModuleBuilder.java:116)
at org.apache.maven.lifecycle.internal.LifecycleModuleBuilder.buildProject(LifecycleModuleBuilder.java:80)
at org.apache.maven.lifecycle.internal.builder.singlethreaded.SingleThreadedBuilder.build(SingleThreadedBuilder.java:51)
at org.apache.maven.lifecycle.internal.LifecycleStarter.execute(LifecycleStarter.java:128)
at org.apache.maven.DefaultMaven.doExecute(DefaultMaven.java:307)
at org.apache.maven.DefaultMaven.doExecute(DefaultMaven.java:193)
at org.apache.maven.DefaultMaven.execute(DefaultMaven.java:106)
at org.apache.maven.cli.MavenCli.execute(MavenCli.java:862)
at org.apache.maven.cli.MavenCli.doMain(MavenCli.java:286)
at org.apache.maven.cli.MavenCli.main(MavenCli.java:197)
at sun.reflect.NativeMethodAccessorImpl.invoke0(Native Method)
at sun.reflect.NativeMethodAccessorImpl.invoke(NativeMethodAccessorImpl.java:62)
at sun.reflect.DelegatingMethodAccessorImpl.invoke(DelegatingMethodAccessorImpl.java:43)
at java.lang.reflect.Method.invoke(Method.java:483)
at org.codehaus.plexus.classworlds.launcher.Launcher.launchEnhanced(Launcher.java:289)
at org.codehaus.plexus.classworlds.launcher.Launcher.launch(Launcher.java:229)
at org.codehaus.plexus.classworlds.launcher.Launcher.mainWithExitCode(Launcher.java:415)
at org.codehaus.plexus.classworlds.launcher.Launcher.main(Launcher.java:356)
Caused by: java.lang.ClassNotFoundException: org.codehaus.plexus.compiler.util.scan.InclusionScanException
at org.codehaus.plexus.classworlds.strategy.SelfFirstStrategy.loadClass(SelfFirstStrategy.java:50)
at org.codehaus.plexus.classworlds.realm.ClassRealm.unsynchronizedLoadClass(ClassRealm.java:271)
at org.codehaus.plexus.classworlds.realm.ClassRealm.loadClass(ClassRealm.java:247)
at org.codehaus.plexus.classworlds.realm.ClassRealm.loadClass(ClassRealm.java:239)
... 55 more
[INFO] ------------------------------------------------------------------------
[INFO] BUILD FAILURE
[INFO] ------------------------------------------------------------------------
[INFO] Total time: 1.490 s
[INFO] Finished at: 2015-11-15T16:33:51+08:00
[INFO] Final Memory: 10M/113M
[INFO] ------------------------------------------------------------------------
[ERROR] Failed to execute goal org.apache.maven.plugins:maven-compiler-plugin:3.1:compile (default-compile) on project mymomo: Execution default-compile of goal org.apache.maven.plugins:maven-compiler-plugin:3.1:compile failed: A required class was missing while executing org.apache.maven.plugins:maven-compiler-plugin:3.1:compile: org/codehaus/plexus/compiler/util/scan/InclusionScanException
[ERROR] -----------------------------------------------------
[ERROR] realm = plugin>org.apache.maven.plugins:maven-compiler-plugin:3.1
[ERROR] strategy = org.codehaus.plexus.classworlds.strategy.SelfFirstStrategy
[ERROR] urls[0] = file:/C:/Users/zhanghai123/.m2/repository/org/apache/maven/plugins/maven-compiler-plugin/3.1/maven-compiler-plugin-3.1.jar
[ERROR] urls[1] = file:/C:/Users/zhanghai123/.m2/repository/org/codehaus/plexus/plexus-utils/1.1/plexus-utils-1.1.jar
[ERROR] Number of foreign imports: 1
[ERROR] import: Entry[import from realm ClassRealm[maven.api, parent: null]]
[ERROR]
[ERROR] -----------------------------------------------------: org.codehaus.plexus.compiler.util.scan.InclusionScanException
[ERROR] -> [Help 1]
[ERROR]
[ERROR] To see the full stack trace of the errors, re-run Maven with the -e switch.
[ERROR] Re-run Maven using the -X switch to enable full debug logging.
[ERROR]
[ERROR] For more information about the errors and possible solutions, please read the following articles:
[ERROR] [Help 1] http://cwiki.apache.org/confluence/display/MAVEN/PluginContainerException
...全文
295 3 打赏 收藏 举报
写回复
用AI写文章
3 条回复
切换为时间正序
请发表友善的回复…
发表回复
test_234 2016-03-13
  • 打赏
  • 举报
回复
我的也有问题啊
test_234 2016-03-13
  • 打赏
  • 举报
回复
[INFO] ------------------------------------------------------------------------ [ERROR] Failed to execute goal org.apache.maven.plugins:maven-compiler-plugin:3.1:compile (default-compile) on project elasticsearch: Execution defaul t-compile of goal org.apache.maven.plugins:maven-compiler-plugin:3.1:compile failed: A required class was missing while executing org.apache.maven.plu gins:maven-compiler-plugin:3.1:compile: org/codehaus/plexus/compiler/util/scan/InclusionScanException [ERROR] ----------------------------------------------------- [ERROR] realm = plugin>org.apache.maven.plugins:maven-compiler-plugin:3.1 [ERROR] strategy = org.codehaus.plexus.classworlds.strategy.SelfFirstStrategy [ERROR] urls[0] = file:/D:/spark/m2/org/apache/maven/plugins/maven-compiler-plugin/3.1/maven-compiler-plugin-3.1.jar [ERROR] urls[1] = file:/D:/spark/m2/org/codehaus/plexus/plexus-utils/1.5.1/plexus-utils-1.5.1.jar [ERROR] urls[2] = file:/D:/spark/m2/org/apache/maven/shared/maven-shared-utils/0.1/maven-shared-utils-0.1.jar [ERROR] urls[3] = file:/D:/spark/m2/com/google/code/findbugs/jsr305/2.0.1/jsr305-2.0.1.jar [ERROR] urls[4] = file:/D:/spark/m2/org/apache/maven/shared/maven-shared-incremental/1.1/maven-shared-incremental-1.1.jar [ERROR] urls[5] = file:/D:/spark/m2/org/codehaus/plexus/plexus-component-annotations/1.5.5/plexus-component-annotations-1.5.5.jar [ERROR] urls[6] = file:/D:/spark/m2/org/codehaus/plexus/plexus-compiler-api/2.2/plexus-compiler-api-2.2.jar [ERROR] urls[7] = file:/D:/spark/m2/org/codehaus/plexus/plexus-compiler-manager/2.2/plexus-compiler-manager-2.2.jar [ERROR] urls[8] = file:/D:/spark/m2/org/codehaus/plexus/plexus-compiler-javac/2.2/plexus-compiler-javac-2.2.jar [ERROR] urls[9] = file:/D:/spark/m2/org/apache/xbean/xbean-reflect/3.4/xbean-reflect-3.4.jar [ERROR] urls[10] = file:/D:/spark/m2/log4j/log4j/1.2.12/log4j-1.2.12.jar [ERROR] urls[11] = file:/D:/spark/m2/commons-logging/commons-logging-api/1.1/commons-logging-api-1.1.jar [ERROR] urls[12] = file:/D:/spark/m2/com/google/collections/google-collections/1.0/google-collections-1.0.jar [ERROR] urls[13] = file:/D:/spark/m2/junit/junit/3.8.2/junit-3.8.2.jar [ERROR] Number of foreign imports: 1 [ERROR] import: Entry[import from realm ClassRealm[maven.api, parent: null]] [ERROR] [ERROR] -----------------------------------------------------: org.codehaus.plexus.compiler.util.scan.InclusionScanException [ERROR] -> [Help 1] [ERROR] [ERROR] To see the full stack trace of the errors, re-run Maven with the -e switch. [ERROR] Re-run Maven using the -X switch to enable full debug logging. [ERROR] [ERROR] For more information about the errors and possible solutions, please read the following articles: [ERROR] [Help 1] http://cwiki.apache.org/confluence/display/MAVEN/PluginContainerException D:\elasticsearch-1.4>
一叶飞舟 2015-11-27
  • 打赏
  • 举报
回复
org.codehaus.plexus.compiler.util.scan.InclusionScanException
--------------------------------------------------------------------------------------------------
缺jar包?
内容概要:本文提出了一种基于混沌系统与DNA编码的复合型彩色图像加密解密方案,旨在解决传统图像加密算法安全性不足及抗干扰能力弱的问题。方案通过混沌系统的伪随机序列对图像像素进行全局置乱,并结合DNA碱基编码的多维扩散特性实现像素值的深层混淆,构建了“置乱-扩散”双重保护机制。研究不仅系统验证了算法在密钥空间、密钥敏感性、信息熵等方面的安全性能,还重点开展了多场景、多强度的抗噪声与抗裁剪性能分析,证实了其在高斯噪声、椒盐噪声干扰及不同位置、面积裁剪攻击下的卓越鲁棒性,弥补了现有研究在实用性方面的不足。; 适合人群:具备一定信息安全、图像处理或密码学基础,从事科研或工程开发的研究生、教师及技术人员。; 使用场景及目标:①为彩色图像在网络传输、医疗影像、军事通信等高安全需求场景下的保密存储与传输提供高鲁棒性加密方案;②为研究复合型图像加密算法的设计与性能评估提供系统性参考; 阅读建议:读者应重点关注混沌与DNA编码的融合机制、加密流程设计以及抗干扰性能的测试方法,建议结合文中提到的仿真结果深入理解算法的实用性与优化方向,并可进一步探索其在视频加密或多模态数据保护中的扩展应用。
内容概要:WiFiSupply斯普莱WFS7000BDAX是一款高性能、电信工业级双射频双频分体式无线基站,支持2.4G和5.8G频段的WiFi6(802.11ax)标准,采用4T4R MIMO架构,双射频最大带宽达2974Mbps,点对点实际吞吐量超过1500Mbps。设备具备高发射功率(单射频28dBm)、超强抗干扰能力、通信延迟≤1ms、支持OFDMA、FastRoaming快速漫游、LD长距离优化协议等核心技术,配合高增益天线可实现3km覆盖或150公里点对点桥接。产品支持宽电压POE供电(12-30V,可选48V),具备IP68防护等级和-45~85℃宽温工作能力,通过多项国家级认证,适用于恶劣环境下的稳定运行。支持胖瘦一体模式、云管理平台、API对接、SNMP、SSH等丰富管理方式,提供多重加密与安全防护机制,适用于工业4.0、智慧物流、智能驾培、AGV小车、车载船载视频传输等复杂场景。; 适合人群:从事工业无线通信、网络工程、物联网系统集成的技术人员及项目决策者,具备一定网络基础知识和现场部署经验的工程师。; 使用场景及目标:①用于远距离无线桥接与大面积无线覆盖,如森林防火监控、智慧交通信号回传;②满足高密度、高移动性终端接入需求,如AMR/AGV小车组网、无人机遥控;③在强电磁干扰或极端气候环境下构建高可靠无线网络,保障视频传输、PLC控制等关键业务连续性;④通过云平台或本地服务器实现集中运维管理和安全认证。; 阅读建议:此文档为产品技术规格说明书,重点在于了解设备性能边界与适用场景,建议结合实际项目需求对照参数选型,并关注其私有协议、安全隧道、抗干扰设计等差异化功能的实际部署配置方法。

81,108

社区成员

发帖
与我相关
我的任务
社区描述
Java Web 开发
社区管理员
  • Web 开发社区
加入社区
  • 近7日
  • 近30日
  • 至今
社区公告
暂无公告

试试用AI创作助手写篇文章吧