Process'command'D:\java\jdk1.7.0\bin\java.exe''finishedwith non-zero exit value2

移动开发 > Android [问题点数:20分,结帖人baidu_33506491]
等级
本版专家分:0
结帖率 100%
等级
本版专家分:2677
等级
本版专家分:0
等级
本版专家分:2677
等级
本版专家分:2677
等级
本版专家分:0
等级
本版专家分:0
等级
本版专家分:2677
等级
本版专家分:2677
等级
本版专家分:20
勋章
Blank
脉脉勋章 绑定脉脉第三方账户获得
Blank
GitHub 绑定GitHub第三方账户获取
等级
本版专家分:0
DSN~大楠

等级:

使用studio编译中遇到的两个的错误_'D:\jdk1.7.0_80\bin\java.exe'' finished with non-zero exit value 1 ...

博客地址: http://blog.csdn.net/lxk_1993/article/details/50511172 Error:Execution failed for task ':app:transformClassesWithDexForDebug'解决记录 转载请标明出处:  ...

解决C:\Program Files\Java\jdk1.7.0_71\bin\java.exe'' finished with non-zero exit value 2

使用android studio 导入了一个别人的module, gradle的时候就报了个错,完整错误信息为 Error:Execution failed for task ':app:transformClassesWithDexForDebug'. > ...

Java\jdk1.7.0_79\bin\java.exe finished with non-zero exit value 2的错误处理

先来看一下出错信息: Error:Execution failed for task ':app:...> com.android.build.api.transform.TransformException: com.android.ide.common.process.ProcessException: org.gradle.p

Android Studio Java\jdk1.7.0_45\bin\java.exe'' finished with non-zero exit value 3

Error:Execution failed for task ':jinFu:dexAppchinaDebug'.> com.android.ide.common.process.ProcessException: org.gradle.process.internal.ExecException: Process 'command '

Process'command'D:\java\jdk1.7.0\bin\java.exe''finishedwith non-zero exit value2

jdk1.7.0_79\bin\java.exe'' finished with non-zero exit value 1

关于Eclipse项目导入到 Android stuido报错:  Error:Execution failed for task ':app:transformClassesWithDexForDebug'. > com.android.build.api.transform.TransformException: ...

ExecException: ProcessJava\jdk1.7.0_75\bin\java.exe'' finished with non-zero exit value 2

错误报告:Error:Execution failed for task ':dexBaiduDebug'...> com.android.ide.common.process.ProcessException: org.gradle.process.internal.ExecException: Process 'command 'D:\Program Files\Java\jdk1.7.0

finished with non-zero exit value 2头疼

Process 'command 'D:\Java\jdk1.7.0_80\bin\java.exe'' finished with non-zero exit value 2 在网上查了,好多人说是jar包重复,但是在logcat里也不打印是哪个jar包的信息重复。。。头疼。。。 项目里v4包和v7包...

AS finished with non-zero exit value 1 问题

org.gradle.process.internal.ExecException: Process 'command 'C:\Program Files\Java\jdk1.7.0_71\bin\java.exe'' finished with non-zero exit value 1 完整的报错信息 这是一个新建的项目 什么都没写, 启动...

'command 'C:\Program Files\Java\jdk1.7.0_75\bin\java.exe'' finished with non-zero exit value 2

warning: Ignoring InnerClasses attribute for an anonymous inner class (org.apache.commons.httpclient.HttpMethodBase$1) that doesn't come with an associated EnclosingMethod attribute....

finished with non-zero exit value 2问题求助

org.gradle.process.internal.ExecException: Process 'command '/Library/Java/JavaVirtualMachines/jdk1.7.0_79.jdk/Contents/Home/bin/java'' finished with non-zero exit value 2 求助各位达人,这个问题应该...

AS出现 Process 'command 'F:\java\jdk1.7.0_79\bin\java.exe'' finished with non-zero exit value 1问题

Process 'command 'F:\java\jdk1.7.0_79\bin\java.exe'' finished with non-zero exit value 1 出现这个问题主要是使用的buildToolsVersion和targetSdk版本不一样导致的. 出错情况: 纠正:

迁移报错command 'C:\Program Files\Java\jdk1.7.0_67\bin\java.exe'' finished with non-zero1

博客地址: http://blog.csdn.net/lxk_1993/article/details/50511172 Error:Execution failed for task ':app:transformClassesWithDexForDebug'解决记录 转载请标明出处:  ...

Unsupported major.minor version...finished with non-zero exit value 1解决办法

本来项目运行的好好的,结果不知道改了一些什么就报错了,错误如下: Error:java.lang.UnsupportedClassVersionError: com/android/dx/command/Main : ...Error: at java.lang.ClassLoader.defineClass1(Native

--迁移报错command 'C:\Program Files\Java\jdk1.7.0_67\bin\java.exe'' finished with non-zero1

我将Idea的项目迁移到studio上,在Idea上能运行,但是在studio上运行却提示这个错误 ...好吧,不知道什么原因,只好去问百度了,然后我看到了这篇博客,觉得有希望: ...Error:Execution failed for task

Android finished with non-zero exit value 1错误解决方案

Android初学者Process 'command '*****'' finished with non-zero exit value 1错误解决方案 这个问题仅限于一些Android初学者在页面布局里遇到的问题 我也是刚刚开始写不久,如有总结不到位的请及时联系我: ...

ExecException: Process 'command 'C:\Program Files\Java\jdk1.7.0_79\bin\java.exe'' finished with non-

ExecException: Process 'command 'C:\Program Files\Java\jdk1.7.0_79\bin\java.exe'' finished with non-zero exit value 2 网上给的解决方法是: 注意:如果删除之后还报,那就clean一下项目。本人亲测有效...

【Android】Android studio 编译问题:finished with non-zero exit value 2

【Android】Android studio 编译问题:finished with non-zero exit value 2 目录 1.Android studio 编译问题:finished with non-zero exit value 2 2.Android studio 编译问题:finished with non-zero exit ...

Android Studio编译运行project报错:····· finished with non-zero exit value 1

   错误代码:   Error:Execution failed for task ':app:transformClassesWithDexForDebug'. ... com.android.ide.common.process.ProcessException: org.gradle.process.internal.ExecException: Process '...

导入support:appcompat-v7包报错finished with non-zero exit value 2

最近弄material Design,需要导入com.android.support:appcompat-v7包 dependencies { compile '... } 但是报错 Error:Execution failed for task ‘:YizanService4Android:dex

问题:org.gradle.process.internal.ExecException: Process 'command 'C:\Program Files\Java\jdk1.8.0

被编译的代码或资源有问题( finished with non-zero exit value 1): 出现这种编译异常表现是exit value 1,一般会给出错误提示,所以很容易排查。这种错误很常见,错误提示有时候是在日志中明显的给出来了,...

Android Studio在编译或者运行中报错 finished with non-zero exit value 1

在Android Studio 运行或者编译的时候出现如图的报错,然后看代码也没有什么大问题,百度上也是...1.控制台报错是 finished with non-zero exit value 1 (翻译一下就是:以非零退出值1结束)于是就很懵。 ...

AndroidStudio 编译过程中出现finished with non-zero exit value 3错误

此篇文章引用于:... 编译的代码过多导致内存不足(finished with non-zero exit value 3): 主要表现为编译后出现finished with non-zero exit value 3错误,原因是因为编译的java代码过多,

AndroidStudio使用备忘:报错finished with non-zero exit value 2

FAILURE: Build failed with an exception. * What went wrong: Execution failed for task ':***:dexDebug'. > com.android.ide.common.process.ProcessException: org.gradle.process.internal.ExecExcepti

Android 错误之finished with non-zero exit value 2

在初学Android的时候使用开源项目遇到这个问题:“com.android.ide.common.process.ProcessException: org.gradle.process.internal.ExecException: Process 'command '/Library/Java/JavaVirtualMachines/jdk1.7.0_...

Error:Execution failed for task ':app:dexDebug'.finished with non-zero exit value 3解决

Android studio 编译错误: Error:Execution failed for task ':app:...> com.android.ide.common.process.ProcessException: org.gradle.process.internal.ExecException: Process 'command 'C:\Program Files

Android Studio导入jar包,报错 finished with non-zero exit value 2

Android Studio导入jar包,报错finished with non-zero exit value 2 详细报错: Configuration on demand is an incubating feature. :app:preBuild UP-TO-DATE :app:preDebugBuild UP-TO-DATE :app:...

Android Studio 运行时出现 finished with non-zero exit value 2 错误分析

错误: com.android.ide.common.process.ProcessException: org.gradle.process.internal.... Process 'command '/Library/Java/JavaVirtualMachines/jdk1.7.0_71.jdk/Contents/Home/bin/java'' finished

数据结构基础系列(7):图

数据结构课程是计算机类专业的专业基础课程,在IT人才培养中,起着重要的作用。课程按照大学计算机类专业课程大纲的要求,安排教学内容,满足需要系统学习数据结构的人。系列课程包含11个部分,本课为第7部分“图”,介绍图的相关概念图的存储结构和基本运算,深度优先和广度优先的遍历以及小生成树等其他运算。 系列课程的目标是帮助学习者系统掌握数据结构课程的相关知识,具备利用这些知识分析问题、解决问题的能力。本课是系列课程中的第7部分,具体目标包括:掌握图的相关概念;重点掌握图的邻接矩阵和邻接表各种存储结构;重点掌握图的基本运算,包括创建图、输出图、深度优先遍历、广度优先遍历算法;掌握图的其他运算,包括最小生成树、最短路径、拓扑排序等算法。能够灵活运用图解决一些综合应用问题。

打通Linux脉络系列:进程、线程和调度

本课程分成4个组成部分,每次课60分钟,每次课后留下3-4个练习题,可以在Linuxer公众号留言讨论答案和做题心得。 第一部分:深入彻底搞清楚进程生命周期,进程生命周期创建、退出、停止、以及僵尸是个什么意思; 第二部分:深入分析进程创建的写时拷贝技术、以及Linux的线程究竟是怎么回事(为什么称为轻量级进程),此部分也会搞清楚进程0、进程1和托孤,以及睡眠时的等待队列; 第三部分:搞清楚Linux进程调度算法,不同的调度策略,实时性,完全公平调度算法; 第四部分:讲解Linux多核下CPU、中断、软负载均衡、cgroups调度算法以及Linux为什么不是一个实时操作系统。 掌握Linux脉络知识:进程、线程和调度。

相关热词 c# 页面转换成pdf c# 轨迹回放 c#图片热点 c#检测串口断开 c# unity上下滑动 c#和g++编译器连接 c# rsa 公钥加密 c# 水晶报表 自动下移 c#dll类库 vs c# 窗口句柄