IOS中linker command failed with exit code 1问题原因,如何调试? [问题点数:20分,结帖人qyindelong]

Bbs1
本版专家分:0
结帖率 100%
Bbs1
本版专家分:51
Bbs1
本版专家分:0
Bbs1
本版专家分:9
Bbs1
本版专家分:0
Bbs1
本版专家分:0
Xcode出现( linker command failed with exit code 1)错误总结
这种<em>问题</em>,通常出现在添加第三方库文件或者多人开发时。一般是找不到文件而导致的链接错误。 我们可以从如下几个方面着手排查。      提一点,我觉得一下方法<em>中</em>90%以上能解决你遇到的这个错误。可能你看一遍过去,或者操作一遍后还是报错,相信我,根据多次错误的经验,加之有同事遇到该<em>问题</em>,按照一下方法尝试没能解决(可能在当时没耐心,太急躁,心还不够静),但后来发现确实是下面其<em>中</em>之一的错误解决方法.  ...
集成第三方遇到: linker command failed with exit code 1
集成第三方SDK时候遇到了clang: error: <em>linker</em> <em>command</em> <em>failed</em> with <em>exit</em> <em>code</em> <em>1</em> (use -v to see invocation)错误,在网上也找了好多资料,遇到的<em>问题</em>和我的不一样。 ####这是我项目遇到的错误: 这是用双指按触摸板,会弹出如下提示(选择Reveal in Log 选项): 会进入到错误的详细内容,如下: ####注意错...
关于linker command failed with exit code 1 造成的失败问题的汇总
<em>1</em>.又重复的文件建立 发现新建的  ZZWPublicJobModel  在原来的工程<em>中</em>已经存在了,所以造成了这个<em>原因</em> ZZWPublicJobModel
linker command failed with exit code 1 (use -v to see invocation)的解决方法
我在把Unity项目导入到X<em>code</em>,在build的时候出现<em>linker</em> <em>command</em> <em>failed</em> with <em>exit</em> <em>code</em> <em>1</em> (use -v to see invocation)的报错,这个报错以前在接<em>IOS</em>的SDK的时候也遇到过,当时是把build setting 里面的Objective-C Automatic Reference Count 改成了NO,然后就行了,...
android8.1编译过程遇到的两个问题
列举android8.<em>1</em>编译过程<em>中</em>jack-server出现的<em>问题</em>和解决方法
一个签名错误的解决——codesign failed with exit code 1
前日,Macbook的硬盘不幸挂了,于是将开发环境迁移到Mac Mini下。大家知道,对于X<em>code</em>来说,最麻烦的就是各种证书、ProvisioningProfile的配置<em>问题</em>。将原来的各种开发证书和.p<em>1</em>2证书导入到mini上,接下来就碰到了各种莫名其妙的<em>问题</em>。先是无法development(可以debug),发现是证书导错了(没有用Agent证书,只有Agent可以发布)。于是制作证书请求,重...
xcode下编程出现clang: error: linker command failed with exit code 1,不知道错误原因,请教前辈!
在x<em>code</em>下编程,利用rtp的封装库ortp来改写服务器端的程序(原来服务器端用另外一个rtp的库所写)。运行时报如下错: Ld /Users/magicstudio/Library/Develop
Xcode编译常见错误解决:linker command failed with exit code 1 (use -v to see invocation)
Showing All Issues clang: error: <em>linker</em> <em>command</em> <em>failed</em> with <em>exit</em> <em>code</em> <em>1</em> (use -v to see invocation)出现以上错误,现总结如下解决方法: <em>1</em>、检查引用文件是否出错,把 xxx.h文件弄成了xxx.m文件,检查一下你的所有引用;2、在工作左边导航栏Target–>Build Phases–>compile
linker command failed with exit code 1 (use -v to see invocation),经典Xcode编译错误的出现和解决!...
<em>linker</em> <em>command</em> <em>failed</em> with <em>exit</em> <em>code</em> <em>1</em> (use -v to see invocation)这个肯定是个x<em>code</em>编译运行的时候经典的报错了。 这个<em>问题</em>曾经在我的项目编译和运行的时候多次出现,但是从来没有记录过。现在就想每次出现对它进行一下记录,这样为以后出现同样的<em>问题</em>的时候让自己也有个更加快速的方法找到解决之路。 <em>linker</em> <em>command</em> faile...
Command CompileAssetCatalog emitted errors but did not return a nonzero exit code to indicate failur
今天在做UI,添加各式各样的图片的时候,X<em>code</em><em>1</em>0.<em>1</em>居然闪退了,然后我重新打开,build起我的项目,发现我项目全部的图片都不能显示了(ps:我真机<em>调试</em>开发)。 解决方法很简单: <em>command</em>+shift+k 清除缓存即可,啦啦啦啦啦 ...
iOS 真机报错 Command CodeSign failed with a nonzero exit code
今天在网上下载的一个小demo,在模拟器上正常运行,但是在真机上报错: 解决方式: <em>1</em>.打开钥匙串;2.锁住login keychain; 3.再把它解锁。 然后就能真机上正常运行了, 转载于:https://www.cnblogs.com/liuwenqiang/p/<em>1</em>0833478.html...
编译出现 ninja: build stopped: subcommand failed.
-
出现( linker command failed with exit code 1)错误总结
欢迎使用Markdown编辑器写博客 本Markdown编辑器使用StackEdit修改而来,用它写博客,将会带来全新的体验哦: Markdown和扩展Markdown简洁的语法 代码块高亮 图片链接和图片上传 LaTex数学公式 UML序列图和流程图 离线写博客 导入导出Markdown文件 丰富的快捷键 快捷键 加粗 Ctrl + B 斜体 Ctrl + I...
问题:The following build commands failed: CompileXIB **.xib
iOS app使用jenkins打包时编译失败,报错如下图: 报此错误可能出现的<em>原因</em>有两个:一是本身这个文件出错,打不开;如果这个文件没<em>问题</em>,仍然失败,则检查一下工程<em>中</em>Build Phases<em>中</em>的Copy Bundle Resources是否重复引用了此文件,删除多余的即可。
xcodebuild error: Command PhaseScriptExecution failed with a nonzero exit code
20<em>1</em>9独角兽企业重金招聘Python工程师标准&gt;&gt;&gt; ...
IOS - Build failed: Command CodeSign failed with a nonzero exit code
网络上通常的方法是,clean project,然后重启mac。 我的错误比较特殊,从stackoverflow里找到的解决方案,<em>原因</em>如下,我引用的game资源目录名称是resources,这个名称是被占用的,应该改成其他的名字,就可以解决了。 原<em>问题</em>:X<em>code</em> <em>1</em>0, Command CodeSign <em>failed</em> with a nonzero <em>exit</em> <em>code</em> 原答案如下: None ...
wince新手:build新建项目出错啦:Command returned non-zero exit code 1 (dec),跪求答案
build run-time image时出现错误.请大虾指教。从网上看到在项目->属性->配置属性->Build Option->Run-time image can be larger than
Xcode 10下 Command PhaseScriptExecution failed with a nonzero exit code
X<em>code</em> <em>1</em>0 下Archive使用Debug环境的话会可能出现下面的错误 Command PhaseScriptExecution <em>failed</em> with a nonzero <em>exit</em> <em>code</em> 解决方案 <em>1</em>.打开Workspace Setting… 2.将新编译系统改成以前的再次打包就OK 不过对于上线AppStore的时候还是建议大家使用release ...
Xcode 11问题及 Xcode 11 beta 1和beta 2 版下载链接, 官方下载后上传到百度网盘的.
Xode <em>1</em><em>1</em> beta <em>1</em> 版下载 链接:https://pan.baidu.com/s/<em>1</em>ZqWoDaIgUGzGdupPqHJIvQ 密码:q9gy 现在苹果官网的下载链接<em>中</em>已经没有了开始版本的X<em>code</em> <em>1</em><em>1</em> beta版测下载链接, 最新的也仅仅是X<em>code</em> <em>1</em><em>1</em> beta 6版本的下载 聊聊X<em>code</em> <em>1</em><em>1</em> beta的<em>问题</em> X<em>code</em> <em>1</em><em>1</em> beta版一直存在的一个<em>问题</em>就是每次编译运...
RK3326 安卓编译出现ninja: build stopped: subcommand failed. 20:48:02 ninja failed with: exit status 1 错误
RK3326 安卓编译出现ninja: build stopped: sub<em>command</em> <em>failed</em>. 20:48:02 ninja <em>failed</em> with: <em>exit</em> status <em>1</em> 错误 在RK3266编译安卓是出现如下错误: 百度试了各种办法后,终于解决: 执行 export LC_ALL=C 后解决; LC_ALL=C作用,大家自行百度 欢迎使用Markdown编辑器 你好!...
Showing All Messages Command PhaseScriptExecution failed with a nonzero exit code
_TARGET_BUILD_CONTENTS_PATH: /Users/admin/Library/Developer/X<em>code</em>/DerivedData/project_wly2_lua_client-glidlmxpowdxakfdpxalcgifxlbh/Build/Products/Debug-iphoneos/project_wly2_lua_client-mobile.app PW...
Command CodeSign failed with a nonzero exit code
最近在集成NEKit,按照网上流传的方式导入第三方库后,编译报错Frameworks/NetworkExtension.framework: bundle format unrecognized, invalid, or unsuitable. Command CodeSign <em>failed</em> with a nonzero <em>exit</em> <em>code</em>. <em>原因</em>是我在Target-&gt;Build P...
Ubuntu 18.04编译Android8.1 automotive
<em>1</em>、Android8.<em>1</em>源码下载 清华大学AOSP镜像:https://mirrors.tuna.tsinghua.edu.cn/help/AOSP/ (<em>1</em>)repo下载 git clone https://aosp.tuna.tsinghua.edu.cn/git-repo/ chmod a+x git-repo/repo   添加repo(路径目录如:~/git-repo/repo)...
Permission denied Command PhaseScriptExecution failed with a nonzero exit code
x<em>code</em> 编译遇到这样的情况 :Permission denied Command PhaseScriptExecution <em>failed</em> with a nonzero <em>exit</em> <em>code</em>一些老项目的 pods 时,会出现编译失败的会出现,尝试手动清理总是不彻底,一个有效的解决方式是安装 pods 清理工具,然后cd到项目,清理项目<em>中</em> pods 的关联后,再重新pod install安装清...
Xcode 10.0版本安装软件到手机上报错:Command CodeSign failed with a nonzero exit code.
转载:https://stackoverflow.com/questions/5<em>1</em>644349/error-<em>command</em>-<em>code</em>sign-<em>failed</em>-with-a-nonzero-<em>exit</em>-<em>code</em>-after-installing-x<em>code</em><em>1</em>0  Product -&amp;gt; Clean Build Folder. 重启电脑  
iOS开发记录(持续更新)
<em>问题</em>及解决办法 <em>问题</em>描述:编译错误 fatal error: lipo: can’t open input file: /Users/username/DerivedData/AppName/Build/Products/Debug-iphonesimulator/xxx.framework/xxx(No such file or directory)fatal error: lipo: ca...
使用android studio引用第三方库.so时,出现错误:error: linker command failed with exit code 1 (u
错误:error: <em>linker</em> <em>command</em> <em>failed</em> with <em>exit</em> <em>code</em> <em>1</em> (use -v to see invocation) 我已经使用过jniLibs导入的方法,不管用,还
Xcode 11 beta 4 error: Command CompileSwiftSources failed with a nonzero exit code
X<em>code</em><em>1</em><em>1</em> beat编译swift代码报错<em>问题</em> &lt;unknown&gt;:0: error: unknown argument: '-w' &lt;unknown&gt;:0: error: unknown argument: '-Xanalyzer' &lt;unknown&gt;:0: error: unknown argument: '-analyzer-disable-all-c...
iPhone5上真机测试问题: Showing Recent Issues clang: error: linker command failed with exit code 1
error: Invalid bit<em>code</em> signatureclang: error: <em>linker</em> <em>command</em> <em>failed</em> with <em>exit</em> <em>code</em> <em>1</em> (use -v to see invocation)biubiu~在iPhone5上跑项目,bang(๑•̀ㅂ•́)و✧····啥子鬼?跑不起来?然后看错误信息,显示这样:是的,第一反应那就是Bit<em>code</em>的设置<em>问题</em>了哦,跑去Bu...
编译Android 8.1源码出错
PLATFORM_VERSION_CODENAME=REL PLATFORM_VERSION=8.<em>1</em>.0 TARGET_PRODUCT=aosp_arm64 TARGET_BUILD_VARIANT=
(整理汇总)编译出现错误:linker command failed with exit code 1 (use -v to see invocation)
总结一下这个可能存在的<em>原因</em>: <em>1</em>、工程<em>中</em>文件名重复、重复引入头文件(用 cocoapods 的时候有可能造成重复); 2、.a 文件重复或者缺失(用 SVN 时候有可能导致缺失); 3、Other Linker Flags 下的属性改为 -all_load (或者下边的属性都删除);(在TARGETS --&amp;gt; Build Setting --&amp;gt; Other Linker Flags) ...
clang++.exe: error: linker command failed with exit code 1 错误解决方法
clang++.exe: error: <em>linker</em> <em>command</em> <em>failed</em> with <em>exit</em> <em>code</em> <em>1</em> 错误解决方法 错误信息如下: Build <em>command</em> <em>failed</em>. Error while executing process D:\sdk\cmake\3.6.4<em>1</em><em>1</em><em>1</em>459\bin\cmake.exe with arguments {--build D:\master\a...
iOS出现(linker command failed with exit code 1)错误总结
第三方库报错开发<em>中</em>难免需要导入第三方库,导库之后编译报错:Undefined symbols for architecture armv7: "_OBJC_CLASS_$_MyPageLogViewController", referenced from: objc-class-ref in BaiduMobStatAppDelegate.o ld: symbol(s)
iOS之错误-linker command failed with exit code 1-解决
Build Settings =&amp;gt; Enable Bit<em>code</em> =&amp;gt; No  
linker command failed with exit code 1 (use -v to see invocation)问题
#include #include "st.h" #include "st<em>1</em>.h" int main(int argc, const char * argv) { //初始化 se
Unity 发布IOS /clang:-1: linker command failed with exit code 1 (use -v to see invocation)
发布<em>IOS</em>遇到了/clang:-<em>1</em>: <em>linker</em> <em>command</em> <em>failed</em> with <em>exit</em> <em>code</em> <em>1</em> (use -v to see invocation)<em>问题</em> 相关链接: https://www.jianshu.com/p/03aec7c4867d http://www.cnblogs.com/xsyl/p/6085844.html 最后解决方案 <em>1</em>. ”Build ...
【REACT NATIVE 系列教程之十】真机运行报错COMMAND /BIN/SH FAILED WITH EXIT CODE 1 的解决方法
本站文章均为 李华明Himi 原创,转载务必在明显处注明: 转载自【黑米GameDev街区】 原文链接: http://www.himigame.com/react-native/23<em>1</em>5.htmlHimi最近在真机运行遇到  Command /bin/sh <em>failed</em> with <em>exit</em> <em>code</em> <em>1</em>  的错误, 模拟器运行没有任何<em>问题</em>。此<em>问题</em>已解决,这里分享下解决方案。先来看下错误日志,如下
iOS报错:linker command failed with exit code 1 (use -v to see invocation)寻找答案之旅
iOS报错:<em>linker</em> <em>command</em> <em>failed</em> with <em>exit</em> <em>code</em> <em>1</em> (use -v to see invocation错误出现<em>问题</em>分析最终解决方案 错误出现 Android开发程序员,接手了公司的iOS项目,接入了微信登录,本来运行的好好的,后来检查的时候看到微信接入官网说要注意是不是微信的最新版本,不是的话要更新,就使用cocodpod更新了一下,然后就再也编译不了了。。。...
ios --- Xcode出现( linker command failed with exit code 1)错误总结
项目可以在模拟器上正常运行,但是导入手机就会发生clang: error: <em>linker</em> <em>command</em> <em>failed</em> with <em>exit</em> <em>code</em> <em>1</em> (use -v to see invocation)解决办法:在Build Setting 搜索bit<em>code</em> 设置为NO就可以啦!而且大部分开发者都被这个突如其来的bit<em>code</em>功能给坑过导致项目编译失败,而这些因为bit<em>code</em>而编译失败的的...
Error:error: linker command failed with exit code 1 (use -v to see invocation)
错误:Error:error: <em>linker</em> <em>command</em> <em>failed</em> with <em>exit</em> <em>code</em> <em>1</em> (use -v to see invocation)Gradle Console 编译信息:E:/AndroidStudioProjects/FaceDetectToSvr<em>1</em>3<em>1</em>/app/src/main/jni/libFiFacial.a: error adding symbols: Fi
iOS引入第三发库引发的错误linker command failed with exit code 1
一、引入静态库导致的编译错误 错误一:在之前添加过某个库,之后删除再添加时如果引发如下错误 "_OBJC_CLASS_$_XXXXXXXX", referenced from:        可能是导入的第三方库导致,尝试将other <em>linker</em> flags 的参数设置为-Objc 补充:other Linker flags 参数说明 Targets选项下有Other <em>linker</em> f
JNI运行Error:error: linker command failed with exit code 1 (use -v to see invocation)解决
在进行jni开发的时候可能会遇到的错误 Error:error: <em>linker</em> <em>command</em> <em>failed</em> with <em>exit</em> <em>code</em> <em>1</em> (use -v to see invocation),的可能解决办法
linker command failed with exit code 1 (错误总结)
<em>1</em>. 把CGRectMake 写成CGRectScaleMake 报错如下图: 根据报错提示,<em>问题</em>出现在“CGRectScaleMake”,自己哪里用到这个了呢?全局搜索,发现自己太粗心大意了: 最后把“CGRectScaleMake”改为“CGRectMake”重新编译即可! 2. 重复文件 报错如下图: 根据报错提示,...
iOS error: linker command failed with exit code 1 解决方法
错误如下: ld: library not found for -lXXX clang: error: <em>linker</em> <em>command</em> <em>failed</em> with <em>exit</em> <em>code</em> <em>1</em> (use -v to see invocati 当我们引用静态库等的时候,没有配置Library Search Paths导致报错 解决方法: Build Settings — Library Search ...
基于MAC Android 8.1源码下载编译阅读
      学Android也有比较长的一段时间了,但是对于android源码的认识自己总感觉似懂非懂,因为自己也仔细看过相关的书籍、对于遇到过的一些<em>问题</em>也分析过源码,但还是觉得对于Android底层代码的实现存在一只半解,很多时候都处于代码开发、遇到<em>问题</em>再去谷歌百度的状态,没有对Android有个相对细节性的系统整体认识,所以这就需要以后在学习的过程<em>中</em>加强源码阅读和理解。基于目前大多数看源代码都...
添加第三方类库造成的linker command failed with exit code 1 (use -v to see invocation)的错误调试
添加第三方类库造成的<em>linker</em> <em>command</em> <em>failed</em> with <em>exit</em> <em>code</em> <em>1</em> (use -v to see invocation)的错误<em>调试</em> 分类: 菜鸟学iOS的笔记20<em>1</em>2-<em>1</em>2-06 <em>1</em>6:03 8907人阅读 评论(4) 收藏 举报         <em>linker</em> <em>command</em> <em>failed</em> with <em>exit</em> <em>code</em> <em>1</em> (use
command codesign failed with a nonzero exit code
X<em>code</em> 编译报 <em>command</em> <em>code</em>sign <em>failed</em> with a nonzero <em>exit</em> <em>code</em> 蛋疼的一批,找了很久都没解决。 后来把x<em>code</em>(<em>command</em> + k ) clean 一下,然后电脑重启,就可以正常运行了。。。。 后来发现是自己换证书时,电脑缓存的<em>原因</em> ...
编译出错 ninja: build stopped: subcommand failed Android 源码编译
标签:ulimit -c unlimited 、core文件、Jack、JACK_SERVER_VM_ARGUMENTS错误:ninja: build stopped: sub<em>command</em> <em>failed</em>.办法一:按照提示:ulimit -c unlimited该命令的详细解释参考:https://www.cnblogs.com/qq78292959/archive/20<em>1</em>2/05/08/2490...
error: command 'x86_64-linux-gnu-gcc' failed with exit status 1
bug error: <em>command</em> 'x86_64-linux-gnu-gcc' <em>failed</em> with <em>exit</em> status <em>1</em> #include "Python.h" ^~~~~~~~~~ compilation terminated. error: <em>command</em> 'x86_64-linux-gnu-gcc' <em>failed</em> with ...
pyOpenssl-0.14 安装 报错 command 'gcc' failed with exit status 1
系统 redhat 6 编译安装 pyOpenSSL-0.<em>1</em>4 # python setup.py install 报错如下: 看最后的红色标注 ……………… 字符限制 省略一些内容 removing
Custom action GenerateSSLKey failed: Command terminated with non-zero exit code.
安装VisualSVN-Server的时候next提示:  Custom action GenerateSSLKey  <em>failed</em>: Command terminated with non-zero <em>exit</em> <em>code</em>. 解决:在安装的时候有一选项 use secure connection(https://) 它默认是选<em>中</em>画勾的,我们将其不选,又或者不要更改安装路径(可以切换哪个盘,不要放...
bug笔记
做current contact的时候呢,忘记了给自己手机号码充值话费是不需要add到current contact,导致在 PGContactItem *item = [NSKeyedUnarchiver unarchiveObjectWithData:recentTransferList[i]]; 这句代码解码失败!!因为自己本身的号码我是没有做过 ContactItem这个类的操作的,自...
Android :clang.exe: error: linker command failed with exit code 1 (use -v to see invocation)
  今天在使用Android Studio3.0.<em>1</em> ,升级了build:gradle 后,编译项目报错:clang.exe: error: <em>linker</em> <em>command</em> <em>failed</em> with <em>exit</em> <em>code</em> <em>1</em> (use -v to see invocation)      ninja:build stopped:sub<em>command</em> <em>failed</em>. FAILURE: Build f...
swift项目从swift1.2升级到2.0,报错 swiftc failed with exit code 1
在解决了一大堆语法错误后,最后报 Command /Applications/X<em>code</em>-beta.app/Contents/Developer/Toolchains/X<em>code</em>Default.xct
xcode报错Command CodeSign failed with a nonzero exit code解决方案
Command CodeSign <em>failed</em> with a nonzero <em>exit</em> <em>code</em>解决方案<em>1</em>解决方案2 解决方案<em>1</em> <em>command</em> + k 重启电脑 解决方案2 查看x<em>code</em><em>中</em>图片资源是否将扩展名显示出来,如果未显示扩展名会导致方案<em>1</em>处理失败 ...
编译lineage-15源码报错,求大神支招
-
编译错误-build stopped: subcommand failed. 解决方法
make[<em>1</em>]: Leaving directory `/home/sunhz/sl854<em>1</em>e/out/target/product/sp854<em>1</em>e_srvm/obj/u-boot<em>1</em>5' make: Leaving directory `/home/sunhz/sl854<em>1</em>e/u-boot<em>1</em>5' [ 82% 3<em>1</em>07/3782] Build hyb out/target/product/sp85...
svn服务器搭建和使用:Custom action GenerateSSLKey failed: Command terminated with non-zero exit code
LanguagePack——简体<em>中</em>文语言包 TortoiseSVN——客户端安装包  VisualSVN-Server或者subversion作为服务器版本控制工具  安装VisualSVN-Server的时候next提示: Custom action GenerateSSLKey  <em>failed</em>: Command terminated with non-zero exi
Xcode出现( linker command failed with exit code 1)错误解决方法汇总
大部分的这在篇博客<em>中</em>有写到,http://www.cnblogs.com/DengfengZhang/p/5628024.html但我遇到的错误还不是这些<em>原因</em>,我显示的是 一个GetCurrentLanguage方法X<em>code</em>找不到Symbol, 然后出的Linker错误。后来发现其实是这个方法,有原来Unity工程<em>中</em>定义为static的方法,在iOS平台用,但只有定义,并没有实现,因而使用Xco...
unity接ios的sdk的一些坑
其实我是做unity的,没有接触过<em>IOS</em>,第一次接ISO的sdk,难免遇到很多操作<em>问题</em>。下面分享一些还记得的解决方法的错误! 接sdk之前看了一下菜鸟教程的OC !感觉只是皮毛。 坑<em>1</em>(lib找不到): 错误ld: library not found for -liPhone-lib clang: error: <em>linker</em> <em>command</em> <em>failed</em> with <em>exit</em> cod
IOS-SDK接入常见问题汇总
 directory not found for option '-L&quot;/Users/wanqu/Desktop/Quick64/Libraries&quot;directory not found for option '-L&quot;/Users/wanqu/Desktop/Quick64/Libraries&quot; <em>1</em> 选择工程, 编译的 (targets) 2 选择 Build Settings 菜单 3 查找 ...
【centos】 error: command 'gcc' failed with exit status 1
yum install gcc libffi-devel python-devel openssl-devel
xcode 真机编译codesign failed with exit code 1错误 解决
这种错误出现目前我看到过一下几种。 <em>1</em>.证书的目录在登录和系统<em>中</em>都有而且同名,这样x<em>code</em>就找不到所要的证书,解决办法删除同名。 2.证书删除错误重装证书后依然不能编译(这个就是我目前遇到悲催的<em>问题</em>),第一次证书删除错误后keychain继续安装还是错误。 最后终于找到办法,要清除证书初始设置然后重新安装。               x<em>code</em>错误:/Use
出现( linker command failed with exit code 1)错误总结汇总
上半部分原文地址: http://blog.csdn.net/hengshujiyi/article/details/2<em>1</em><em>1</em>828<em>1</em>3 这种<em>问题</em>,通常出现在添加第三方库文件或者多人开发时。 这种<em>问题</em>一般是找不到文件而导致的链接错误。 我们可以从如下几个方面着手排查。 <em>1</em>.以如下错误为例,如果是多人开发,你同步完成后发现出现如下的错误。
关于Command /usr/bin/codesign failed with exit code 1错误的解决办法
汇总一下我的解决过程供参考,欢迎指正和补充。 解决方案一:参考该博客:http://blog.sina.com.cn/s/blog_85c<em>1</em>f6a50<em>1</em>00zxz<em>1</em>.html 解决方案二:方案一<em>中</em>的步骤执行完成后不起作用,查看钥匙串<em>中</em>的证书是否有重复,如果有重复删除重复的证书,然后clean&bulid。如果还不行  选择“钥匙串”->>“登录”,“种类”->>“密钥",然
Ubuntu 编译报错 ninja: build stopped: subcommand failed.
报错信息如下: DroidDoc took 4 sec. to write docs to out/target/common/docs/apache-http-stubs-gen [ 48% <em>1</em>084<em>1</em>/225<em>1</em>2] Building with Jack:...http.legacy_intermediates/classes.jack FAILED: out/target/common/obj...
finished with non-zero exit value 2问题求助
-
iOS开发接入微信三方登录后报错duplicate symbols for architecture arm64 linker command failed with exit code 1
在对接微信三方登陆SDK时,在demo<em>中</em>没有任何<em>问题</em>,然而提供给游戏对接之后便出现了这个<em>问题</em> duplicate symbols for architecture arm64   <em>linker</em> <em>command</em> <em>failed</em> with <em>exit</em> <em>code</em> <em>1</em> 经验告诉我是libGCloundVoice.a和 libiphone-lib.a这两个库文件冲突<em>问题</em>,找遍整个工程也没见有重复<em>问题</em>。 ...
linker command failed with exit code 1 解决办法
x<em>code</em> 报 以下错误 <em>linker</em> <em>command</em> <em>failed</em> with <em>exit</em> <em>code</em> <em>1</em> 解决办法 PROJECT Build Settings Architectures Valid Architectures  他的值本来是 armv7 armv7s  (ios6.0下)  把armv7s 去掉即可 同样的操作 TARGETS   Build Set
clang: error: linker command failed with exit code 1 (use -v to see invocation) 无法定位的问题...
编译出现错误:<em>linker</em> <em>command</em> <em>failed</em> with <em>exit</em> <em>code</em> <em>1</em> 找到Build settings-&gt;Linking-&gt;Other Linker Flags,将此属性修改成-all_load同一个错误可能是很多<em>问题</em>造成的,回复的只是其<em>中</em>一种解决的可能,这种方案解决不了就是其他的<em>问题</em>,这是一个排除错误的过程。 转载于:https://www.cnblogs....
CocoaPods第三方库后编译时报错linker command failed with exit code 1 use -v to see invocation clang
MRC项目<em>中</em>使用CocoaPods安装第三方库后,编译时报错: <em>linker</em> <em>command</em> <em>failed</em> with <em>exit</em> <em>code</em> <em>1</em> use -v to see invocation clang 解决方案 在配置<em>中</em>Other Linker Flags添加属性$(inherited) 路径:TARGETS——Build Settings——Linking——Other Linker ...
Xcode报编译器报错: linker command failed with exit code 1(use -v to see invocation)
最近换了台新机子,搭环境,拉代码,X<em>code</em>编译时工程报警告 ld: warning: directory not found for option '-F/Applications/X<em>code</em>-beta.app/Contents/...' ld: warning: directory not found for option '-L/...' ld: library not found for -
error: command ‘gcc’ failed with exit status 1
error: <em>command</em> ‘gcc’ <em>failed</em> with <em>exit</em> status <em>1</em> 的解决办法 用pip安装软件或者编译python模块的时候提示:error: <em>command</em> ‘gcc’ <em>failed</em> with <em>exit</em> status <em>1</em> easy_install也提示一样的错误:error: Setup script <em>exit</em>ed with error: <em>command</em> ‘gcc
Command /usr/bin/codesign failed with exit code 1错误的解决办法
Mac OS还是会有抽风的情况,一分钟前用的好好的,下一分钟真机测试就签名出现未知错误,然鹅,你不会想到的是,只要重启电脑就行了,很操蛋,把我折腾的都不知道咋办了。当然,x<em>code</em>抽风起来,也可能会报错 Run custom shell script '[cp] embed pods frameworks',你不必要管这些,重启一下电脑基本都能好。...
ios添加第三方类库造成的linker command failed with exit code 1 (use -v to see invocation)的错误调试
这种<em>问题</em>,通常出现在添加第三方库文件或者多人开发时。 这种<em>问题</em>一般是找不到文件而导致的链接错误。 我们可以从如下几个方面着手排查。     一般这三方面的<em>问题</em>,如果不是哪你真可麻烦了 <em>1</em>.引用出错,把***.h弄成了.m,检查一下你的所有引用; 2.再就是你引用第三方的库,你添加文件是系统没有所第三方库的.m文件参入的编译<em>中</em>去,你向项目添加文件得注意了; 3.就是不小心添加的重复的类...
phpMyAdmin-3.3.2-all-languages.zip下载
phpMyAdmin-3.3.2-all-languages.zip 相关下载链接:[url=//download.csdn.net/download/zgbailebao/2358932?utm_source=bbsseo]//download.csdn.net/download/zgbailebao/2358932?utm_source=bbsseo[/url]
wzplayer for android NEON V1.6.0下载
wzplayer for android NEON版本,采用gles2.0视频渲染yuv数据,默认的视频是播放的是网络电视http高清数据流,不排除有些手机播放效果不太好,如果可以的话,大家可以修改播放地址。支持http,rtsp,mms等数据流,所以大家测试的时候修改一下进行测试.默认的网络播放地址可能失效,请大家用自己的地址进行测试. http://blog.csdn.net/weinyZhou 相关下载链接:[url=//download.csdn.net/download/weinyzhou/6508743?utm_source=bbsseo]//download.csdn.net/download/weinyzhou/6508743?utm_source=bbsseo[/url]
FusionCharts_XT_Personal下载
FusionCharts_XT_Personal 用钱买回来的,里面的图表比破解的要炫很多,现在共享给大家 相关下载链接:[url=//download.csdn.net/download/jacklei__/7005783?utm_source=bbsseo]//download.csdn.net/download/jacklei__/7005783?utm_source=bbsseo[/url]
相关热词 c# oracle 开发 c#选择字体大小的控件 c# usb 批量传输 c#10进制转8进制 c#转base64 c# 科学计算 c#下拉列表获取串口 c# 如何防止参数被修改 c#开发微信公众号例子 c# null
我们是很有底线的