使用Android Studio调试程序时候出现这个错误:Error:Execution failed for task ':app:clean'. [问题点数:40分]

Bbs1
本版专家分:0
结帖率 83.33%
Bbs1
本版专家分:0
Bbs1
本版专家分:0
Bbs1
本版专家分:0
Bbs1
本版专家分:0
Bbs4
本版专家分:1827
Bbs1
本版专家分:0
Bbs1
本版专家分:0
Bbs1
本版专家分:0
Bbs1
本版专家分:0
Bbs1
本版专家分:0
Bbs1
本版专家分:0
Bbs1
本版专家分:66
Bbs1
本版专家分:0
Bbs1
本版专家分:0
Bbs1
本版专家分:0
Bbs1
本版专家分:0
Bbs1
本版专家分:0
Blank
蓝花 2008年6月 硬件/嵌入开发大版内专家分月排行榜第三
Bbs4
本版专家分:1202
Bbs1
本版专家分:0
Bbs1
本版专家分:0
Bbs1
本版专家分:0
Bbs4
本版专家分:1707
app:clean"">Execution failed for task:"app:clean"
<em>这个</em><em>错误</em> 在<em>android</em> <em>studio</em> 中<em>clean</em>的<em>时候</em><em>出现</em>这种<em>错误</em> 只要关闭 Android <em>studio</em>  然后 在<em>app</em>文件中找到 build文件 删掉 重新启动就好了
android failed for task ':app:dexDebug'
我<em>使用</em>SVN更新了项目后<em>出现</em><em>这个</em><em>错误</em>,貌似是更新了包,我用的是V7包,别人用的是V4,怎么改可以正常运行呀?最好项目以后更新也不会<em>出现</em><em>这个</em>问题nError:Execution <em>failed</em> for <em>task</em> ':<em>app</em>:dexDebug'.n> com.<em>android</em>.ide.common.internal.LoggedErrorException: Failed to run command:n C:\Users\Administrator\AppData\Local\Android\sdk\build-tools\21.1.2\dx.bat --dex --no-optimize --output D:\<em>android</em>-<em>studio</em>\exercise\ex05\svn_<em>android</em>Stuido\<em>app</em>\build\intermediates\dex\debug --input-list=D:\<em>android</em>-<em>studio</em>\exercise\ex05\svn_<em>android</em>Stuido\<em>app</em>\build\intermediates\tmp\dex\debug\inputList.txtnError Code:n 2nOutput:n UNEXPECTED TOP-LEVEL EXCEPTION:n com.<em>android</em>.dex.DexException: Multiple dex files define L<em>android</em>/support/v4/accessibilityservice/AccessibilityServiceInfoCompatIcs;n at com.<em>android</em>.dx.merge.DexMerger.readSortableTypes(DexMerger.java:596)n at com.<em>android</em>.dx.merge.DexMerger.getSortedTypes(DexMerger.java:554)n at com.<em>android</em>.dx.merge.DexMerger.mergeClassDefs(DexMerger.java:535)n at com.<em>android</em>.dx.merge.DexMerger.mergeDexes(DexMerger.java:171)n at com.<em>android</em>.dx.merge.DexMerger.merge(DexMerger.java:189)n at com.<em>android</em>.dx.command.dexer.Main.mergeLibraryDexBuffers(Main.java:454)n at com.<em>android</em>.dx.command.dexer.Main.runMonoDex(Main.java:303)n at com.<em>android</em>.dx.command.dexer.Main.run(Main.java:246)n at com.<em>android</em>.dx.command.dexer.Main.main(Main.java:215)n at com.<em>android</em>.dx.command.Main.main(Main.java:106)
.9图导入到studio后报错:Error:Execution failed for task ':app:mergeDebugResources'
问题描述:更新项目中的.9图文件,只是单纯的替换掉旧的资源而已,导入后报错,如下图:rn[img=https://img-bbs.csdn.net/upload/201703/01/1488366960_826811.png][/img]rnrnError:java.util.concurrent.ExecutionException: com.<em>android</em>.ide.common.process.ProcessException:rnError:Execution <em>failed</em> for <em>task</em> ':<em>app</em>:mergeDebugResources'.rn> Error: java.util.concurrent.ExecutionException: com.<em>android</em>.ide.common.process.ProcessException: rnrn确定都是.9图,且没有重名,新换的图总共有18张,经过一次又一次蛋疼的尝试,过滤出5张会报<em>这个</em><em>错误</em>的.9图。。。
调试程序时候出现错误
调试aspx文件时<em>出现</em><em>这个</em><em>错误</em>是怎么回事,怎么解决啊rnrnServer Application Unavailable rnThe web <em>app</em>lication you are attempting to access on this web server is currently unavailable. Please hit the "Refresh" button in your web browser to retry your request. rnrnAdministrator Note: An <em>error</em> message detailing the cause of this specific request failure can be found in the <em>app</em>lication event log of the web server. Please review this log entry to discover what caused this <em>error</em> to occur. rn
生成Excel的时候出现Server execution failed
我也<em>出现</em><em>这个</em><em>错误</em>,rnServer <em>execution</em> <em>failed</em> rnDescription: An unhandled exception occurred during the <em>execution</em> of the current web request. Please review the stack trace for more information about the <em>error</em> and where it originated in the code. rnrnException Details: System.Runtime.InteropServices.COMException: Server <em>execution</em> <em>failed</em>rnSource Error: rnrnrnLine 561: Dim sTimes, eTimes As DateTimernLine 562: sTimes = DateTime.NowrnLine 563: Dim oExcel As New Excel.ApplicationrnLine 564: Dim oBooks As Excel.Workbooks, oBook As Excel.WorkbookrnLine 565: Dim oSheets As Excel.Sheets, oSheet As Excel.Worksheet, oSheet1 As Excel.Worksheetrn rnrnSource File: C:\Inetpub\wwwroot\PDS\stdchart\stdchart_show.aspx.vb Line: 563 rnrnStack Trace: rnrnrn[COMException (0x80080005): Server <em>execution</em> <em>failed</em>]rn pds.stdchart_show_aspx.genExcel() in C:\Inetpub\wwwroot\PDS\stdchart\stdchart_show.aspx.vb:563rn pds.stdchart_show_aspx.Page_Load(Object sender, EventArgs e) in C:\Inetpub\wwwroot\PDS\stdchart\stdchart_show.aspx.vb:277rn System.Web.UI.Control.OnLoad(EventArgs e) +67rn System.Web.UI.Control.LoadRecursive() +35rn System.Web.UI.Page.ProcessRequestMain() +750rn rn你找到解决方法没有,我的是生成Excel的<em>时候</em>出错,但是刷新一下页面又可以了,<em>这个</em><em>错误</em>是生成Excel的<em>时候</em>发生的,生成5次的话大概会有1次<em>出现</em><em>这个</em>错
AndriodStudio更新到3.0后出现Error:Execution failed for task ':app:processDebugResource
如图,AndroidStudio更新到3.0后,先是<em>出现</em>了<em>这个</em>问题[img=https://img-bbs.csdn.net/upload/201711/11/1510397763_929332.png][/img]rn然后,我在gradle.properties文件中添加<em>android</em>.enableAapt2=false之后,<em>这个</em>问题没有了,但是又<em>出现</em>了<em>这个</em>问题[img=https://img-bbs.csdn.net/upload/201711/11/1510398014_651134.png][/img]rn小白求助啊,急急急!!!!!求大神帮帮忙
Error:Execution failed for task ':app:clean'. > Unable to delete directory: E:\Work\Testjni\app\buil
解决方法一:       进入File> Settings> Build,Execution,Deployment> Instant Run >取消选择(Enable Instant Run to hot swap code) 解决方法二:   打开下面的Terminal 输入gradlew <em>clean</em>:   解决方法三:   关掉 Android <em>studio</em> ,
Error: Execution failed for task ':app:clean'. Unable to delete file问题解决
Error:Execution <em>failed</em> for <em>task</em> ':<em>app</em>:packageDebug'. > Failed to create 'D:\andriod\RunJ\<em>app</em>\build\outputs\apk\<em>app</em>-debug-unaligned.apks': 拒绝访问。 Error: Execution <em>failed</em> for <em>task</em> ':<em>app</em>:<em>clean</em>'. Unable
新版as出现failed for task ':app:clean'.xxxxxx的问题
<em>failed</em> for <em>task</em> ':<em>app</em>:<em>clean</em>'. > A problem occurred starting process 'command 'cmd'' <em>failed</em> for <em>task</em> ':<em>app</em>:<em>clean</em>'. > Unable to delete file: xxx 。。。。。。。 这些提示是因为开启了instant run,但是某些移动硬盘可能不支持insta
Error:Execution failed for task':app:externalNativeBuildCleanDebug'
Error:Execution <em>failed</em> for <em>task</em>’:<em>app</em>:externalNativeBuildCleanDebug’. A problem occurred starting process ‘command ‘ C:\Users\W\AppData\Local\Android\sdk\cmake\3.6.3155560\bin\cmake.exe”这种<em>错误</em>是倒入项目里有jni
Error:Execution failed for task ':app:clean'. > Unable to delete directory 终极解决方案
Information:Gradle <em>task</em>s [:<em>app</em>:<em>clean</em>, :<em>app</em>:generateDebugSources, :<em>app</em>:generateDebugAndroidTestSources, :<em>app</em>:mockableAndroidJar, :<em>app</em>:prepareDebugUnitTestDependencies, :<em>app</em>:assembleDebug] :<em>app</em>:<em>clean</em> FA
AS无法运行项目 Error:Execution failed for task ':a
请问这是什么<em>错误</em>?我该如何解决?在线等,急求!!!nError:Execution <em>failed</em> for <em>task</em> ':<em>app</em>:buildInfoDebugLoader'.n> Exception while doing past iteration backup : Source C:\Users\gowcage\Desktop\tenrice\<em>app</em>\build\intermediates\builds\debug\213761980037880\classes.dex and destination C:\Users\gowcage\Desktop\tenrice\<em>app</em>\build\intermediates\builds\debug\213761980037880\classes.dex must be different
Eclipse导入项目出错Execution failed for task
第一次弄<em>android</em>的东西,是一个哥们儿用Eclipse做的,导入as过后编译的<em>时候</em>报错rn[img=https://img-bbs.csdn.net/upload/201707/10/1499652287_649589.png][/img]rn按照网上的解决方案弄了一下,<em>错误</em>依旧rn[url=http://www.2cto.com/kf/201601/487909.html][/url]rnAndroid Studio版本2.3.3
android clean出现错误
n项目没有问题,项目用过引用过了4个库, 求解???nnnErrors occurred during the build.nErrors running builder 'Android Package Builder' on project '<em>android</em>-support-v7-<em>app</em>compat'.nProblems encountered while deleting resources.nCould not delete 'D:\workspace\<em>android</em>-support-v7-<em>app</em>compat\bin\<em>android</em>-support-v7-<em>app</em>compat.jar'.nProblems encountered while deleting files.nCould not delete: D:\workspace\<em>android</em>-support-v7-<em>app</em>compat\bin\<em>android</em>-support-v7-<em>app</em>compat.jar.nProblems encountered while deleting resources.nCould not delete 'D:\workspace\<em>android</em>-support-v7-<em>app</em>compat\bin\<em>android</em>-support-v7-<em>app</em>compat.jar'.nProblems encountered while deleting files.nCould not delete: D:\workspace\<em>android</em>-support-v7-<em>app</em>compat\bin\<em>android</em>-support-v7-<em>app</em>compat.jar.nErrors running builder 'Android Package Builder' on project 'cardview'.nProblems encountered while deleting resources.nCould not delete 'D:\workspace\cardview\bin\cardview.jar'.nProblems encountered while deleting files.nCould not delete: D:\workspace\cardview\bin\cardview.jar.nProblems encountered while deleting resources.nCould not delete 'D:\workspace\cardview\bin\cardview.jar'.nProblems encountered while deleting files.nCould not delete: D:\workspace\cardview\bin\cardview.jar.nErrors running builder 'Android Package Builder' on project 'design'.nProblems encountered while deleting resources.nCould not delete 'D:\novabd\design\bin\design.jar'.nProblems encountered while deleting files.nCould not delete: D:\novabd\design\bin\design.jar.nProblems encountered while deleting resources.nCould not delete 'D:\novabd\design\bin\design.jar'.nProblems encountered while deleting files.nCould not delete: D:\novabd\design\bin\design.jar.nErrors running builder 'Android Package Builder' on project 'percent'.nProblems encountered while deleting resources.nCould not delete 'D:\novabd\percent\bin\percent.jar'.nProblems encountered while deleting files.nCould not delete: D:\novabd\percent\bin\percent.jar.nProblems encountered while deleting resources.nCould not delete 'D:\novabd\percent\bin\percent.jar'.nProblems encountered while deleting files.nCould not delete: D:\novabd\percent\bin\percent.jar.
新手请大神解答,救命啊 Error:Execution failed for task ':app:transformClassesWithDexForDeb
Error:Execution <em>failed</em> for <em>task</em> ':<em>app</em>:transformClassesWithDexForDebug'.rn> com.<em>android</em>.build.api.transform.TransformException: com.<em>android</em>.ide.common.process.ProcessException: java.util.concurrent.ExecutionException: com.<em>android</em>.dex.DexException: Multiple dex files define L<em>android</em>/support/v4/accessibilityservice/AccessibilityServiceInfoCompat$AccessibilityServiceInfoVersionImpl;rn用到的jar包:rn<em>android</em>-support-v4.jarrnxUtils-2.6.14.jarrnrn看不懂这一大堆的<em>error</em>想表达什么啊?[img=https://forum.csdn.net/PointForum/ui/scripts/csdn/Plugin/001/face/32.gif][/img]rnrn
有谁遇到过这种问题吗,Error:Execution failed for task ':app:transformClassesWithDexForDebug
Error:Execution <em>failed</em> for <em>task</em> ':<em>app</em>:transformClassesWithDexForDebug'.rn> com.<em>android</em>.build.api.transform.TransformException: java.lang.RuntimeException: com.<em>android</em>.ide.common.process.ProcessException: java.util.concurrent.ExecutionException: com.<em>android</em>.ide.common.process.ProcessException: org.gradle.process.internal.ExecException: Process 'command 'C:\Program Files\Java\jdk1.7.0_67\bin\java.exe'' finished with non-zero exit value 1rn报<em>这个</em><em>错误</em>,连编译都没过,<em>这个</em>要怎么弄啊
(记录学习android遇到的问题)Error:Execution failed for task ':app:packageDebug'. > Failed to create
今天遇到<em>这个</em>问题 Error:Execution <em>failed</em> for <em>task</em> ':<em>app</em>:packageDebug'.> Failed to create '项目路径\build\outputs\apk\<em>app</em>-debug-unaligned.apks': 拒绝访问。Clear 没问题,然后ReBuild显示出Error:Execution <em>failed</em> for <em>task</em> ':<em>app</em>:clea
Android Studio;Gradle:unable to delete file
-
Error:Execution failed for task ':app:clean'. > Unable to delete directory:
<em>这个</em>问题有<em>时候</em>会成为一个非常难以解决的问题,不管你尝试什么办法,你会发现build没事,但是run确不正常。<em>这个</em>其实是as的bug,你还是暂时关闭instant run功能吧,在file-setting-Biuld里面。这样或许<em>这个</em>问题就解决了。 如果不是由于<em>这个</em>原因导致的,那么可以更改下gradle版本,插件版本,这些试试。
Error:Execution failed for task ':clean'. > Unable to delete directory :\build\intermediates
Error:Execution <em>failed</em> for <em>task</em> ':<em>clean</em>'. &amp;gt; Unable to delete directory  :\build\intermediates 我用的是Android <em>studio</em>,之前就一直碰到<em>这个</em>问题,用的一种笨方法,就是重启电脑,一般就可以运行程序了。但是这样太麻烦了。今日又重新查找,在这里http://stackoverflow.com/...
Error:Execution failed for task ':app:clean'. > Unable to delete directory: 最新解决方法
最近在一个新的项目BUILD过程中遇到了<em>这个</em>问题 Error:Execution <em>failed</em> for <em>task</em> ‘:<em>app</em>:<em>clean</em>’. Unable to delete directory:** 我的<em>studio</em>是2.3.3之前我也遇到过类似问题 之前的解决方法是在<em>app</em>:build文件中加入了 <em>task</em> <em>clean</em>(type: Delete) { dele
编译执行项目的时候出现Execution failed with error code 1错误,何解?
问题:rn 写好项目的代码后,编译运行,无法运行,提示如下<em>错误</em>:rn[color=#FF0000] run:rn Starting emulator in <em>execution</em> modern D:\projects\Game_SuppressKeyEvents\nbproject\build-impl.xml:295: Execution <em>failed</em> with <em>error</em> code 1.[/color]rn 然后我找到build-impl.xml:295的代码如下:rn rn [color=#FF0000][/color]rn rn 我估计是路径问题,但是又不知从何处入手排错,请有此经验的朋友赐教,谢谢!rn rn另附背景:rn 之前我卸载了机子上的JDK,重装到了另外一个盘,然后Netbeans无法启动,但是我修改了Netbeans的配置文件后,可以启动了,只是就<em>出现</em>了现在<em>这个</em>问题--不单是我<em>这个</em>项目如此,我尝试启动运行其他的以前可以运行的项目,也会<em>出现</em>这样的<em>错误</em>。
Execution failed with error code 1. 问题
[size=12px]本人初学J2ME,从sun官网下载了个Netbeans6.91和JDK,JDK已配置好环境变量并无<em>错误</em>!但用Netbeans6.91生成一个J2ME的项目试运行,就<em>出现</em><em>这个</em><em>错误</em>,麻烦高手指点下。[/size]rnrn具体<em>错误</em>信息:rn[color=#FF0000]Copying 1 file to C:\Users\sf\Documents\NetBeansProjects\MobileApplication1\dist\nbrun4595314924359565417rnCopying 1 file to C:\Users\sf\Documents\NetBeansProjects\MobileApplication1\dist\nbrun4595314924359565417rnJad URL for OTA <em>execution</em>: http://localhost:8082/servlet/org.netbeans.modules.mobility.project.jam.JAMServlet/C%3A/Users/sf/Documents/NetBeansProjects/MobileApplication1/dist//MobileApplication1.jadrnStarting emulator in <em>execution</em> modernC:\Users\sf\Documents\NetBeansProjects\MobileApplication1\nbproject\build-impl.xml:898: Execution <em>failed</em> with <em>error</em> code 1.rn生成失败(总时间:8 秒)[/color]rnrn提示的<em>错误</em>行:rn
android studio 编译的时候出现错误和解决方法
遇到一个添加一个 1、<em>android</em>()方法找不到了  Gradle sync <em>failed</em>: Gradle DSL method not found: '<em>android</em>()' 解决方法:删掉<em>android</em>()方法,原因好像是新版的gradle中没有<em>这个</em>方法了 2、Error:Module 'com.github.lecho:hellocharts-library:
android studio run的时候出现空指针错误
Error:Execution <em>failed</em> for <em>task</em> ':Disentanglement:transformNative_libsWithStripDebugSymbolForDebug'.rn> java.lang.NullPointerException (no <em>error</em> message)rnrnrn以上是<em>错误</em>信息,这是什么情况...
编译项目时出现应该有伪属性名 Error:Execution failed for task
Error:Execution <em>failed</em> for <em>task</em> ':<em>app</em>:dataBindingProcessLayoutsBaiduDebug'.&amp;gt; org.xml.sax.SAXParseException; systemId: file:/F:/workspace/fula-<em>android</em>2/<em>app</em>/build/intermediates/res/merged/baidu/debug...
Error:Execution failed for task ':clockLib:clean'. > Unable to delete directory: E:\androidProject\r
Error:Execution <em>failed</em> for <em>task</em> ':clockLib:<em>clean</em>'. > Unable to delete directory: E:\<em>android</em>Project\robot\atieRobot\clockLib\build\generated\res\pngs\debug\drawable-ldpi 我用的是Android <em>studio</em> 2.3.3,
Error:Execution failed for task ':app:clean'. > Unable to delete directory: /media/file/workspaces/a
<em>android</em><em>studio</em>爆出 Error:Execution <em>failed</em> for <em>task</em> ‘:<em>app</em>:<em>clean</em>’. > Unable to delete directory:/media/file/workspaces/<em>android</em>/MyApplication2/<em>app</em>/build/intermediates/exploded-aar/com.<em>android</em>.support/<em>app</em>c
Error:Execution failed for task ':app:clean'. > Unable to delete directory: C:\Users\hasee\Desktop\B
大家早上好,早上就遇到问题就遇到Error:Execution <em>failed</em> for <em>task</em> ':<em>app</em>:<em>clean</em>'. > Unable to delete directory: C:\Users\hasee\Desktop\BeeKnightUser\<em>app</em>\build\intermediates\exploded-aar\com.<em>android</em>.support\transition\25
Execution failed for task ':app:clean' Unable to delete directory: ..\app\build\outputs\apk
Execution <em>failed</em> for <em>task</em> ':<em>app</em>:<em>clean</em>' Unable to delete directory: ..\<em>app</em>\build\outputs\apk 现在谷歌已经发布Android Studio 2.0 正式版,gradle也升级到了2.0.0正式版。但是从上周开始,在开发中就一直遇到<em>这个</em>问题。<em>错误</em>是无法删除之前打包的apk,网上有很多解决办法(包括强制删除,文件粉碎)但是试了很多都没用。每次都只有重启电脑才可以,严重影响了开发效率。我不确定这是不是Android stud
Gradle task异常:Unable to delete directory:||Unable to create ...
e.g. Error:Execution <em>failed</em> for <em>task</em> ':<em>app</em>:<em>clean</em>'. > Unable to delete directory: E:\workplace\$$$$\code\<em>app</em>\build\outputs\apk\release 极大可能:该文件被其他进程占用,例如金山毒霸中某些功能 解决方案:把怀疑进程停止并重启PC 2018/02/06 今天发
android studio出现错误
新手上路,求大神指教n应该怎样修改![图片说明](http://forum.csdn.net/PointForum/ui/scripts/csdn/Plugin/001/face/1.gif),下图有<em>错误</em>的那个地方,n搞了很久都没搞好,帮帮忙!!!![图片](https://img-ask.csdn.net/upload/201703/03/1488470523_843570.jpg)
Android Studio 出现错误
![图片说明](https://img-ask.csdn.net/upload/201510/09/1444352584_996428.png)Error:<em>failed</em> to find Build Tools revision 19.1.0
Android Studio Cmake时链接出现错误 Error:error: linker command failed with exit code 1
Execution <em>failed</em> for <em>task</em> ':mylibrary:externalNativeBuildDebug'.rn> Build command <em>failed</em>.rn Error while executing process C:\Users\HC\AppData\Local\Android\Sdk\cmake\3.6.4111459\bin\cmake.exe with arguments --build E:\RSDownload_W\ArrDemo2\mylibrary\.externalNativeBuild\cmake\debug\arm64-v8a --target mylibraryrn [1/2] Building CXX object CMakeFiles/mylibrary.dir/src/main/jni/XJni.cpp.orn [2/2] Linking CXX shared library ..\..\..\..\build\intermediates\cmake\debug\obj\arm64-v8a\libmylibrary.sorn FAILED: cmd.exe /C "cd . && C:\Users\HC\AppData\Local\Android\Sdk\<em>android</em>-ndk-r14b\toolchains\llvm\prebuilt\windows-x86_64\bin\clang++.exe --target=aarch64-none-linux-<em>android</em> --gcc-toolchain=C:/Users/HC/AppData/Local/Android/Sdk/<em>android</em>-ndk-r14b/toolchains/aarch64-linux-<em>android</em>-4.9/prebuilt/windows-x86_64 --sysroot=C:/Users/HC/AppData/Local/Android/Sdk/<em>android</em>-ndk-r14b/platforms/<em>android</em>-21/arch-arm64 -fPIC -g -DANDROID -ffunction-sections -funwind-tables -fstack-protector-strong -no-canonical-prefixes -Wa,--noexecstack -Wformat -W<em>error</em>=format-security -g -DANDROID -ffunction-sections -funwind-tables -fstack-protector-strong -no-canonical-prefixes -Wa,--noexecstack -Wformat -W<em>error</em>=format-security -O0 -fno-limit-debug-info -O0 -fno-limit-debug-info -Wl,--build-id -Wl,--warn-shared-textrel -Wl,--fatal-warnings -Wl,--no-undefined -Wl,-z,noexecstack -Qunused-arguments -Wl,-z,relro -Wl,-z,now -Wl,--build-id -Wl,--warn-shared-textrel -Wl,--fatal-warnings -Wl,--no-undefined -Wl,-z,noexecstack -Qunused-arguments -Wl,-z,relro -Wl,-z,now -shared -Wl,-soname,libmylibrary.so -o ..\..\..\..\build\intermediates\cmake\debug\obj\arm64-v8a\libmylibrary.so CMakeFiles/mylibrary.dir/src/main/jni/XJni.cpp.o -llog -llog -lutil -linertial -losal -lprotocals -lm "C:/Users/HC/AppData/Local/Android/Sdk/<em>android</em>-ndk-r14b/sources/cxx-stl/gnu-libstdc++/4.9/libs/arm64-v8a/libgnustl_static.a" && cd ."rn C:/Users/HC/AppData/Local/Android/Sdk/<em>android</em>-ndk-r14b/toolchains/aarch64-linux-<em>android</em>-4.9/prebuilt/windows-x86_64/lib/gcc/aarch64-linux-<em>android</em>/4.9.x/../../../../aarch64-linux-<em>android</em>/bin\ld: cannot find -lutilrn C:/Users/HC/AppData/Local/Android/Sdk/<em>android</em>-ndk-r14b/toolchains/aarch64-linux-<em>android</em>-4.9/prebuilt/windows-x86_64/lib/gcc/aarch64-linux-<em>android</em>/4.9.x/../../../../aarch64-linux-<em>android</em>/bin\ld: cannot find -linertialrn C:/Users/HC/AppData/Local/Android/Sdk/<em>android</em>-ndk-r14b/toolchains/aarch64-linux-<em>android</em>-4.9/prebuilt/windows-x86_64/lib/gcc/aarch64-linux-<em>android</em>/4.9.x/../../../../aarch64-linux-<em>android</em>/bin\ld: cannot find -losalrn C:/Users/HC/AppData/Local/Android/Sdk/<em>android</em>-ndk-r14b/toolchains/aarch64-linux-<em>android</em>-4.9/prebuilt/windows-x86_64/lib/gcc/aarch64-linux-<em>android</em>/4.9.x/../../../../aarch64-linux-<em>android</em>/bin\ld: cannot find -lprotocalsrn clang++.exe: <em>error</em>: linker command <em>failed</em> with exit code 1 (use -v to see invocation)rn ninja: build stopped: subcommand <em>failed</em>.rn
使用android Studio 的时候 出现错误: 找不到符号
在<em>使用</em><em>android</em> Studio 的<em>时候</em> <em>出现</em><em>错误</em>: 找不到符号 符号: 变量 download 位置: 类 mipmap 的报错 自己在网上找了很多的方面也试过了 没什么作用 求解? 你好! 这是你第一次<em>使用</em> Markdown编辑器 所展示的欢迎页。如果你想学习如何<em>使用</em>Markdown编辑器, 可以仔细阅读这篇文章,了解一下Markdown的基本语法知识。 我们对Markdown编辑器...
VS2015调试程序时候出现如图所示的错误
[img=https://img-bbs.csdn.net/upload/201611/29/1480419481_101834.png][/img]rn<em>这个</em>问题我查过很多解决方案,加__stdcall什么的还是解决不了,然后在属性里更改了规则还是没办法,求解这到底是个什么情况,而且问题断点是在函数结束的大括号,让人非常费解。。。
Android 开发过程中遇到的问题Error:Execution failed for task ':app:processDebugManifest'
在开发过程中遇到了这样一个问题:问题1:Error:Execution <em>failed</em> for <em>task</em> ':<em>app</em>:processDebugManifest'.&amp;gt; Manifest merger <em>failed</em> with multiple <em>error</em>s, see logs在网上查到了一些<em>这个</em>问题的解决办法:方法一:1)在Manifest根标签加上 xmlns:tools=&quot;http://sch...
Gradle Error: Execution failed for task ':app:clean'. Unable to delete file
Error: Execution <em>failed</em> for <em>task</em> ':<em>app</em>:<em>clean</em>'. Unable to delete file
Error:Execution failed for task ':zebradrive_sdk:clean'. > Unable to delete directory: D:\AndroidStu
Error:Execution <em>failed</em> for <em>task</em> ':zebradrive_sdk:<em>clean</em>'. > Unable to delete directory: D:\你工程的文件名\build\intermediates在集成第三方sdk 的<em>时候</em> as 时 会报 以上 <em>错误</em> 解决方法 :打开任务管理器 将下面的 程序结束掉 然后 在 <em>clean</em> 一下 或者 然后 在 <em>clean</em>
Error:Execution failed for task ':SmallVideoLib2:externalNativeBuildCleanDebug'.
Error:Execution <em>failed</em> for <em>task</em> ':SmallVideoLib2:externalNativeBuildCleanDebug'.&amp;gt; A problem occurred starting process 'command 'D:\sdk\cmake\3.6.4111459\bin\cmake.exe''解决:删除掉图中两个文件夹,然后Clean Project...
clean sysgen时出现error
SMDK6410\SRC\WHIMORY\FIL\SMDK6410.MLC\.\S3C6410_FIL.c(808) : warning C4554: '>>' : check operator precedence for possible <em>error</em>; use parentheses to clarify precedencernBUILD: [01:0000000195:ERRORE] C:\WINCE600\PLATFORM\SMDK6410\SRC\WHIMORY\FIL\SMDK6410.MLC\.\S3C6410_FIL.c(1166) : <em>error</em> C2039: 'NFM8ECC0' : is not a member of 'S3C6410_NAND_REG'rnBUILD: [01:0000000197:ERRORE] C:\WINCE600\PLATFORM\SMDK6410\SRC\WHIMORY\FIL\SMDK6410.MLC\.\S3C6410_FIL.c(1167) : <em>error</em> C2039: 'NFM8ECC1' : is not a member of 'S3C6410_NAND_REG'rnBUILD: [01:0000000199:ERRORE] C:\WINCE600\PLATFORM\SMDK6410\SRC\WHIMORY\FIL\SMDK6410.MLC\.\S3C6410_FIL.c(1168) : <em>error</em> C2039: 'NFM8ECC2' : is not a member of 'S3C6410_NAND_REG'rnBUILD: [01:0000000201:ERRORE] C:\WINCE600\PLATFORM\SMDK6410\SRC\WHIMORY\FIL\SMDK6410.MLC\.\S3C6410_FIL.c(1169) : <em>error</em> C2039: 'NFM8ECC3' : is not a member of 'S3C6410_NAND_REG'rnBUILD: [01:0000000203:ERRORE] C:\WINCE600\PLATFORM\SMDK6410\SRC\WHIMORY\FIL\SMDK6410.MLC\.\S3C6410_FIL.c(1365) : <em>error</em> C2039: 'NFM8ECC0' : is not a member of 'S3C6410_NAND_REG'rnBUILD: [01:0000000205:ERRORE] C:\WINCE600\PLATFORM\SMDK6410\SRC\WHIMORY\FIL\SMDK6410.MLC\.\S3C6410_FIL.c(1366) : <em>error</em> C2039: 'NFM8ECC1' : is not a member of 'S3C6410_NAND_REG'rnBUILD: [01:0000000207:ERRORE] C:\WINCE600\PLATFORM\SMDK6410\SRC\WHIMORY\FIL\SMDK6410.MLC\.\S3C6410_FIL.c(1367) : <em>error</em> C2039: 'NFM8ECC2' : is not a member of 'S3C6410_NAND_REG'rnBUILD: [01:0000000209:ERRORE] C:\WINCE600\PLATFORM\SMDK6410\SRC\WHIMORY\FIL\SMDK6410.MLC\.\S3C6410_FIL.c(1368) : <em>error</em> C2039: 'NFM8ECC3' : is not a member of 'S3C6410_NAND_REG'rnBUILD: [01:0000000211:WARNN ] C:\WINCE600\PLATFORM\SMDK6410\SRC\WHIMORY\FIL\SMDK6410.MLC\.\S3C6410_FIL.c(1928) : warning C4090: 'function' : different 'volatile' qualifiersrnBUILD: [01:0000000212:ERRORE] C:\WINCE600\PLATFORM\SMDK6410\SRC\WHIMORY\FIL\SMDK6410.MLC\.\S3C6410_FIL.c(2098) : <em>error</em> C2039: 'NF8ECCERR0' : is not a member of 'S3C6410_NAND_REG'rnBUILD: [01:0000000214:WARNN ] C:\WINCE600\PLATFORM\SMDK6410\SRC\WHIMORY\FIL\SMDK6410.MLC\.\S3C6410_FIL.c(2286) : warning C4090: 'function' : different 'volatile' qualifiersrnBUILD: [01:0000000215:WARNN ] C:\WINCE600\PLATFORM\SMDK6410\SRC\WHIMORY\FIL\SMDK6410.MLC\.\S3C6410_FIL.c(2469) : warning C4090: 'function' : different 'volatile' qualifiersrnBUILD: [01:0000000216:ERRORE] C:\WINCE600\PLATFORM\SMDK6410\SRC\WHIMORY\FIL\SMDK6410.MLC\.\S3C6410_FIL.c(2696) : <em>error</em> C2039: 'NF8ECCERR0' : is not a member of 'S3C6410_NAND_REG'rnBUILD: [01:0000000218:ERRORE] C:\WINCE600\PLATFORM\SMDK6410\SRC\WHIMORY\FIL\SMDK6410.MLC\.\S3C6410_FIL.c(2832) : <em>error</em> C2039: 'NF8ECCERR0' : is not a member of 'S3C6410_NAND_REG'rnBUILD: [01:0000000220:ERRORE] C:\WINCE600\PLATFORM\SMDK6410\SRC\WHIMORY\FIL\SMDK6410.MLC\.\S3C6410_FIL.c(3119) : <em>error</em> C2039: 'NF8ECCERR0' : is not a member of 'S3C6410_NAND_REG'rnBUILD: [01:0000000222:ERRORE] C:\WINCE600\PLATFORM\SMDK6410\SRC\WHIMORY\FIL\SMDK6410.MLC\.\S3C6410_FIL.c(3739) : <em>error</em> C2039: 'NFM8ECC0' : is not a member of 'S3C6410_NAND_REG'rnBUILD: [01:0000000224:ERRORE] C:\WINCE600\PLATFORM\SMDK6410\SRC\WHIMORY\FIL\SMDK6410.MLC\.\S3C6410_FIL.c(3740) : <em>error</em> C2039: 'NFM8ECC1' : is not a member of 'S3C6410_NAND_REG'rnBUILD: [01:0000000226:ERRORE] C:\WINCE600\PLATFORM\SMDK6410\SRC\WHIMORY\FIL\SMDK6410.MLC\.\S3C6410_FIL.c(3741) : <em>error</em> C2039: 'NFM8ECC2' : is not a member of 'S3C6410_NAND_REG'rnBUILD: [01:0000000228:ERRORE] C:\WINCE600\PLATFORM\SMDK6410\SRC\WHIMORY\FIL\SMDK6410.MLC\.\S3C6410_FIL.c(3742) : <em>error</em> C2039: 'NFM8ECC3' : is not a member of 'S3C6410_NAND_REG'rnBUILD: [01:0000000230:ERRORE] C:\WINCE600\PLATFORM\SMDK6410\SRC\WHIMORY\FIL\SMDK6410.MLC\.\S3C6410_FIL.c(3812) : <em>error</em> C2039: 'NFM8ECC0' : is not a member of 'S3C6410_NAND_REG'rnBUILD: [01:0000000232:ERRORE] C:\WINCE600\PLATFORM\SMDK6410\SRC\WHIMORY\FIL\SMDK6410.MLC\.\S3C6410_FIL.c(3813) : <em>error</em> C2039: 'NFM8ECC1' : is not a member of 'S3C6410_NAND_REG'rnBUILD: [01:0000000234:ERRORE] C:\WINCE600\PLATFORM\SMDK6410\SRC\WHIMORY\FIL\SMDK6410.MLC\.\S3C6410_FIL.c(3814) : <em>error</em> C2039: 'NFM8ECC2' : is not a member of 'S3C6410_NAND_REG'rnBUILD: [01:0000000236:ERRORE] C:\WINCE600\PLATFORM\SMDK6410\SRC\WHIMORY\FIL\SMDK6410.MLC\.\S3C6410_FIL.c(3815) : <em>error</em> C2039: 'NFM8ECC3' : is not a member of 'S3C6410_NAND_REG'rnBUILD: [01:0000000238:ERRORE] C:\WINCE600\PLATFORM\SMDK6410\SRC\WHIMORY\FIL\SMDK6410.MLC\.\S3C6410_FIL.c(3946) : <em>error</em> C2039: 'NFM8ECC0' : is not a member of 'S3C6410_NAND_REG'rnBUILD: [01:0000000240:ERRORE] C:\WINCE600\PLATFORM\SMDK6410\SRC\WHIMORY\FIL\SMDK6410.MLC\.\S3C6410_FIL.c(3947) : <em>error</em> C2039: 'NFM8ECC1' : is not a member of 'S3C6410_NAND_REG'rnBUILD: [01:0000000242:ERRORE] C:\WINCE600\PLATFORM\SMDK6410\SRC\WHIMORY\FIL\SMDK6410.MLC\.\S3C6410_FIL.c(3948) : <em>error</em> C2039: 'NFM8ECC2' : is not a member of 'S3C6410_NAND_REG'rnBUILD: [01:0000000244:ERRORE] C:\WINCE600\PLATFORM\SMDK6410\SRC\WHIMORY\FIL\SMDK6410.MLC\.\S3C6410_FIL.c(3949) : <em>error</em> C2039: 'NFM8ECC3' : is not a member of 'S3C6410_NAND_REG'rnBUILD: [01:0000000246:ERRORE] C:\WINCE600\PLATFORM\SMDK6410\SRC\WHIMORY\FIL\SMDK6410.MLC\.\S3C6410_FIL.c(3950) : <em>error</em> C2039: 'NFM8ECC0' : is not a member of 'S3C6410_NAND_REG'rnBUILD: [01:0000000248:ERRORE] C:\WINCE600\PLATFORM\SMDK6410\SRC\WHIMORY\FIL\SMDK6410.MLC\.\S3C6410_FIL.c(3951) : <em>error</em> C2039: 'NFM8ECC1' : is not a member of 'S3C6410_NAND_REG'rnBUILD: [01:0000000250:ERRORE] C:\WINCE600\PLATFORM\SMDK6410\SRC\WHIMORY\FIL\SMDK6410.MLC\.\S3C6410_FIL.c(3952) : <em>error</em> C2039: 'NFM8ECC2' : is not a member of 'S3C6410_NAND_REG'rnBUILD: [01:0000000252:ERRORE] C:\WINCE600\PLATFORM\SMDK6410\SRC\WHIMORY\FIL\SMDK6410.MLC\.\S3C6410_FIL.c(3953) : <em>error</em> C2039: 'NFM8ECC3' : is not a member of 'S3C6410_NAND_REG'rnBUILD: [01:0000000254:ERRORE] C:\WINCE600\PLATFORM\SMDK6410\SRC\WHIMORY\FIL\SMDK6410.MLC\.\S3C6410_FIL.c(4083) : <em>error</em> C2039: 'NF8ECCERR0' : is not a member of 'S3C6410_NAND_REG'rnBUILD: [01:0000000256:ERRORE] C:\WINCE600\PLATFORM\SMDK6410\SRC\WHIMORY\FIL\SMDK6410.MLC\.\S3C6410_FIL.c(4084) : <em>error</em> C2039: 'NF8ECCERR1' : is not a member of 'S3C6410_NAND_REG'rnBUILD: [01:0000000258:ERRORE] C:\WINCE600\PLATFORM\SMDK6410\SRC\WHIMORY\FIL\SMDK6410.MLC\.\S3C6410_FIL.c(4085) : <em>error</em> C2039: 'NF8ECCERR2' : is not a member of 'S3C6410_NAND_REG'rnBUILD: [01:0000000260:ERRORE] C:\WINCE600\PLATFORM\SMDK6410\SRC\WHIMORY\FIL\SMDK6410.MLC\.\S3C6410_FIL.c(4102) : <em>error</em> C2039: 'NFMLC8BITPT0' : is not a member of 'S3C6410_NAND_REG'rnBUILD: [01:0000000262:ERRORE] C:\WINCE600\PLATFORM\SMDK6410\SRC\WHIMORY\FIL\SMDK6410.MLC\.\S3C6410_FIL.c(4103) : <em>error</em> C2039: 'NFMLC8BITPT1' : is not a member of 'S3C6410_NAND_REG'rnBUILD: [01:0000000264:ERRORE] C:\WINCE600\PLATFORM\SMDK6410\SRC\WHIMORY\FIL\SMDK6410.MLC\.\S3C6410_FIL.c(4318) : <em>error</em> C2039: 'NF8ECCERR0' : is not a member of 'S3C6410_NAND_REG'rnBUILD: [01:0000000266:ERRORE] C:\WINCE600\PLATFORM\SMDK6410\SRC\WHIMORY\FIL\SMDK6410.MLC\.\S3C6410_FIL.c(4319) : <em>error</em> C2039: 'NF8ECCERR1' : is not a member of 'S3C6410_NAND_REG'rnBUILD: [01:0000000268:ERRORE] C:\WINCE600\PLATFORM\SMDK6410\SRC\WHIMORY\FIL\SMDK6410.MLC\.\S3C6410_FIL.c(4320) : <em>error</em> C2039: 'NF8ECCERR2' : is not a member of 'S3C6410_NAND_REG'rnBUILD: [01:0000000270:ERRORE] C:\WINCE600\PLATFORM\SMDK6410\SRC\WHIMORY\FIL\SMDK6410.MLC\.\S3C6410_FIL.c(4339) : <em>error</em> C2039: 'NFMLC8BITPT0' : is not a member of 'S3C6410_NAND_REG'rnBUILD: [01:0000000272:ERRORE] C:\WINCE600\PLATFORM\SMDK6410\SRC\WHIMORY\FIL\SMDK6410.MLC\.\S3C6410_FIL.c(4340) : <em>error</em> C2039: 'NFMLC8BITPT1' : is not a member of 'S3C6410_NAND_REG'rnBUILD: [01:0000000274:PROGC ] Compiling .\FIL.c
用VC++调试程序时候出现这个了怎么办!!
-
execution failed">"lr_xml_get_values" execution failed
在代码中加了rncountxml=lr_xml_get_values("XML=response",rn "FastQuery=/Envelope/Body/getSupportCityStringResponse/getSupportCityStringResult/string",rn "ValueParam=ParamValue_string",rn "SelectAll=yes",rn LAST);rn出错信息:rnAction.c(16): Error: Parameter SelectAll could not be used together with FastQuery. [class:CLrXmlScriptFunc]rnAction.c(16): Error: "lr_xml_get_values" <em>execution</em> <em>failed</em>
Failed to complete Gradle execution
Error:Failed to complete Gradle <em>execution</em>.nnCause:nUnknown command-line option '-X'.n我在打开一个工程进行build gradled <em>时候</em>报的<em>错误</em>,在settings->complier中配置的-Xmx750m -XX:MaxPermSize=512m -XX:+HeapDumpOnOutOfMemoryError -Dfile.encoding=UTF-8 结果报的<em>这个</em>未知的执行命令.在file->project structure中也重新指定了sdk的目录还是一样的报错.但是我只要不在settings->complier中配置就不会报错,请问问大神们这是为什么啊???
使用Android studio出现的和测试版本的错误
问题:Error:Execution <em>failed</em> for <em>task</em> ':<em>app</em>:preDebugAndroidTestBuild'.&amp;gt; Conflict with dependency 'com.<em>android</em>.support:support-annotations' in project ':<em>app</em>'. Resolved versions for <em>app</em> (26.1.0) and tes...
Ndk把密码打包在so动态库中调用libsqlcipher_android.so
在Android上保护数据,对sqlite 数据库加密(SQLCipher) Android.mk 代码 LOCAL_PATH := $(call my-dir) include $(CLEAR_VARS) LOCAL_MODULE := samuel LOCAL_SRC_FILES := samuel.c include $(BUILD_SHARED_LIBRARY) App
用AndroidStudio打包APK时出现Error:Execution failed for task ':app:validateSigningRelease'. > Keystore file
Error:Execution <em>failed</em> for <em>task</em> ‘:<em>app</em>:validateSigningRelease’. Keystore file D:\GitRepository\lcfu.jks not found for signing config ‘externalOverride’. <em>出现</em><em>这个</em>问题是因为签名文件的路径被你修改了 像我的,就是说在我的D:\GitReposito
Android studio报错rg.gradle.api.tasks.TaskExecutionException: Execution failed for task ':app:compileD
今天在运行<em>android</em>项目时报错,(gradle3.1.2),<em>错误</em>如下:   解决办法如下:在terminal即终端中输入以下命令查看详情:   gradlew compileDebugSource --stacktrace -info   看到共有21个<em>错误</em>,并且有详细的<em>错误</em>说明,根据情况进行修改即可...
使用Android Studio可能会遇到的问题
Error:Execution <em>failed</em> for <em>task</em> ':<em>app</em>:processDebugManifest'. > Manifest merger <em>failed</em> : uses-sdk:minSdkVersion 8 cannot be smaller than version L declared in library com.<em>android</em>.support:support-v4:21.
调试程序出现错误
按ctrl+F5,程序编译成功,没有<em>错误</em>,但<em>出现</em>“程序遇到问题需要关闭,我们对此引起的不便表示抱歉。”点击不发送,上面显示按任意键继续,是在release下调试的,为什么会<em>出现</em><em>这个</em>问题?
在Android Studio下使用异常断点调试程序
如果普通的断点调试跟踪不出问题的话,可以试试异常断点来<em>调试程序</em>。就是发生指定异常的<em>时候</em>,程序中断在异常代码处。这样可以大大的方便我们定位问题点。 选择Run → View Breakpoints...菜单项调出异常断点设置窗口,如图所示。 可以看到,当前设置的断点都显示在左边窗口,选中先前设置的断点,点击删除按钮(–)删除。 通过该对话窗口设置新的异常断点。这
Android studio中,出现错误
找不到符号 变量NumberFormat![图片说明](https://img-ask.csdn.net/upload/201604/17/1460880381_665244.png)
Android Studio打包签名出现错误
忽略 某些<em>错误</em> 解决办法,在build.gradle里面添加如下代码,放在Android下面 lintOptions { checkReleaseBuilds false abortOnError false }
android studio 打包出现错误
Error: Suspicious namespace and prefix combination [NamespaceTypo] when I try create Signed APK解决办法: 也就是说改一下布局文件的xmlns:<em>app</em>="http://schemas.<em>android</em>.com/tools" with this: 改成 xmlns:<em>app</em>="http://schemas.and
Android studio clean时,出现Unable to delete directory:...\build\intermediates
<em>clean</em>时,<em>出现</em>: settings——>instant run——>进入该界面,有四个选项,去掉第一个默认打勾,就ok了。
解决androidstudio unable to delete directory的办法
今天<em>clean</em>项目时突然报unable to delete directory:        好像是有些文件无法被删除,        查了很多资料,均没有解决。       后来将项目复制到另一个文件夹下。       问题解决!!!
【AndroidStudio】解决 Unable to delete dirctory '\build\outputs\apk'
在Windows机器上,<em>使用</em>AndroidStudio执行Build或Clean时经常<em>出现</em>12Error:Execution <em>failed</em> for <em>task</em> ':<em>app</em>:<em>clean</em>'.> Unable to delete directory: D:\EApp\<em>android</em>01\EApp\build\outputs\apk自己手工想去删除也删不了,只能用杀毒工具的粉碎机,好烦。一翻求索之下,找到了
Unable to delete directory
-
Unable to delete file/directory
在clear project 和rebuild project 时出错下面的<em>错误</em><em>错误</em>信息:Error:Execution <em>failed</em> for <em>task</em> ‘:<em>android</em>:<em>clean</em>’. &gt; Unable to delete file:F:\StudioProjects\ZXing\<em>android</em>\build\intermediates\exploded-aar\com.<em>android</em>.suppo
android studio 启动出现错误
java.lang.RuntimeException: java.lang.IllegalArgumentException: Argument for @NotNull parameter 'name' of com/<em>android</em>/tools/idea/welcome/Platform. must not be nullrn at com.intellij.idea.IdeaApplication.run(IdeaApplication.java:178)rn at com.intellij.idea.MainImpl$1$1$1.run(MainImpl.java:52)rn at java.awt.event.InvocationEvent.dispatch(InvocationEvent.java:311)rn at java.awt.EventQueue.dispatchEventImpl(EventQueue.java:744)rn at java.awt.EventQueue.access$400(EventQueue.java:97)rn at java.awt.EventQueue$3.run(EventQueue.java:697)rn at java.awt.EventQueue$3.run(EventQueue.java:691)rn at java.security.AccessController.doPrivileged(Native Method)rn at java.security.ProtectionDomain$1.doIntersectionPrivilege(ProtectionDomain.java:75)rn at java.awt.EventQueue.dispatchEvent(EventQueue.java:714)rn at com.intellij.ide.IdeEventQueue.dispatchEvent(IdeEventQueue.java:362)rn at java.awt.EventDispatchThread.pumpOneEventForFilters(EventDispatchThread.java:201)rn at java.awt.EventDispatchThread.pumpEventsForFilter(EventDispatchThread.java:116)rn at java.awt.EventDispatchThread.pumpEventsForHierarchy(EventDispatchThread.java:105)rn at java.awt.EventDispatchThread.pumpEvents(EventDispatchThread.java:101)rn at java.awt.EventDispatchThread.pumpEvents(EventDispatchThread.java:93)rn at java.awt.EventDispatchThread.run(EventDispatchThread.java:82)rnCaused by: java.lang.IllegalArgumentException: Argument for @NotNull parameter 'name' of com/<em>android</em>/tools/idea/welcome/Platform. must not be nullrn at com.<em>android</em>.tools.idea.welcome.Platform.(Platform.java)rn at com.<em>android</em>.tools.idea.welcome.Platform.getLatestPlatform(Platform.java:72)rn at com.<em>android</em>.tools.idea.welcome.Platform.createSubtree(Platform.java:89)rn at com.<em>android</em>.tools.idea.welcome.InstallComponentsPath.createComponentTree(InstallComponentsPath.java:81)rn at com.<em>android</em>.tools.idea.welcome.InstallComponentsPath.init(InstallComponentsPath.java:215)rn at com.<em>android</em>.tools.idea.wizard.DynamicWizardPath.attachToWizard(DynamicWizardPath.java:97)rn at com.<em>android</em>.tools.idea.wizard.DynamicWizard.addPath(DynamicWizard.java:233)rn at com.<em>android</em>.tools.idea.welcome.FirstRunWizard.init(FirstRunWizard.java:75)rn at com.<em>android</em>.tools.idea.welcome.FirstRunWizardHost.setupWizard(FirstRunWizardHost.java:100)rn at com.<em>android</em>.tools.idea.welcome.FirstRunWizardHost.getWelcomePanel(FirstRunWizardHost.java:92)rn at com.intellij.openapi.wm.impl.welcomeScreen.WelcomeFrame.(WelcomeFrame.java:68)rn at com.intellij.openapi.wm.impl.welcomeScreen.WelcomeFrame.showNow(WelcomeFrame.java:173)rn at com.intellij.idea.IdeaApplication$IdeStarter.main(IdeaApplication.java:302)rn at com.intellij.idea.IdeaApplication.run(IdeaApplication.java:172)rn ... 16 morernrn<em>这个</em>问题应该怎么解决?
android studio出现这个错误如图:android failed to instantiate one or more classes
[img=https://img-bbs.csdn.net/upload/201804/04/1522841743_924565.jpg][/img]
Android studio 导入工程 出现错误
对于刚开始<em>使用</em>Android <em>studio</em> 并且以前不了解gradle,IDE之类的工具的人,导入个工程都是很大的问题。本人也是费了很大的力气才搞定。 github上有关Android <em>studio</em>的项目,通常两种形式 第一种:完整的Android <em>studio</em>工程,那么只需要File->New->import project  选中你要导入的工程即可
使用CButtonST的时候出现debug asserion failed
先创建了一个按钮,再把CButton改成CButtonSTrn但是在执行rn m_bt.SubclassDlgItem(IDC_BUTTON1,this);rn语句后<em>出现</em>assertrn忽略后可以运行的。rn请问这是什么问题啊? 谢谢各位。
Android Studio Unable to delete directory 编译错误\app\build\intermediates 不能删除
造成这种情况的原因是因为svn或者git其他的代码版本控制软件造成了占用使得文件不能被<em>clean</em> 解除svn的版本控制就可以了
':app:clean'. > Unable to delete directory:app\build\intermediates
在<em>android</em> <em>studio</em> 开发时,莫名其妙的<em>出现</em>:Error:Execution <em>failed</em> for <em>task</em> ':<em>app</em>:<em>clean</em>'. > Unable to delete directory: D:\ProjiectName\<em>app</em>\build\intermediates我是在操作svn<em>出现</em>的这种情况,解决的办法也简单就是找到提示的目录D:\ProjiectName\<em>app</em>\build
Android studio 报错 :Unable to delete file
Error:Execution <em>failed</em> for <em>task</em> ':<em>app</em>:<em>clean</em>'. > Unable to delete file: D:\<em>android</em>\workspace\As1.5\HB\<em>app</em>\build\intermediates\classes\dev\debug\com\song\hb\Bas
Android Studio遇到报错:cannot delete xxx file
当rebuild 或者 <em>clean</em> 工程的<em>时候</em>,会<em>出现</em> cannot delete 某个文件的报错: Error:Execution <em>failed</em> for <em>task</em> ':<em>app</em>:<em>clean</em>'. > Unable to delete directory: D:\My_projects\Android_Projects\TestLibJpeg2\<em>app</em>\build 不要方,也许是<em>这个</em>文件被其
Unable to delete directory: F:\Android\AndroidStudioWorkSpace\AIDLDemo\app\build\outputs\apk终极解决方案
Execution <em>failed</em> for <em>task</em> ':<em>app</em>:<em>clean</em>'.   > Unable to delete directory: F:\Android\AndroidStudioWorkSpace\AIDLDemo\<em>app</em>\build\outputs\apk   最近总是频繁的遇到<em>这个</em>问题,搜了好多解决方案,大多是关于怎么卸载apk文件的,或者重启怎么的。后来终于找到
问题:Execution of cgi process failed
goahead运行cgi,网页访问时提示“Execution of cgi process <em>failed</em> ”,不知为何?rnrn换一种思路rn如果用$./cgitest >> a.htm将结果输出到a.htm文件,cat该文件可以看到执行结果:rn[i][color=#0000FF]Content-type: text/htmlrnrnrn CGI Outputrnrn CGI Test Programrn This program displays the CGI Enviromentrnrn[/color][/i]rnrncgitest.c的主代码:rn[i]int main(int argc, char *argv[])rnrn char **pVars;rn int loopCount = 1000;rn time_t second;rnrn/* rn * Print the CGI response header, required for all HTML output. rn * Note the extra \n, to send the blank line. rn */rn printf("Content-type: text/html\n\n") ;rn/* rn * Print the HTML header to STDOUT. rn */rn printf("\n");rn printf(" CGI Output\n");rn printf("\n");rnrn printf(" CGI Test Program\n");rn printf(" This program displays the CGI Enviroment\n");rn printf("\n");rn printf("\n");rnrn return 0;rn[/i][color=#0000FF][/color]
failed to create task or type if
NULL 博文链接:https://rooi.iteye.com/blog/1187269
使用Android Studio(AS)和Kotlin开发Android App
该课程包括Kotlin开发环境搭建、Kotlin基础知识、类和接口、枚举类、扩展、泛型、函数、lambdas表达式、对象、标准API等。
链接数据库的时候出现错误,runtime error
想从VC中将接收到的数据存到SQL数据库中,可以正确的连上数据库,数据库中对应的表格也建好了,现在<em>出现</em>是不能正确打开表,程序是开了2个线程来写的,处理数据部分是在其中一个线程中调用的,是不是会有影响呢?rn下面贴上我的代码;rn[code=c]BOOL CTESTDlg::InitDataBase()rnrn CString str_pos_platform;rn SHGetSpecialFolderPath(NULL,(LPSTR)(LPCTSTR)str_pos_platform,CSIDL_APPDATA,FALSE);rn rn //保存数据库中转文件路径rn m_strPosDbRead.Format("%s\\DBread",str_pos_platform);rn m_strPosDbWrite.Format("%s\\DBwrite",str_pos_platform);rnrn //初始化com库rn CoInitialize(NULL);rn //创建数据库连接实例rn m_pConnection_jhy_read.CreateInstance(__uuidof(Connection));rn m_pConnection_jhy_write.CreateInstance(__uuidof(Connection));rn //连接数据库rn tryrn rn m_pConnection_jhy_write->Open("Provider=SQLOLEDB.1;Integrated Security=SSPI;Persist Security Info=False;Initial Catalog=***;Data Source=.", "", "", adModeUnknown);rn m_pConnection_jhy_read->Open("Provider=SQLOLEDB.1;Integrated Security=SSPI;Persist Security Info=False;Initial Catalog=***;Data Source=.", "", "", adModeUnknown);rn AfxMessageBox("连接数据库成功!");rn rn catch(_com_<em>error</em> e)rn rn AfxMessageBox("连接数据库失败!");rn return FALSE;rn rn return TRUE;rn[/code]rn上面这部分是初始化部分目测没问题,担是就是不能打开表rn[code=c]BOOL CTESTDlg::OnRecvData(unsigned char * recvbuf)rnrn m_pRecordset_jhy_write.CreateInstance(__uuidof(Recordset));rn tryrn rn m_pRecordset_jhy_write->Open("SELECT * FROM jhy",m_pRecordset_jhy_write.GetInterfacePtr(),adOpenDynamic,adLockOptimistic,adCmdText);rnrn rn catch(_com_<em>error</em> *e)rn rn // AfxMessageBox("打开表jhy失败!");rn AfxMessageBox(e->ErrorMessage());rn return FALSE;//后面省略;rn [/code]rn捕捉到的<em>错误</em>是[img=https://img-bbs.csdn.net/upload/201404/16/1397636791_10240.jpg][/img]rn数据库中的表是[img=https://img-bbs.csdn.net/upload/201404/16/1397636891_767664.jpg][/img]
真机调试的时候出现There was an internal API error错误
废话少说,直接上干货。 原因:是因为真机调试的<em>时候</em>Product Name不支持中文. 所以可以在Build Setting —>Product Name的值(即你的应用名称),改为任意英文(注意:发布的<em>时候</em>要改回来)。
遥游网娱平台2004下载
;本文件为逍遥游网娱平台2004在线影院菜单配置文件 ;您可以根据需要作适当的修改 ;但是,一般情况下,管理程序会智能配置 ;在无创世纪技术人员指导的情况下 ;请不要改动『逍遥游软件工作室』设置好的默认设置 ;尤其是在不了解本系统时严禁手动修改本配置文件!!! ;注①:[Movie]小节为本地电影或局域网电影服务器UNC路径 ;注②:[Movie_Online]小节为在线电影网址 ;您可能根据各服务器共享资料作适当修改 ;(=)等于号后面的(\\)表示要共享的服务器名称,(\)后面的表示服务器的共享名 相关下载链接:[url=//download.csdn.net/download/db385208309/2651530?utm_source=bbsseo]//download.csdn.net/download/db385208309/2651530?utm_source=bbsseo[/url]
学生信息管理系统的代码下载
一个学生信息管理系统的代码,给有需要的朋友。涉及到链表的运用,对初学者学习很有帮助。 相关下载链接:[url=//download.csdn.net/download/wanhui520/3314877?utm_source=bbsseo]//download.csdn.net/download/wanhui520/3314877?utm_source=bbsseo[/url]
oracle入门必备下载
oracle资源必备,收集了企业应用常用的函数,以及存储过程,函数等 相关下载链接:[url=//download.csdn.net/download/fangkey/4234667?utm_source=bbsseo]//download.csdn.net/download/fangkey/4234667?utm_source=bbsseo[/url]
相关热词 c#入门推荐书 c# 解码海康数据流 c# xml的遍历循环 c# 取 查看源码没有的 c#解决高并发 委托 c#日期转化为字符串 c# 显示问号 c# 字典对象池 c#5.0 安装程序 c# 分页算法
我们是很有底线的