在使用android studio 生成app时出现了问题,这个怎么解决 [问题点数:40分,结帖人sinat_26008161]

一键查看最优答案

确认一键查看最优答案?
本功能为VIP专享,开通VIP获取答案速率将提升10倍哦!
Bbs1
本版专家分:0
结帖率 33.33%
Bbs2
本版专家分:116
Bbs1
本版专家分:0
Bbs1
本版专家分:0
Bbs2
本版专家分:128
Blank
蓝花 2013年12月 Delphi大版内专家分月排行榜第三
Bbs1
本版专家分:0
Bbs1
本版专家分:0
Error while executing process D:\Android-studio\Android\sdk\cmake\3.6.4111459\bin\cmake.exe with arg
Android <em>studio</em>3.0 原有项目中添加jni开发按照一般的教程<em>时</em><em>出现</em>错误了 Error:A problem occurred configuring project ':<em>app</em>'. > executing external native build for cmake C:\Users\Lenovo\Desktop\samples\MyJNIDemo\<em>app</em>\CMakeLists.
intellij idea创建完android项目编译的候报错。之前都没事的
Information:Gradle: Executing tasks: [:<em>app</em>:generateDebugSources, :<em>app</em>:generateDebugAndroidTestSources] Information:2015/4/8 17:05 - Compilation completed with 2 errors and 0 warnings in 29s 30ms Error:Gradle: Execution failed for task ':<em>app</em>:processDebugResources'. > com.<em>android</em>.ide.common.process.ProcessException: org.gradle.process.internal.ExecException: Process 'command 'E:\PublicFile\<em>android</em>\<em>android</em>-sdk_r24.1.2-windows\<em>android</em>-sdk-windows\build-tools\22.0.1\aapt.exe'' finished with non-zero exit value 1 H:\IdeaProiectsAndroid\XListTest\<em>app</em>\build\intermediates\manifests\full\debug\AndroidManifest.xml Error:Error:line (13)Gradle: No resource found that matches the given name (at 'icon' with value '@drawable/ic_launcher').
实在搞不定这个Android Studio和Gradle。。。
之前也接触过一点儿安卓,不过很久没碰了,今天拿起来想看看,就去github上找了一份代码,想导入到Android Studio里,结果总是搞不定。。。 我的系统是Windows7 64bit,jdk是
ndk报错Error: Android NDK: Aborting....Stop.
请问大神ndk报错:Error:(198) *** Android NDK: Aborting... . Stop.Error:Execution failed for task ':libuvccamera:ndkBuild'. > Process 'command 'C:\Users\Administrator\AppData\Local\Android\Sdk\ndk-bundle/ndk-build.cmd'' finished with non-zero exit value 2是什么原因,怎么<em>解决</em>
ionic2 打包android报'C:\Users\Administrator\AppData\Local\Android\sdk' does not exist.
What went wrong: A problem occurred configuring root project ‘<em>android</em>’. The SDK directory ‘C:\Users\Administrator\AppData\Local\Android\sdk’ does not exist. Try: Run with –stacktrace option to...
报错Error while executing process D:\android_studio_sdk\cmake
ErrorwhileexecutingprocessD:\<em>android</em>_<em>studio</em>_sdk\cmake\3.6.4111459\bin\cmake.exewitharguments{-HD:\ShellNDK\<em>app</em>-BD:\ShellNDK\<em>app</em>\.externalNativeBuild\cmake\release\armeabi-v7a-DANDROID_ABI=arm...
androidStudio出现Executing tasks: [:app:assembleDebug]等错误不能运行程序
<em>android</em>Studio<em>出现</em>Executing tasks: [:<em>app</em>:assembleDebug]等错误不能运行程序 <em>出现</em>这些错误,可能是你写的代码导致的错误,你只要Ctrl+Z退回到你能正确运行<em>时</em>候的代码处。这样就可以了,然后你要写的代码经过适当修改就可以运行了。如果你在真机运行,那么需要完全关闭真机上的程序,即后台程序也清掉。重新运行。
Error:The SDK directory 'C:\Users\Darko\AppData\Local\Android\sdk' does not exist. Please fix the 's
导入Project报错,提示如下: Error:The SDK directory 'C:\Users\xx\AppData\Local\Android\sdk' does not exist. Please fix the 'sdk.dir' property in the local.properties file 由于我移动过Android sdk的路径, 应当是这个原因. 
Sync android SDKs path does not belong to a directory
这个<em>问题</em>其实可以忽略的,这个只是 Android <em>studio</em> 的提示信息而已的。 即导入的项目 的 SDK路径和 <em>studio</em>默认<em>使用</em>的不同。 就会<em>使用</em> <em>studio</em> 的SDK路径。 不用理会即可。 导入成功之后 <em>studio</em> 会修改local.properties 里面的SDK路径...
Error:A problem occurred configuring project ':app'.
在github上导入项目,或其他地方导入Android Studio,<em>出现</em>Error:A problem occurred configuring project ':<em>app</em>'.的错误。 其实这种错误有很多种原因,需要对每种情况进行不同的处理才行,这里说的一种情况是JNI的情况,即该项目<em>使用</em>到C/C++库,此<em>时</em>需要引入NDK才行,先看下错误提示Gradle 'trunk' project ref...
Android studio app没有出现,这种情况直接新建一个
直接左上角+号,直接新建一个Android <em>app</em>,即可。  
gradle build出错,不知道这是为什么
![图片说明](https://img-ask.csdn.net/upload/201601/22/1453476102_746713.png) 谁能告知一下!
Android Studio Sdk设置问题
Android Studio 配置<em>使用</em>的是26.0.2的sdk toast import <em>时</em>候 多个类文件找不到 其他文件也有这种<em>问题</em> 但实际在sdk包里面是有对应的类的 感觉是配置没成功 想问下 这种情况 是什么地方配置的不正确 谢谢 ![图片说明](https://img-ask.csdn.net/upload/201903/25/1553510773_761224.png) ![图片说明](https://img-ask.csdn.net/upload/201903/25/1553510781_847097.png)
求助关于使用Process调用*.exe程序的问题
我是一个学习VB.net2003的新手,<em>使用</em>Process调用*.exe程序<em>时</em>,<em>出现</em>了奇怪的<em>问题</em>,无法<em>解决</em>。敬请各位大师不吝赐教!谢谢! 我用下面程序语句调用"D:\xljc\RelaxApparat
关于android sdk path 问题的彻底解决方法 Android_SDK_HOME
关于<em>android</em> sdk path <em>问题</em>的彻底<em>解决</em>方法 Android_SDK_HOME 1.在环境变量中新建一个“系统变量”   变量名:ANDROID_SDK_HOME       值:K:\Android\<em>android</em>-sdk-windows\tools(注:我的sdk安装在K盘) 2.修改系统变量Path,在前面添加%Android_SDK_HOME
AndroidStudio导入别的软件工程报错The patch c:\android-sdk-windows does not belong to a directory.Android stud
在导入别的工程的<em>时</em>报错                                          导致原因:新导入的项目的SDK路径和本机Studio中的SDk路径不匹配造成的     The  path是要导入的项目的路径 <em>解决</em>办法:在要导入项目中找到local.properties      文件  将该项目SDK路径配置成本机StudioSDk路径即可   切记路径不能含有中
gradle build The SDK directory does not exist
ANDROID_HOME 设置为  D:\eclipse_ASDK_Super\sdk; gradle build 出错如下图: 修改:ANDROID_HOME 的变量D:\eclipse_ASDK_Super\sdk(去掉分号就可以了) 记得要关闭下cmd 原因:不清楚。坑大爷。
robotframework 执行报错 pybot.bat --argumentfile c:\users\admini~1\appdata\local\temp\RIDEwgzmsl.d\argfi
ride运行一个case报错了,如下图: <em>解决</em>:在***\python\Scripts目录下加一个pybot.bat 文件 内容为: @Echo off python -m robot.run %*
重新安装Android Studio并导入之前的项目出现,弹框说SDK有问题
重装系统后,修改了用户名,所以安装Android <em>studio</em><em>时</em>的默认位置改变了,在导入之前的项目后,<em>出现</em>这个<em>问题</em>。 这个应该是项目对SDK做了设置,找到项目的local.properties文件进行修改。 上面的图中,将local.properties文件中的sdk.dir 值修改成现在的sdk路径。 这样<em>问题</em>就<em>解决</em>了。...
复制Android Studio 工程到其它电脑后遇到The SDK directory 'XXXX‘ does not exist.问题解决方法
复制Android Studio 工程到其它电脑后遇到如下<em>问题</em>: Error:A problem occurred configuring project ':<em>app</em>'. > The SDK directory '/Users/alex/Library/Android/sdk' does not exist. <em>解决</em>办法: 在项目的根目录下找到文件: "local.pro
The SDK directory 'D:\SDK' does not exist
The SDK directory 'D:\SDK' does not exist
Error:The SDK directory '/Users/AhmadMusa/Desktop/[PROJECT PATH]/D:\Android\sdk' does not exist. Ple
<em>使用</em><em>android</em> <em>studio</em>,导入别人开源的项目,build的<em>时</em>候,老是报这个错误: Error:The SDK directory 'D:\sdk' does not exist. Please fix the 'sdk.dir' property in the local.properties file. 然后网上各种说你要自己去修改local.properties,修改成自己的目录...
记录错误:'command '/.../sdk/build-tools/23.0.1/aapt'' finished with non-zero exit value 1
导入github上一个实现页面滑动finish activity的项目:SwipeBack, 由于gradle和buildToolsVersion的版本不一致的情况下,我把项目的gradle和buildToolsVersion都改成了当前<em>android</em> <em>studio</em>上已经存在的版本, 分别是:com.<em>android</em>.tools.build:gradle:1.3.0和23.0.1 之后rebu
Process 'command 'E:\AndroidPath\SDK\build-tools\27.0.3\aapt.exe'' finished with non-zero exit value
在IDEA中开发Android报错的<em>解决</em>办法 报错截图如下: 说明你的那个视图里面的值没有写或者是写错了,虽然<em>解决</em><em>问题</em>很简单,但是很实用,所以提醒大家coding的<em>时</em>候一定要细心。...
关于Android AIDL 编译报Process 'command 'F:\sdk\build-tools\27.0.3\aapt.exe'' finished 。。。的问题
关于AIDL的<em>问题</em>网上已经陈列出大多数可能,今天我简述一下自己遇到的一种情况:修改.adil文件名字,然后执行MakeProduct<em>出现</em>了这个错误。 触发这种<em>问题</em>的原因是:<em>使用</em>Rename修改.aidl文件,里面的名字并没有像.java文件一样修改,而且之前<em>使用</em>MakeProduct<em>生成</em>的该aidl文件的.java文件名字也不会自动改变。所以编译<em>时</em>不通过的。 <em>解决</em>方案:1、最暴力的一种...
Android编译出现Process 'command 'build-tools\27.0.3\aapt.exe'' finished with non-zero exit value 1报错
首先说下自己的<em>解决</em>方案: 1,电脑当<em>时</em>运行的内存不够,导致了这个<em>问题</em> 2,这个才是重点 AndroidManifest.xml资源文件中引用有错误(搜狗渠道的资源配置引用了爱游戏渠道的资源配置)删除错误的资源配置就可以了,资源报错的方式是通过以下一篇博客找到的 同<em>时</em>感谢一位博主,他的这篇文章写的非常不错,我也是在这个基础上找到的 链接如下: https://blog.csdn.net/tcpi...
Android SDK tools 22.0.1 发布
Windows 32 & 64-bit <em>android</em>-sdk_r22.0.1-windows.zip 113483496 bytes cb7f7703450afa5914fb4b8b8332a9f3 installer_r22.0.1-windows.exe (Recommended) 93479015 bytes 81621d3b164f81f91e066011b325f
求助!android studio 问题
报错 Build command failed. Error while executing process D:\APPDATA\cmake\3.10.2.4988404\bin\cmake.exe
Android Studio Gradle project sync failed,Configure project:app出现红叹号
Android Studio Gradle project sync failed,Configure project:<em>app</em> 前<em>出现</em>红叹号 ![图片说明](https://img-ask.csdn.net/upload/201905/13/1557746272_155433.jpg) 提示为 ``` org.gradle.api.ProjectConfigurationException: A problem occurred configuring project ':<em>app</em>' at java.util.concurrent.ThreadPoolExecutor.runWorker(ThreadPoolExecutor.java:1142) at java.util.concurrent.ThreadPoolExecutor$Worker.run(ThreadPoolExecutor.java:617) at org.gradle.internal.concurrent.ThreadFactoryImpl$ManagedThreadRunnable.run(ThreadFactoryImpl.java:55) at java.lang.Thread.run(Thread.java:745) Caused by: com.<em>android</em>.builder.errors.EvalIssueException: Failed to install the following Android SDK packages as some licences have not been accepted. build-tools;28.0.2 Android SDK Build-Tools 28.0.2 To build this project, accept the SDK license agreements and install the missing components using the Android Studio SDK Manager. Alternatively, to transfer the license agreements from one workstation to another, see http://d.<em>android</em>.com/r/<em>studio</em>-ui/export-licenses.html Using Android SDK: D:\Android\SDK at com.<em>android</em>.build.gradle.internal.SdkHandler.initTarget(SdkHandler.java:194) at com.<em>android</em>.build.gradle.BasePlugin.ensureTargetSetup(BasePlugin.java:980) at com.<em>android</em>.build.gradle.BasePlugin.createAndroidTasks(BasePlugin.java:752) at com.<em>android</em>.build.gradle.BasePlugin.lambda$null$4(BasePlugin.java:690) at com.<em>android</em>.builder.profile.ThreadRecorder.record(ThreadRecorder.java:81) at com.<em>android</em>.build.gradle.BasePlugin.lambda$createTasks$5(BasePlugin.java:686) at org.gradle.internal.event.BroadcastDispatch$ActionInvocationHandler.dispatch(BroadcastDispatch.java:91) at org.gradle.internal.event.BroadcastDispatch$ActionInvocationHandler.dispatch(BroadcastDispatch.java:80) at org.gradle.internal.event.AbstractBroadcastDispatch.dispatch(AbstractBroadcastDispatch.java:42) at org.gradle.internal.event.BroadcastDispatch$SingletonDispatch.dispatch(BroadcastDispatch.java:230) at org.gradle.internal.event.BroadcastDispatch$SingletonDispatch.dispatch(BroadcastDispatch.java:149) at org.gradle.internal.event.AbstractBroadcastDispatch.dispatch(AbstractBroadcastDispatch.java:58) at org.gradle.internal.event.BroadcastDispatch$CompositeDispatch.dispatch(BroadcastDispatch.java:324) at org.gradle.internal.event.BroadcastDispatch$CompositeDispatch.dispatch(BroadcastDispatch.java:234) at org.gradle.internal.event.ListenerBroadcast.dispatch(ListenerBroadcast.java:140) at org.gradle.internal.event.ListenerBroadcast.dispatch(ListenerBroadcast.java:37) at org.gradle.internal.dispatch.ProxyDispatchAdapter$DispatchingInvocationHandler.invoke(ProxyDispatchAdapter.java:93) at com.sun.proxy.$Proxy27.afterEvaluate(Unknown Source) at org.gradle.configuration.project.LifecycleProjectEvaluator.notifyAfterEvaluate(LifecycleProjectEvaluator.java:76) ... 85 more ```
Android报错 Executing tasks: [:app:assembleDebug] 解决
打包前可正常运行,打包后不能运行了,报错Executing tasks: [:<em>app</em>:assembleDebug]: 看一下右上角是不是跑成打包任务了: (这是打包任务,要改成<em>app</em>运行你原来的程序) (下拉改成<em>app</em>,就可以正常运行了) ...
关于一个Android Studio报错的问题
The path 'd:\这里乱码\AppData\Local\Android\Sdk' does not belong to a directory. Android Studio will use
Android Studio一直处于building “project name”gradle project info的解决办法
Android Studio一直处于building “project name”gradle project info的<em>解决</em>办法 停留在这个画面的原因是因为下载gradle包<em>出现</em>了<em>问题</em>,原因也只能归结于红色高墙了。<em>解决</em>有翻墙、跟换国内镜像服务器地址、离线下载。 办法一:跟换国内镜像服务器地址(推荐) 中国科学院开源协会镜像站地址: IPV4/IPV6:mirrors.ope...
文件怎么自动生成到C:\Users\Administrator\AppData\Local\Temp文件夹下!
文件怎么自动<em>生成</em>到C:\Users\Administrator\AppData\Local\Temp文件夹下!
解决:org.gradle.api.tasks.TaskExecutionException: Execution failed for task ':app:packageDebug'.
<em>解决</em>:org.gradle.api.tasks.TaskExecutionException: Execution failed for task ‘:<em>app</em>:packageDebug’. 个人原因:可能是由于多了或少了相应的包 <em>解决</em>方法:File&gt;settings&gt;Editor&gt;General&gt;Auto import 将Add unambiguous imports on...
Process 'command '/Users/wcc/Android/sdk/build-tools/23.0.0/aidl'' finished with non-zero exit valu
Error:Execution failed for task ':turingApiExamples:compileDebugAidl'. > java.lang.RuntimeException: com.<em>android</em>.ide.common.process.ProcessException: org.gradle.process.internal.ExecException: Proces
Process 'command '/***/Android/sdk/build-tools/27.0.3/aidl'' finished with non-zero exit value 1
在添加ALDL文件后进行编译的<em>时</em>候会报上面的错误如下图:如图上的右边的提示,点击左边会在右边提示如下错误信息:org.gradle.api.tasks.TaskExecutionException: Execution failed for task ':<em>app</em>:compileDebugAidl'. at org.gradle.api.internal.tasks.execution.Execu...
关于IDE的一个问题...
为什么Dev-C++可以把一个cpp文件编译链接<em>生成</em>一个exe文件? 而Visual C++却不可以,非得要建立一个工程? qt也是不可以,也是要建立一个工程,才能编译...???
Caused by: com.android.ide.common.process.ProcessException: Error while executing process aapt.exe
build<em>时</em><em>出现</em><em>问题</em>: Caused by: com.<em>android</em>.ide.common.process.ProcessException: Error while executing process E:\AndroidSDK\build-tools\25.0.3\aapt.exe with arguments    e.g. gradlew processYicunDebugReso...
C:\Users\Admin\AppData\Local 把软件配置信息写到这个里面如何做到?
C:\Users\Admin\AppData\Local 把软件配置信息写到这个里面如何做到?然后软件去这里读取配置信息
解决Android Studio执行Runapp安装成功但不能启动的问题
<em>解决</em>Android Studio执行Run<em>时</em><em>app</em>安装成功但不能启动的<em>问题</em> 今天在<em>使用</em>Android Studio开发<em>时</em>,替换了<em>app</em> Module中的内容,之前的启动activity被删除,改成<em>使用</em>其他的activity启动,导致在运行<em>时</em><em>出现</em>了一些小<em>问题</em>,<em>app</em>可以正常安装,但不能直接启动,只能通过点击手机桌面的图标启动。 点击Android Studio的&quot;Run&quot;窗口,可见如下报错信息: 0...
关于::app:clean :app:preBuild UP-TO-DATE :app:preDebugBuild UP-TO-DATE,引用jar冲突问题
错误提示: Information:Gradle tasks [:<em>app</em>:clean, :<em>app</em>:generateDebugSources, :<em>app</em>:generateDebugAndroidTestSources, :<em>app</em>:prepareDebugUnitTestDependencies, :<em>app</em>:mockableAndroidJar, :<em>app</em>:assembleDebug] :<em>app</em>:c
Android studio 打开文件出错
Android <em>studio</em>打开是<em>出现</em>这个错误 Error:Failed to find target with hash string '<em>android</em>-24' in: C:\Users\admin\AppData\Local\Android\Sdk,我是该重新下载新的版本呢,还是直接修改<em>使用</em>的sdk版本?该怎样操作呢?求大神指导
androidStudio 每次运行都会出现这个error,但不影响运行 不崩溃 这是怎么了呢?
06-08 01:41:34.566 15986-15986/com.huran.nvtag.nisge E/ActivityThread: mtprof entry can not be found
Andrid Studio Gradle sync failed: A problem occurred configuring project ':app' 解决方法
我在Android Studio中进行Gradle sync <em>时</em><em>出现</em>了这个错误,Android Studio 出错提示是 Gradle sync failed: A problem occurred configuring project ‘:<em>app</em>’,而错误日志的最后几行 是这样子的 2018-10-30 21:05:30,041 [thread 106] WARN - ect.sync.i...
A problem occurred configuring project ....
Error:A problem occurred configuring project ':<em>app</em>'. > A problem occurred configuring project ':rxretrofitlibrary'. > Failed to notify project evaluation listener. > org.gradle.api.tasks.TaskInputs.file(Ljava/lang/Object;)Lorg/gradle/api/tasks/TaskInputFilePropertyBuilder; ```![图片说明](https://img-ask.csdn.net/upload/201704/11/1491902558_397162.png) ```更新代码<em>出现</em>了这样的<em>问题</em>,请问应该是哪里出<em>问题</em>了?我应该怎么改?谢谢大神
Android NDK总是无法build
我安装了Eclipse,配置了NDK,NDK中也自己配置的NDKROOT环境变量,点击build all后,就会<em>出现</em>图上的错误,真是找不到原因了。。。Android用过一段<em>时</em>间了,初学NDK,没想到
Android Studio导入项目出现,弹框说SDK有问题
在导入项目<em>时</em><em>出现</em>如下<em>问题</em>的错误弹框: <em>studio</em>The path ‘E:\Android\AndroidSDK’ does not belong to a directory. Android Studio will use this Android SDK instead: ‘C:\Users\QQQ\AppData\Local\Android\Sdk’ and will modify t
Android编译冲突报错的完美解决方案
最近在项目的整合和接入第三方sdk的过程中多次遇到DexArchiveMergerException/ transformDexArchiveWithExternalLibsDexMergerForDevelop等报错,详细的报错信息如下,一般有如下两种场景,一种是依赖冲突,一种是jar冲突。 场景1: Caused by: com.<em>android</em>.builder.dexing.DexArc...
使用最新的Android studio 2.3.3创建新工程出错了
当前的<em>studio</em><em>使用</em>的是gradle 3.3 版本,这个目前在<em>studio</em>目录和./gradle目录已经配置好了,所以可以排除不是gradle配置的<em>问题</em>. 由于我的build-tool升级到了26.0.1,然后sdk版本默认<em>使用</em>的是26的. 这样创建新工程的<em>时</em>候,首先是<em>出现</em>这个<em>问题</em>: java.io.IOException: Cannot run program "/home/androi
Information:Gradle tasks [:app:assembleDebug] Error:Execution failed for task ':app:transformClasses
<em>问题</em>:Information:Gradle tasks [:<em>app</em>:assembleDebug] Error:Execution failed for task ':<em>app</em>:transformClassesWithDexForDebug'. > com.<em>android</em>.build.api.transform.TransformException: com.<em>android</em>.ide.common.pro
app:assembleDebug">UE4-打包安卓报错 /Android/APK\gradle\rungradle.bat" :app:assembleDebug
新安装的win10系统,建立好 4.21.2 Android环境之后打包,报错如下: 网上很多人都关注红线部分 ERROR: cmd.exe failed with args /c "E:\UE4Project\ARandVRProject\HandledAR421\Intermediate/Android/APK\gradle\rungradle.bat" :<em>app</em>:assembleDe...
关于build-tools位置不一致问题
错误如下:Observed package id ‘build-tools;18.0.1’ in inconsistent location ‘E:\SDK_JDK\<em>android</em>-sdk\build-tools\<em>android</em>-4.3’ (Expected ‘E:\SDK_JDK\<em>android</em>-sdk\build-tools\18.0.1’) Observed package id ‘buil
Gradle使用过程中遇到的bug
一Error:Execution failed for task ':<em>app</em>:preDebugAndroidTestBuild'.&amp;gt; Conflict with dependency 'com.<em>android</em>.support:support-annotations' in project ':<em>app</em>'. Resolved versions for <em>app</em> (26.1.0) and test ...
android高德地图编译出错,不知道为什么
高德地图编译出错,不知道为什么 高德地图编译出错,不知道为什么 Information:Gradle tasks [:<em>app</em>:clean, :<em>app</em>:generateDebugSources, :<em>app</em>:mockableAndroidJar, :<em>app</em>:prepareDebugUnitTestDependencies, :<em>app</em>:generateDebugAndroidTestSources, :...
org.gradle.api.tasks.TaskExecutionException: Execution failed for task ':app
runtime out 往往是手动删除了 <em>app</em>的build 导致 debug版本 运行apk失败,此<em>时</em>只要 打包一次release版本,<em>生成</em>build文件,再去运行debug版本 就 OK了 org.gradle.api.tasks.TaskExecutionException: Execution failed for task ':<em>app</em>:preDebugBuild'. a...
Information:Gradle tasks [:app:clean, :app:generateDebugSources和transformClassesWithJarMergingForDeb
Error:Execution failed for task ':BaiDuDiTu:transformClassesWithJarMergingForDebug'. > com.<em>android</em>.build.api.transform.TransformException: java.util.zip.ZipException: duplicate entry: com/baidu/locat
Android Studio 编译: Program type already present: XXX 解决方案
build.gradle 中 dependencies { classpath 'com.<em>android</em>.tools.build:gradle:3.1.1' // } 改成 dependencies { //目前最新版 classpath 'com.<em>android</em>.tools.build:gradle:3.1.2...
关于Android studio 报错:[clean, :app:generateDebugSources, :app:generateDebugAndroidTestSources, :app:mo
报错截图就不贴了,报错内容: Information:Gradle tasks [clean, :<em>app</em>:generateDebugSources, :<em>app</em>:mockableAndroidJar, :<em>app</em>:prepareDebugUnitTestDependencies, :<em>app</em>:generateDebugAndroidTestSources] Error:Some file crunc
Android Studio 运行项目出现Information:Gradle tasks异常解决办法。
在更新Android Studio2.0后,项目运行<em>出现</em>该异常:Information:Gradle tasks [:clean, :generateDebugSources, :mockableAndroidJar, :最后<em>解决</em>办法如下: 因为buildToolsVersion、buildToolsVersion、compileSdkVersion、targetSdkVersion、comp
Error:A problem occurred configuring project ':app'. > failed to find Build
<em>使用</em><em>android</em> <em>studio</em>进行build<em>时</em><em>出现</em>此错误Error:A problem occurred configuring project ':<em>app</em>'. > failed to find Build        <em>解决</em>方法为:修改build.grade中的 buildToolsVersion  调整为安装的sdk版本
Android Studio无法调试运行app解决
----------------------------------------------------------------------------------------------- 遇到的<em>问题</em>: <em>问题</em>1. 新建一个名为HelloWorld的project后无论链接真机调试还是用Android Studio自带的模拟器调试,均无任何结果,<em>app</em>安装不到真机或者模拟机上面。(注:真机和
gradle编译出错:Execution failed for task ':app:compileTestDebugJava'.
今天更新了<em>android</em> <em>studio</em>,从0.5.3升级到0.6.1版本,结果在IDE中编译<em>时</em>没有<em>问题</em>,但是在命令行<em>时</em>编译就会<em>出现</em>以下错误: :<em>app</em>:compileTestDebugJava FAILED FAILURE: Build failed with an exception. * What went wrong: Execution failed for task ':<em>app</em>:c
Studio编译报错Executing tasks: [clean, :app:generateDebugSources, :app:generateDebug
如题,<em>使用</em><em>android</em>Studio编译项目<em>时</em>报错Executing tasks: ,但是项目依然可以运行,是怎么回事,跪求大神指导。
Android Studio运行报错 Executing tasks: [:app:generateDebugSources]
Observed package id 'build-tools;18.1.0' in inconsistent location 'C:\Sdk\sdk\build-tools\<em>android</em>-4.
AndroidStudio3.1构建工程出错Failed to execute aapt
我是刚从Studio2.2升级到3.1,就<em>出现</em>这样的<em>问题</em>。如果不写 `<em>android</em>.enableAapt2=false` 就会<em>出现</em>build failed,但是写了的话还是无法<em>生成</em>apk。grad
Android app:generateDebugSources bug
在导入图片的<em>时</em>候<em>出现</em>一个bug,因为是在别的项目中copy过来的图片,就没注意直接<em>使用</em>了,但是报错 。错误如下: Information:Gradle tasks [:<em>app</em>:generateDebugSources, :<em>app</em>:generateDebugAndroidTestSources, :<em>app</em>:compileDebugSources, :<em>app</em>:compileDebugAndroidT
android studio 运行项目gradle出错
错误信息如下: Information:Gradle tasks [:<em>app</em>:clean, :<em>app</em>:generateDebugSources, :<em>app</em>:mockableAndroidJar, :<em>app</em>:prepa..此处省略 :slidingMenuLibrary:preDebugAndroidTestBuild UP-TO-DATE :slidingMenuLibrary:copy
android开发中build文件删除不了的问题
遇到的bug如下: Information:Gradle tasks [clean, :<em>app</em>:generateDebugSources, :<em>app</em>:generateDebugAndroidTestSources, :<em>app</em>:compileDebugSources, :<em>app</em>:compileDebugAndroidTestSources, :xutils:generateDebugSources
关于Android Studio里的Gradle,你所需要知道的都在这里了
关于Android Studio里的Gradle,你所需要知道的都在这里了 前言 你是不是有这种感觉,每当你<em>使用</em>Android Studio的<em>时</em>候,总会被她的优雅和便捷深深的吸引,但是一旦打开build.gradle文件就有一种想死的冲动,这尼玛都是什么啊,老子看不懂啦(ノಠ益ಠ)ノ彡┻━┻ ,不要着急,这篇文章就是来解救你的,看完这篇文章,你的种种疑问都会迎刃而解,从此与An
关于adnroidStudio一直提示Task 'generateDebugSources' not found in project ':app'
AS中踩的这个坑儿在项目中碰到了,我在gradle syc 之后<em>出现</em>了这个东西,而且无法再次syc , clean bulid 完全不在生效 即使执行也是提示Task ‘generateDebugSources’ not found in project ‘:<em>app</em>’。 后来注意到在代码框上方始终提示一个Gradle project syc in progress gradle 始终在syc
AS 多渠道打包 generateADebugSources
Error:FAILURE: Build failed with an exception. * What went wrong: Task 'generateADebugSources' not found in project ':<em>app</em>'. Some candidates are: 'generateUcDebugSources'. * Try: Run gradle
androidStudio出现Executing tasks: app:assembleDebug
打正式包<em>时</em>有<em>时</em>会<em>出现</em>Executing tasks: [:<em>app</em>:assembleDebug 错误。因为你gradle文件配置有<em>问题</em>。 例如我上次在module的gradle中添加了单元测试的配置信息,原则上正式版不应该包含测试信息testApplicationId“com.cn.skypiea.test" testInstrumentationRunner "<em>android</em>.test.Inst
Information:Gradle tasks [:app:assembleDebug]
在Android Studio编译的<em>时</em>候会<em>出现</em>下面的异常提示 Information:Gradle tasks [:<em>app</em>:assembleDebug] E:\Workspace\<em>android</em>\ZhengBaJing2\<em>app</em>\build\intermediates\res\merged\debug\values-v24\values-v24.xml Error:(3) Error retr
Information:Gradle tasks [:app:clean, :app:generateDebugSources, :app:mockableAndroidJar,关于.9图片的错误
导入eclipse项目,会<em>出现</em>这种错误,<em>解决</em>方法: 加入红框选择的代码即可:     aaptOptions.cruncherEnabled = false     aaptOptions.useNewCruncher = false
Executing tasks: [:app:clean, :app:generateDebugSources, :app:mockableAndroidJar, :app:prepareDebug
参考:(说是引用图片格式<em>问题</em>的)http://blog.csdn.net/reakingf/article/details/50785856     (说是AS与JDK1.8不兼容<em>问题</em>的)http://www.jianshu.com/p/af9fec8a746e      (网上大多数做法,但是不能<em>解决</em>我的<em>问题</em>的,添加两句接触AS对PNG图片格式的约束)http://blog.csdn.net
Gradle Tasks clear app:generateDebugSources,app:mockableAndroidJar app prepareDebugUnitTestDependenc
最近导入一个ecplise项目发现报错了,如上图, 有一些文件出错了,去看看代码果然,R文件报错了, R文件报错一般都是xml布局的<em>问题</em>,过去看了看没有什么<em>问题</em>呢,这个<em>时</em>候自己点击Gradle Consol 查看详情(或者在点击buid左边的小四方形也是查看详情的) 在底部看了看没感觉那个地方<em>出现</em><em>问题</em>,于是网上看发现有个图片<em>出现</em>了<em>问题</em>,.9图片,找原因了, 这个<em>问题</em>就是.9图片引起的R文件报
Androidstudio gradle失败了 更新最新的compile 如com.google.android.gms:play-services-maps:11.4.0
在更新最新的jar包的<em>时</em>候,gradle 失败了: 更改maven就可以了【maven { url "https://maven.google.com/"}】,再将最新的依赖库地址compile 如com.google.<em>android</em>.gms:play-services-maps:11.4.0 放进去就可以了; 【不是<em>使用</em>File--》project structure --<em>app</em> 添加依赖j
Android Gradle 配置问题
<em>问题</em>描述在<em>app</em>中引入以下内容后报错compile group: 'com.google.guava', name: 'guava', version: '23.5-<em>android</em>'报错内容Error:Execution failed for task ':<em>app</em>:preDebugAndroidTestBuild'. &amp;gt; Conflict with dependency 'com.googl...
(转)关于“:app:preDebugAndroidTestBuild'”
在新建布局文件的<em>时</em>候,页面显示:design editor is unavailable until a successful build(设计编辑器不可用,直到成功创建。)细看下面还有一行错误:Error:Execution failed for task ':<em>app</em>:preDebugAndroidTestBuild'.(':<em>app</em>:preDebugAndroidTestBuild'任务执行失败...
Error:Execution failed for task ':app:preDebugAndroidTestBuild'.
用AS新建项目的<em>时</em>候报这个错: &amp;gt; Conflict with dependency 'com.<em>android</em>.support:support-annotations' in project ':<em>app</em>'. Resolved versions for <em>app</em> (26.1.0) and test <em>app</em> (27.1.1) differ. See https://d.<em>android</em>.co...
Android实战技巧之十一:Android Studio和Gradle
经过两个多月的AS体验,我认为是<em>时</em>候将Android的开发环境迁移到AS上了。目前最新版本是1.0.2(大年30当天升级到1.1.0),除了UI控件拖拽偶尔崩溃的<em>问题</em>(Ubuntu),其他功能用来还是十分流畅和高效。打动我的有如下几个特色: 智能感知体验特好,堪比VS 布局预览,手写布局后预览页面即<em>时</em>显示,便于布局调整和优化 编辑速度飞快流畅,毫无eclipse的卡顿 布局或源码中有图标和...
AndroidStudio创建项目报错
最近想学习一下Andorid开发,<em>使用</em>AndoridStudio向导创建一个项目出错。 C:\Users\John\AndroidStudioProjects\HellowWorld\<em>app</em>\buil
将eclipse项目导入Androidstudio报错:Process 'command 'E:\sdk\build-tools\23.0.2\aapt.ex
求大神指点啊!!!!!! 我想把我的eclipse项目导入Android<em>studio</em>,已经搞了好长<em>时</em>间了,一直没搞出来,跪求大神指点啊!!!! 将eclipse项目导入Android<em>studio</em><em>时</em>报错
Android 混淆代码的出现问题
今天导出APK之前,对代码进行混淆处理,结果<em>出现</em>了以下<em>问题</em>。 ——————————————————————————————  Proguard returned with error code 1. See console  java.io.IOException: Can't read [C:\Users\Administrator\AppData\Local\Temp\<em>android</em>_3
Android之平遇见的异常和错误总结(不断更新)
安卓错误经验累积  1、当<em>出现</em>下面错误<em>时</em>候     08-21 03:43:16.679: E/AndroidRuntime(1087): java.lang.RuntimeException: Unable to start activity ComponentInfo{com.example.fragment/com.example.fragment.MainActivity}: andr
Android studio安装配置常见问题及其解决方案
Android Studio<em>使用</em>常见<em>问题</em>详解 ONE Goal,ONE Passion! 听到许多刚刚接触<em>studio</em>的童鞋抱怨,XX .这是什么鬼,这么难搞的东西.想运行一个hello world 都难. 我听到的最心碎的一句话就是: 搞了一个晚上.我只想运行出来一个hello world看看.其实<em>studio</em>并没有那么难用相信您看完,应该能成功运行一个hello world吧.不止hello
Android Studio NDK及so文件开发 以及常见错误
http://www.2cto.com/kf/201605/512334.html
win7用户帐户控制数据重定向
微软官方win7用户帐户控制数据重定向
Cmake 配置问题
<em>出现</em>以下<em>问题</em>: 之前一直是报undefined reference to __print_Log 打印log的类找不到。因为Cmake配置错误,不知道之前的错误是什么样子了。 最终的配置在后面。Error:FAILURE: Build failed with an exception.* What went wrong: Execution failed for task ':<em>app</em>:exter
这是什么意思 看不懂 ,A s 里面AIDL文件弄错了 包这个错误
Error:Execution failed for task ':<em>app</em>:compileDebugAidl'. > java.lang.RuntimeException: com.<em>android</em>.ide.common.process.ProcessException: Error while executing process C:\Users\dell\AppData\Local\Android\Sdk\build-tools\26.0.1\aidl.exe with arguments {-pC:\Users\dell\AppData\Local\Android\Sdk\platforms\<em>android</em>-25\framework.aidl -oE:\<em>android</em>Studio\ziwolianxi\kengdie\Pay1\<em>app</em>\build\generated\source\aidl\debug -IE:\<em>android</em>Studio\ziwolianxi\kengdie\Pay1\<em>app</em>\src\main\aidl -IE:\<em>android</em>Studio\ziwolianxi\kengdie\Pay1\<em>app</em>\src\debug\aidl -IC:\Users\dell\.<em>android</em>\build-cache\91a1a3afdbd4a364dfb47f78ec4003c37ec9f739\output\aidl -IC:\Users\dell\.<em>android</em>\build-cache\b8b1d8c6c02cce5fcbf9bae854d52452508cbc7c\output\aidl -IC:\Users\dell\.<em>android</em>\build-cache\8285ea810903feb082f1c4694f5a33720cabdcb8\output\aidl -IC:\Users\dell\.<em>android</em>\build-cache\d836d27870e1dc97cde740c3c5d05d70c1f17590\output\aidl -IC:\Users\dell\.<em>android</em>\build-cache\cc4b003899bada7b338f241c8434b923b229811d\output\aidl -IC:\Users\dell\.<em>android</em>\build-cache\42471075ec66394ede54964d5e064c5fce31fbab\output\aidl -IC:\Users\dell\.<em>android</em>\build-cache\44b23df0d72730a3fb60726d2b49b1ab3613e379\output\aidl -IC:\Users\dell\.<em>android</em>\build-cache\477d1820f9221c4a0345999e3308189f7a4a0aba\output\aidl -IC:\Users\dell\.<em>android</em>\build-cache\495208a08bb05f885e5453bba6e19d5dadc6188b\output\aidl -IC:\Users\dell\.<em>android</em>\build-cache\d15f5902e518c4ab551c553bebcee35f91f789f0\output\aidl -dC:\Users\dell\AppData\Local\Temp\aidl6540516008299528629.d E:\<em>android</em>Studio\ziwolianxi\kengdie\Pay1\<em>app</em>\src\main\aidl\com\example\dell\pay1\AIDL.aidl}
在中国程序员是青春饭吗?
今年,我也32了 ,为了不给大家误导,咨询了猎头、圈内好友,以及年过35岁的几位老程序员……舍了老脸去揭人家伤疤……希望能给大家以帮助,记得帮我点赞哦。 目录: 你以为的人生 一次又一次的伤害 猎头界的真相 如何应对互联网行业的「中年危机」 一、你以为的人生 刚入行<em>时</em>,拿着傲人的工资,想着好好干,以为我们的人生是这样的: 等真到了那一天,你会发现,你的人生很可能是这样的: ...
Silverlight 3.0 对联例子下载
Silverlight 3.0 对联例子 相关下载链接:[url=//download.csdn.net/download/takumo/2392202?utm_source=bbsseo]//download.csdn.net/download/takumo/2392202?utm_source=bbsseo[/url]
jsp servlet文件上传下载
jsp+servlet文件上传 相关下载链接:[url=//download.csdn.net/download/zengzhipeng1214/4261516?utm_source=bbsseo]//download.csdn.net/download/zengzhipeng1214/4261516?utm_source=bbsseo[/url]
Learning iOS Forensics(2nd) mobi下载
Learning iOS Forensics(2nd) 英文mobi 第2版 本资源转载自网络,如有侵权,请联系上传者或csdn删除 本资源转载自网络,如有侵权,请联系上传者或csdn删除 相关下载链接:[url=//download.csdn.net/download/u011433684/9994782?utm_source=bbsseo]//download.csdn.net/download/u011433684/9994782?utm_source=bbsseo[/url]
我们是很有底线的