fatal error: unistd.h: No such file or directory [问题点数:40分,结帖人enghui]

Bbs1
本版专家分:0
结帖率 100%
Bbs6
本版专家分:8357
Blank
红花 2016年7月 Linux/Unix社区大版内专家分月排行榜第一
2016年3月 Linux/Unix社区大版内专家分月排行榜第一
Blank
黄花 2016年12月 Linux/Unix社区大版内专家分月排行榜第二
linux常见致命错误(fatal error),解决办法:
Ubuntu18.04安装MATLAB2018a 图文教程 MATLAB作为一个基本的数学统计软件,guangz<em>h</em>i 激活 第一步 选择 第二步 sudo cp -f /<em>h</em>ome/yq/program/MATLABR2018aLinux64Crack/R2018a/bin/glnxa64/matlab_startup_plugins/lmgrimpl/libmwlmgrimpl.so /usr/l...
CentOS7Linux安装FastDFS报错fdfs_define.h:15:27: fatal error: common_define.h: No such file or directory
【更多资讯及资料获取,关注微信公众号号:浅醉JAVA】 在CentOS7 Linux安装FastDFS报错 /usr/include/fastdfs/fdfs_define.<em>h</em>:15:27: <em>fatal</em> <em>error</em>: common_define.<em>h</em>: <em>No</em> suc<em>h</em> <em>file</em> or <em>directory</em> 主要发生在以下步骤中: 1 配置,并加载fastdfs-nginx-module模块: ...
Ubuntu18.04安装gcc编译出现/usr/include/stdio.h:27:10: fatal error: bits/libc-header-start.h: 没有那个文件或目录编译中断
可以尝试输入sudoapt-get install gcc-multilib即可,其实主要是gcc安装环境没有安装完善。我在网上找了很多方式,没想到是这个,记录下。
fatal error: common_define.h: No such file or directory
/modules -I src/<em>h</em>ttp/v2 -I /usr/local/include \ -o objs/src/<em>h</em>ttp/modules/ngx_<em>h</em>ttp_upstream_zone_module.o \ src/<em>h</em>ttp/modules/ngx_<em>h</em>ttp_upstream_zone_module.c cc -c -pipe -O -W -Wall -Wpointer-arit<em>h</em> ...
报错解决:fatal error: json/json.h: No such file or directory
晚上在做编译原理作业的时候遇到了报错: AST<em>No</em>des.<em>h</em>:6:23: <em>fatal</em> <em>error</em>: json/json.<em>h</em>: <em>No</em> suc<em>h</em> <em>file</em> or <em>directory</em> #include &lt;json/json.<em>h</em>&gt; 这个报错的解决方法如下: sudo apt-get install libjsoncpp-dev sudo ln -s /usr/include/jsoncp...
unistd.h': No such file or directory" 的解决办法">VS 2015 报错 " 'unistd.h': No such file or directory" 的解决办法
使用 Visual Studio 2015 进行程序开发工作时,如果编译的是来自于Linux平台的源文件,该源文件可能会包含头文件 uninstd.<em>h</em>,这样会产生报错信息: "<em>fatal</em> <em>error</em> C1083: Cannot open include <em>file</em>: '<em>unistd</em>.<em>h</em>': <em>No</em> suc<em>h</em> <em>file</em> or <em>directory</em>" 解决办法: 在VS的安装目录下找到 "VC\includ...
报错: fatal error: check.h: No such file or directory
报错: ./src/tests.c:15:19: <em>fatal</em> <em>error</em>: c<em>h</em>eck.<em>h</em>: <em>No</em> suc<em>h</em> <em>file</em> or <em>directory</em> #include &amp;amp;lt;c<em>h</em>eck.<em>h</em>&amp;amp;gt; ^ compilation terminated. make: *** [example.o] Error 1 解决方法: sudo apt-get insta...
fatal error: hdf5.h: No such file or directory
在编译caffe的时候,可能会出现各种找不到文件的情况。这种情况的一种解决方式是改变Make<em>file</em>.config中的路径。 比如,在编译caffe的时候提醒找不到<em>h</em>df5.<em>h</em>或者<em>h</em>df5_<em>h</em>l.<em>h</em> , 错误提示为: ./include/caffe/util/<em>h</em>df5.<em>h</em>pp:6:18: <em>fatal</em> <em>error</em>: <em>h</em>df5.<em>h</em>: <em>No</em> suc<em>h</em> <em>file</em> or <em>directory</em> 这时使用命令 ...
src/cpp/cuda.hpp:14:18: fatal error: cuda.h: No such file or directory
Ubuntu 下在安装部分安装包,例如 Pycuda 时可能会遇到这个问题: src/cpp/cuda.<em>h</em>pp:14:18: <em>fatal</em> <em>error</em>: cuda.<em>h</em>: <em>No</em> suc<em>h</em> <em>file</em> or <em>directory</em> 下面以安装 pycuda 为例: 解决方法: sudo su export PATH=/usr/local/cuda-9.0/bin:/usr/local/cuda/bin...
怎么会出现fatal error的问题呢?
Could not create output <em>file</em> 'F:\分包产值统计程序\Project1.exe' 之前都可以运行编译的,我只是把edit2的passwordc<em>h</em>ar属性改成了*号,其余
/usr/include/stdio.h:27:10: fatal error: bits/libc-header-start.h: No such file or directory
sudo apt-get install gcc-multilib
Cannot open include file: 'unistd.h': No such file or directory的解决办法
在自己编译的include目录中,添加一个文件<em>unistd</em>.<em>h</em> 内容:   #ifndef _UNISTD_H #define _UNISTD_H #include &amp;lt;io.<em>h</em>&amp;gt; #include &amp;lt;process.<em>h</em>&amp;gt; #endif /* _UNISTD_H */ #define _UNISTD_H #include &amp;lt;io.<em>h</em>&amp;gt; #includ...
[解决]FastDFS安装Nginx的模块,fastdfs-nginx-module报错:fdfs_define.h:15:27: 致命错误:common_define.h:没有那个文件或目录
今天在想把fastdfs安装到虚拟机上,但是fastdfs在高版本中就已经抛弃了HTTP代理,所以只能用Nginx和它整合才能用(上传下载都可以,就是不能和以前一样上传个图片上去还能打开网页看得到) 结果fastdfs安装好了,nginx安装好了, 到了安装fastdfs-nginx-module的时候, 编译报错了 /usr/local/include/fastdfs/fdfs_defi...
g++ error cuda_runtime_api.h: No such file or directory
解决方法  在g++语句最后  加上 -I/usr/local/cuda/include  (libcudart.so所在的地方) g++ -g -std=c++11 -I/usr/local/cuda/include  
fdfs_define.h:15:27: fatal error: common_define.h: No such file or directory
可能发生的地方: ./configure --prefix=/usr/local/nginx --add-module=/usr/local/src/fastdfs-nginx-module/src/ 解决方案: 修改fastdfs-nginx-module/src/config文件,重新配置 修改完成后重新编译 ...
fatal error: common_define.h: No such file or directory 的解决办法
问题概述 在项目使用到了分布式文件服务器FastDFS,FastDFS的Tracker Server 和 Storage Server 安装完成后,需要外部的 Web Server来提供访问,有人可能会疑问,为什么不使用FastDFS内部的Web Server呢,我的另一篇文章非常详细的阐述了这个问题,请参看 《FastDFS分布式文件系统内部架构及其原理解析 》 这儿使用的是Fa...
./configure: No such file or directory
一般情况下,多看看目录下的readme和INSTALL文件,里面会告诉你怎么安装软件。 这里我目前知道可能有两种情况: 1、目录下没有configure,但有configure.am或configure.in时,需要用autoconf命令来生成configure。代码如下: $cd(软件名)-(版本号)$autoconf 2、此软件或库安装方式不是按以下套路来安装, $cd...
DataError: [-] Error: 2, No such file or directory
今天我在使用FastDFS客户端测试创建客户端对象执行上传文件的时候遇到了一点小问题. 我进入到了交互环境, 过程如下图: 测试文件的路径以及配置什么的都没有问题, 但是还是出出现了这样的错误提示: 竟然提示 DataError (数据错误), 但是文件确确实实在当前路径, 我关闭了交互环境, 又重新操作了一遍, 还是同样的错误提示!!于是乎,原本以为编辑器错误的我重新检查了自己的操作流程: ...
Linux 标准库下的unistd.h
<em>unistd</em>.<em>h</em>在unix中类似于Window中的windows.<em>h</em>! #ifdef WIN32 #include #else #include #endif <em>unistd</em>.<em>h</em>含有的常量与函数: ssize_t        read(int, void *,size_t); ssize_t        write(int, const void *,size_t);
gcc 关于fatal error: stdio.h: No such file or directory #include的问题
鄙人用的ubuntu 14.04 服务器版 到网上找了老半天,说是需要安装 libc6-dev  然后apt-get install libc6-dev了一下,居然说:  Depends: libc6 (= 2.19-0ubuntu6.13) but 2.19-10ubuntu2 is to be installed 然后网上各种巴拉巴拉的解决方法都无效,but,这种可以: apt-g
fatal error
/<em>h</em>ome/wind/prj/apps/s<em>h</em>aredmem/lib/s<em>h</em>m_rpc_manager.cpp:12:55: <em>fatal</em> <em>error</em>: generated/flatbuffers/StatusCtl_generated.<em>h</em>: <em>No</em> suc<em>h</em> <em>file</em> or <em>directory</em> compilation terminated. s<em>h</em>aredmem/CMakeFiles/s<em>h</em>aredmem...
怎么会没有这头文件的,急!!!
有一个C文件 里面#include了一些头文件,但系统找不到这些头件,要怎么做才行 以下是系统里没有的头文件 #include #include #i
Linux驱动——fatal error: asm/system.h: No such file or directory 如何解决
写字符设备驱动程序时,出现错误:<em>fatal</em> <em>error</em>: asm/system.<em>h</em>: <em>No</em> suc<em>h</em> <em>file</em> or <em>directory</em>错误信息可知,缺少此头文件原因:        Linux内核是不断地更新换代,即3.3版本之后内核用switc<em>h</em>_to.<em>h</em>替换了曾经的system.<em>h</em>头文件。解决方法:        可在终端输入uname -r,查看自己Linux内核版本。如,我的内核版本是4...
fatal error LNK1181: 无法打开输入文件 错误
vs2008 编译一个软件 错误 1 <em>fatal</em> <em>error</em> LNK1181: 无法打开输入文件“nafxcw.lib;LIBCMT.lib;../common/zlib/zlib.lib” 是不是
/var/tmp/swoole/include/swoole.h:427:25: fatal error: openssl/ssl.h: No such file or directory #inc
此错误就是要安装openssl 如何安装本博客有啦 <em>h</em>ttps://blog.csdn.net/weixin_41858542/article/details/81220160
fatal error: curses.h: No such file or directory的解决办法
编译openwrt/lede固件中的s<em>h</em>adowsocks-libev的过程中: 输入下面的命令后 $ make menuconfig 提示再次使用 $ make menuconfig -j1 V=s 获得错误提示: <em>fatal</em> <em>error</em>: curses.<em>h</em>: <em>No</em> suc<em>h</em> <em>file</em> or <em>directory</em> 解决方法: sudo apt-get install libncurses5-...
fatal error: nsync*.h: No such file or directory的解决方式
错误种类: from /usr/local/lib/pyt<em>h</em>on2.7/dist-packages/tensorflow/include/tensorflow/core/framework/op.<em>h</em>:32 <em>fatal</em> <em>error</em>: nsync_time.<em>h</em>: <em>No</em> suc<em>h</em> <em>file</em> or <em>directory</em> 解决方案: copying nsync*.<em>h</em> from dist-package...
fatal error: stdio. h :no such file or directory
-
windows环境下unistd.h缺失解决方法
自建一个<em>unistd</em>.<em>h</em> 文件内容为#ifndef _UNISTD_H#define _UNISTD_H #include #include #endif /* _UNISTD_H */ 当然,如果可以方便地修改源码,直接在文件里包含io.<em>h</em>与process.<em>h</em>也是可行的
VS 2015 写c++无法打开源文件
-
这个错误是怎么回事?1>LINK : fatal error LNK1168: 无法打开 ,
1>LINK : <em>fatal</em> <em>error</em> LNK1168: 无法打开 D:\我的文档\My Documents\Visual Studio 2010\coding\test\Debug\test.ex
fatal error C1083: 无法打开包括文件: “opencv2/nonfree/nonfree.hpp”: No such file or directory
-
【已解决】【亲测有效】植物大战僵尸全屏时报错:Fatal Error!
描述: 博主的《植物大战僵尸》之前可以全屏,后来切换为窗口模式,想再切换为全屏时报图1错误,此时点开任务栏图标时,会发现如图2错误: 解决: 1. 右键点击游戏图标,就是下图圈出来的这个(第一张是英文版,第二张是中文版),然后选择属性 2...
fatal error: alsa/asoundlib.h: No such file or directory 解决办法
最近在ROS里编译调用了科大讯飞SDK的语音包,编译时报了错误 <em>fatal</em> <em>error</em>: alsa/asoundlib.<em>h</em>: <em>No</em> suc<em>h</em> <em>file</em> or <em>directory</em>, 找不到asoundlib.<em>h</em>文件,解决办法如下,直接apt安装那个库就行了 sudo apt-get install libasound2-dev 编译通过。...
错误 1 fatal error C1083: 无法打开包括文件:“cuda.h”: No such file or directory
无法打开"cuda.<em>h</em>"。cuda.<em>h</em>这个头文件在哪个文件夹里?还有cuda_runtime_api.<em>h</em>? 希望高人不吝赐教!多谢!
apr-util-1.6.1 报错xml/apr_xml.c:35:19: fatal error: expat.h: No such file or directory
apr-util-1.6.1 报错xml/apr_xml.c:35:19: <em>fatal</em> <em>error</em>: expat.<em>h</em>: <em>No</em> suc<em>h</em> <em>file</em> or <em>directory</em>解决方法(缺少expat库)yum install expat-deve -y
vs2012opencv路径已配置好但无法打开包括文件:“opencv2/opencv.hpp”
-
fatal error C1189: #error 如何修改通过编译?
编译环境 VC++.net2005环境,在编译某dll时出现如下错误提示: 错误 1 <em>fatal</em> <em>error</em> C1189: #<em>error</em> : Building MFC application wit<em>h</em>
hon\python36-32\python.exe"">Fatal error in launcher: Unable to create process using '"c:\python\python36-32\python.exe"
遇到的问题:Fatal <em>error</em> in launc<em>h</em>er: Unable to create process using '&quot;c:\pyt<em>h</em>on\pyt<em>h</em>on36-32\pyt<em>h</em>on.exe&quot;  &quot;C:\Pyt<em>h</em>on36\Pyt<em>h</em>on36-32\Scripts\pip.exe&quot; ' 具体原因:pip的环境变量更改了位置或者路径出错 解决方案:在命令行输入任意一个 1.pyt<em>h</em>on -m p...
pip Fatal error in launcher: Unable to create process using
接上篇“Eclipse启动报错:JVM terminated. Exit code=2”,今天把Pyt<em>h</em>on的安装位置也从C盘剪切到了D盘, 然后修改了Pat<em>h</em>环境变量中对应的盘符:D:\Pyt<em>h</em>on27\;D:\Pyt<em>h</em>on27\Scripts; 不管是在哪个目录,Pyt<em>h</em>on可以执行了,但是执行Pip的时候就出错了! D:\Pyt<em>h</em>on27\Scri...
fatal error: jpeglib.h: No such file or directory
arm-linux-gcc main.c picture.c -o picture In <em>file</em> included from picture.c:1: picture.<em>h</em>:9: <em>fatal</em> erro
GNU Linux 64位系统中fatal error: stdio.h: 没有那个文件或目录的错误的解决方法
在64位系统中,编写一个C语言程序后,使用gcc进行编译时,出现了如下的错误: test.c:1:19: <em>fatal</em>  <em>error</em>: stdio.<em>h</em>: 没有那个文件或目录 #include 针对以上的情况,对于在32环境下一般不会出现这个问题,因为已经把libc的头文件包括在系统中了,那么针对这样的情况,主要检查是否安装了完备的开发环境: build-essential pack
VS下编译 缺少unistd.h的解决方法
许多在Linux下开发的C程序都需要头文件<em>unistd</em>.<em>h</em>,但VC中没有个头文件, 所以用VC编译总是报错。把下面的内容保存为<em>unistd</em>.<em>h</em>,可以解决这个问题。 /** T<em>h</em>is <em>file</em> is part of t<em>h</em>e Mingw32 package. <em>unistd</em>.<em>h</em> maps (roug<em>h</em>ly) to io.<em>h</em> */ #ifndef _UNISTD_H #define _UNISTD_H...
opencv运行出现问题cv::exception该如何解决?
-
[ubuntu] ubuntu13.04 64bit,安装FastDFS4.06过程遇到的问题和解决方案
执行 ./make.s<em>h</em> 发生 ../common/sc<em>h</em>ed_t<em>h</em>read.o: In function `sc<em>h</em>ed_start': /media/My_Documents/tutorial/FastDFS/tracker/../common/sc<em>h</em>ed_t<em>h</em>read.c:495: undefined reference to `pt<em>h</em>read_create' ../common...
Linux 安装apache 及遇到的问题 【详解,问题已解决】
额,先心痛一下我安装apac<em>h</em>e的经历,基本上该遇到的问题都遇着了,安装部分我简单明了一点,重点是解决安装遇到的问题 首先声明:安装apac<em>h</em>e有两种方法,其中 yum install <em>h</em>ttpd 相对简单,这里是对另外一种手动安装方式进行详解。 第一步:下载apac<em>h</em>e安装包并解压(后面下载的文件统一下载到/usr/local/下面) <em>h</em>ttp://<em>h</em>ttpd.apac<em>h</em>e.org/...
fatal error: ignition/math/Inertial.hh: No such file or directory解决方法
gazebo7 /usr/include/gazebo-7/gazebo/msgs/msgs.<em>h</em><em>h</em>:24:37: <em>fatal</em> <em>error</em>: ignition/mat<em>h</em>/Inertial.<em>h</em><em>h</em>: <em>No</em> suc<em>h</em> <em>file</em> or <em>directory</em> 原因:升级gazebo后缺少依赖库 解决:sudo apt-get install libignition-mat<em>h</em>2-dev T<em>h</em>at made ...
Microsoft Visual Studio下编译缺少头文件unistd.h解决办法
许多在Linux下开发的C程序都需要头文件<em>unistd</em>.<em>h</em>,但VC中没有个头文件, 所以用VC编译总是报错。把下面的内容保存为<em>unistd</em>.<em>h</em>,可以解决这个问题。/** T<em>h</em>is <em>file</em> is part of t<em>h</em>e Mingw32 package. * <em>unistd</em>.<em>h</em> maps (roug<em>h</em>ly) to io.<em>h</em> */ #ifndef _UNISTD_H #define _UN
fatal error LNK1169: 找到一个或多个多重定义的符号
#ifndef _VALUAT_H #define _VALUAT_H class Valuat { public: Valuat(); ~Valuat(); virtual void LabourC
Fatal error: Uncaught exception 'ImagickException' with message 'Compositing ima
$image_name4=$Process.'4.gif'; $inimg3=$Process.'1.jpg'; $animation3 = new Imagick(); $animation3->
linux 安装Apache make报错mod_proxy_balancer.c:25:24: fatal error: apr_escape.h: No such file or director
刚开始我使用的是 <em>h</em>ttpd-2.4.34.tar.gz 报mod_proxy_balancer.c:25:24: <em>fatal</em> <em>error</em>: apr_escape.<em>h</em>: <em>No</em> suc<em>h</em> <em>file</em> or director错误,之后换   <em>h</em>ttpd-2.4.34.tar.bz2 还报同样的错误,看到前辈的文档<em>h</em>ttp://www.wanjis<em>h</em>u.com/p/zn6v8T180330.<em>h</em>tml,编译...
解决 :fatal error: cuda_runtime.h: No such file or directory
首先 ,查看你的~/.bas<em>h</em>rc 文件 里面有没有 export PATH="/usr/local/cuda-9.0/bin:$PATH" export LD_LIBRARY_PATH="/usr/local/cuda-9.0/lib64:$LD_LIBRARY_PATH" 其次看看你的make<em>file</em>文件是否对cuda的地址是/usr/local/cuda-9.0 有的默认是/usr/...
linux标准库#include
#include    符号常量 是POSIX标准定义的unix类系统定义符号常量的头文件,包含了许多UNIX系统服务的函数原型,例如read函数、write函数和getpid函数 <em>unistd</em>.<em>h</em>在unix中类似于window中的windows.<em>h</em>! #ifdef WIN32 #include #else #include #endif <em>unistd</em>.<em>h</em>含
linux下fatal error: opencv2/opencv.hpp: 没有那个文件或目录
我是在安装stasm出现的错误 sudo apt-get install libopencv-dev pip install stasm
hisiv400+glibc-2.23编译
记录: 首先从gnu官网下载最新版的glibc,地址<em>h</em>ttp://www.gnu.org/software/libc/  $tar xvf glibc-2.23.tar.bz $cd glibc-2.23 $.configure --prefix=/user1/yueyc/<em>h</em>isi-glibc-2.23 --<em>h</em>ost=arm-linux --enable-add-o
无法打开包括文件:opencv2\contrib\contrib.hpp
-
VS编译缺少unistd.h头文件
许多在Linux下开发的C程序都需要头文件<em>unistd</em>.<em>h</em>,但VC中没有这个头文件,所以用VC编译总是报错。把下面的内容保存为<em>unistd</em>.<em>h</em>,可以解决这个问题。 /** T<em>h</em>is <em>file</em> is part of t<em>h</em>e Mingw32 package. * <em>unistd</em>.<em>h</em> maps (roug<em>h</em>ly) to io.<em>h</em> */ #ifndef _UNISTD_H #define _UNIST...
Fatal error: Cannot 'break' 2 levels in
p<em>h</em>pmyadmin导出时提示这个错误 Fatal <em>error</em>: Cannot ‘break’ 2 levels in …在多少行 解决办法是,按照错误提示的文件,及所在的行号位置,把break 2; 改为 break;即可
fatal error: stdio.h: No such file or directory
<em>h</em>ttps://askubuntu.com/questions/937117/c-stdio-<em>h</em>-no-suc<em>h</em>-<em>file</em>-or-<em>directory</em> sudo apt install --reinstall gcc-5.4 or First run: find /usr/include/ -name "stdio.<em>h</em>" if no <em>file</em>s retur...
Fatal error: Declaration of must be compatible with
eclipse p<em>h</em>p include pat<em>h</em> p<em>h</em>alconide 报错 Fatal <em>error</em>: Declaration of rule\validator\IsNumValidator::validate() must be compatible wit<em>h</em> P<em>h</em>alcon\Validation\Validator::validate(P<em>h</em>alcon\Validation $validati...
Fatal error: Can't open and lock privilege tables: Table 'mysql.user' doesn't exist
Fatal <em>error</em>: Can’t open and lock privilege tables: Table ‘mysql.user’ doesn’t exist
ubuntu下如下错误alsa/asoundlib.h: No such file or directory
sudo apt-get install libasound2-dev
error: cuda_runtime.h: No such file or directory 和undefined reference to `cudaSetDevice'
使用cuda的gcc编译错误: <em>error</em>: cuda_runtime.<em>h</em>: <em>No</em> suc<em>h</em> <em>file</em> or <em>directory</em> 和undefined reference to `cudaSetDevice’。 解决办法,加载cuda 的lib。 gcc singleProcess.cpp -o singleProcess -L/usr/local/cuda/lib64 -lcudart -...
fatal error:xxx.h no such file or directory 解决方案
编译程序的时候遇到了找不到依赖包的问题,找了很多解决方案都没有解决,最后摸索了很久才解决,把过程记录下来方便以后用。 碰到这种问题,首先是要找有没有可安装的依赖包,命令为: apt-cac<em>h</em>e searc<em>h</em> xxx | grep dev 用dev过滤是因为有时候相关的安装包有很多,所以过滤一下 过滤之后直接安装给出的包就好 如果能无错下载一般就没有后面的问题了,但
VS2015 fatal error LNK1104: 无法打开文件“kernel32.lib”
VS2015 装了Boost 测试程序时,报错 <em>fatal</em> <em>error</em> LNK1104: 无法打开文件“kernel32.lib” 附加依赖项已经添加了
fatal error C1004: unexpected end of file found这是啥错误呀!
我写了几个程序都遇到    <em>fatal</em> <em>error</em> C1004: unexpected end of <em>file</em> found 我不知道他所谓的非正常结束是啥意思呀!我看了程序!语法上没错呀! 还请大虾们
cusparse.h: No such file or directory compilation terminated.
在使用pyt<em>h</em>on setup.py build develop安装awesome-semantic-segmentation-pytorc<em>h</em>碰到了如下问题: In <em>file</em> included from /xxx/awesome-semantic-segmentation-pytorc<em>h</em>/core/nn/csrc/cuda/syncbn_cuda.cu:5:0: /usr/local/lib/py...
C++中随机数模块的使用,以及完成一个0-100的随机数组;
C语言/C++里没有自带的random(int number)函数。 (1)  如果你只要产生随机数而不需要设定范围的话,你只要用rand()就可以了:rand()会返回一随机数值, 范围在0至最大随机数。                                                    rand()保存在#include&amp;lt;stdlib.<em>h</em>&amp;gt;的头文件 #in...
Linux下批处理文件存在却报错:no such file or directory
如果确定文件存在,执行却报错误:no suc<em>h</em> <em>file</em> or <em>directory</em>一般都是因为这个文件时从windows或者其他系统上面上传过来的,解决办法也很简单,删除之后在Linux环境下重写一份,如果文件过长的话就只新建空文件,然后远程编辑即可。...
... fatal error LINK1120:1个无法解析的外部命令 的解决办法
前言首先说这是一个链接错误而不是编译错误,造成这种问题的根本原因就是找得到函数的声明,但是找不到函数的实现,这是最根本的,具体的表现形式有很多,我们稍后再做分析,下面来见识一下我查了一下午的这个问题。问题分析因为之前发生过类似的问题,我已经解决过,所以当看到这个问题的时候还是一下就断定了,就是函数的实现没找到,产生这种现象的最常见情况就是工程项目中没有将cpp文件包含进来,我前前后后检查了好几遍,发
shell中ftp上传文件时,总是报No Such File or directory
我的语句是这样的:!find ./* -mtime 0 -exec put {} \;目的是将当天修改过的文件备份到别的地方。find结果正确,单独put也是可以的,可是上面这一句执行后就报错:fin
Ubuntu18.04 编译出现fatal error: bits/libc-header-start.h: No such file or directory
apt-get install gcc-multilib , 环境没有完善
LINK : fatal error LNK1104: 无法打开文件“mfc140ud.lib”
-
Linux内核编译时出现fatal error: openssl/opensslv.h: No such file or directory错误的解决办法
参考:1、<em>h</em>ttps://stackoverflow.com/questions/46008624/<em>h</em>ow-to-fix-<em>fatal</em>-<em>error</em>-openssl-opensslv-<em>h</em>-no-suc<em>h</em>-<em>file</em>-or-<em>directory</em>-in-red<em>h</em>at/2、<em>h</em>ttp://ask.xmodulo.com/fix-<em>fatal</em>-<em>error</em>-openssl.<em>h</em>tml<em>fatal</em> <em>error</em>: openss...
fatal error: linux/compiler-gcc7.h: No such file or directory
最近学习uboot,下载了uboot2013.01版本,arm-linux-gcc是gcc-linaro-7.3.1-2018.05-x86_64_arm-linux-gnueabi,从linaro官网下载的。   下面是我编译的时候遇见的问题总会: 1. 解决办法: 安装库 sudo apt-get install linux-libc-dev-arm64-cross 2.上...
zlib安装和使用 linux
zlib的安装与使用 zlib是一个很好的压缩解压缩库,今天我们分别介绍如何在Linux与Windows上安装与使用: 一:Linux平台 首先看看自己的机器上是不是已经安装好zlib了: w<em>h</em>ereis zlib 如果安装好了,会输出zlib的路径,这样直接跳过前2步。 1. 在<em>h</em>ttp://www.zlib.net/下载zlib的最
fatal error C1189: #error : EasyX is only for C++
在做俄罗斯方块的程序时 编译提示 <em>fatal</em> <em>error</em> C1189: #<em>error</em> : EasyX is only for C++ 错误出现在 easyx.<em>h</em> 文件里 求大神指导!怎么编译通过 附
error LNK1104: 无法打开文件“ws2_32.lib”
小白求教加了#pragma comment(lib,"ws2_32.lib")怎么还会报错呢 另外我的VS2013怎么没有winsock2.<em>h</em>
opencv头文件打不开,为什么 ?
-
stdio.h:No such file or directory
1.用VI 编辑器新建了一个<em>h</em>ello1.c的源文件 2.用gcc进行编译,出现报错 :stdio.<em>h</em>:<em>No</em> suc<em>h</em> <em>file</em> or <em>directory</em> 3.上网查了一下,有一种解决方案是在当前目录
如何解决fatal error C1083: Cannot open include file: 'unistd.h': No such file or dir
在Linux下开发的C程序都需要头文件<em>unistd</em>.<em>h</em>,但VC中没有个头文件,所以用VC编译总是报错。把下面的内容保存为<em>unistd</em>.<em>h</em>,可以解决这个问题。 /** T<em>h</em>is <em>file</em> is part
fatal error: hdf5.h: 没有那个文件或目录”解决方法
Step 1在Make<em>file</em>.config文件的第85行,添加/usr/include/<em>h</em>df5/serial/ 到 INCLUDE_DIRS,也就是把下面第一行代码改为第二行代码。INCLUDE_DIRS := $(PYTHON_INCLUDE) /usr/local/includeINCLUDE_DIRS := $(PYTHON_INCLUDE) /usr/local/include /us...
fatal error C1083: 无法打开包括文件:“jni.h”: No such file or directory
今天开发一个java调用C++的demo,本人不会C++,在网上看了下方法照着做,生成DLL时候报错,求指导,谢谢!!!!!!!!!!! 可是我文件放到项目里面去了啊,项目目录放了的。。。。。怎么回事
fatal error: Python.h: 没有那个文件或目录 解决方法
这几天安装scrapy 先说下环境  虚拟机Ubuntu16.04   系统默认Pyt<em>h</em>on 2.7.12 ,系统还自带3.5版本的,后来自己又装了3.6版本。 在系统安装过程中,总是到twisted时报错,因为是源码安装的,所以系统要进行编译,但是找不到pyt<em>h</em>on.<em>h</em>文件!!! 报错如下 creating build/temp.linux-x86_64-2.7/sr
C:\My Documents\bmp_in2\Sdkmdi\SDKMDI.rc(10) : fatal error RC1015: cannot open include file 'afxres.h'.
<em>h</em>ow to do ?
fatal error: mysql++.h: No such file or directory
启动提示:<em>fatal</em> <em>error</em>: mysql++.<em>h</em>: <em>No</em> suc<em>h</em> <em>file</em> or <em>directory</em>。 在网上找了很多方法都没有解决,请大牛帮忙解决!
fastdfs使用nginx出现的问题
3.解决报错         make的时候会报一下错误,         root/fastdfs-nginx-module/src//common.c:21:25: <em>fatal</em> <em>error</em>: fdfs_define.<em>h</em>: <em>No</em> suc<em>h</em> <em>file</em> or <em>directory</em>  #include "fdfs_define.<em>h</em>"                         ^ comp
新人求救。。python No such file or directory 问题
import sys sys.pat<em>h</em>.append('../') import jieba import jieba.analyse from optparse import OptionParse
vs2010 出错:error LNK1123: 转换到 COFF 期间失败: 文件无效或损坏
“<em>error</em> LNK1123: 转换到 COFF 期间失败: 文件无效或损坏”的解决方法,包括:1.修改配置;2.用新版cvtres.exe替换旧版cvtres.exe;3.删除Microsoft Visual Studio 10.0\VC\bin中的cvtres.exe三种方式。
fatal error LNK1107: 文件无效或损坏: 无法在 0x278 处读取
我在msdn上查NetUserGetInfo看到的例子 #ifndef UNICODE #define UNICODE #endif #include #include <wind
fatal error: usb.h: No such file or directory 解决办法
编译报错: <em>fatal</em> <em>error</em>: usb.<em>h</em>: <em>No</em> suc<em>h</em> <em>file</em> or <em>directory</em> 解决办法: apt-get install libusb-dev
Fatal error: This file has expired
我自己写的程序,一切运行正常 安装ZendOptimizer-3.2.6后出现问题 Fatal <em>error</em>: T<em>h</em>is <em>file</em> <em>h</em>as expired. in d:\usr\www\bbs\inst
Fatal error: ENOSPC: System limit for number of file watchers reached, watch '...path...'
某前端工程在 Ubuntu18.04 系统环境中运行 npm run dev 命令时出现如下错误 解决方案 在终端按顺序执行下面两个命令即可解决问题 ec<em>h</em>o fs.inotify.max_user_watc<em>h</em>es=524288 | sudo tee -a /etc/sysctl.conf &amp;&amp; sudo sysctl -p sudo sysctl --system 这种问题不是...
Parse error 什么意思
Parse <em>error</em> 什么意思
fatal error LNK1120: 1 个无法解析的外部命令
-
修复window7右键菜单没有新建记事本下载
修复打开右键菜单新建中没有记事本的问题,在win7上实验成功,希望对大家有用 相关下载链接:[url=//download.csdn.net/download/fengxinyixiao/2801638?utm_source=bbsseo]//download.csdn.net/download/fengxinyixiao/2801638?utm_source=bbsseo[/url]
维语维语句子分析系统下载
这是一个维语句子分析系统。值得下载用啊 提供的是系统和源代码 相关下载链接:[url=//download.csdn.net/download/ablat0530/2916074?utm_source=bbsseo]//download.csdn.net/download/ablat0530/2916074?utm_source=bbsseo[/url]
vss 客户端下载
Dynamsoft SourceAnywhere for VSS 5.2 Professional Client.rar 是源代码管理很好的工具,适合团队开发是管理源代码,安全,方便。 相关下载链接:[url=//download.csdn.net/download/amanda1211/4729362?utm_source=bbsseo]//download.csdn.net/download/amanda1211/4729362?utm_source=bbsseo[/url]
相关热词 c# oracle 开发 c#选择字体大小的控件 c# usb 批量传输 c#10进制转8进制 c#转base64 c# 科学计算 c#下拉列表获取串口 c# 如何防止参数被修改 c#开发微信公众号例子 c# null
我们是很有底线的