Android studio中transformClassesWithMultidexlistForDebug FAILED [问题点数:40分,无满意结帖,结帖人XIADANXIN]

Bbs1
本版专家分:0
Blank
GitHub 绑定GitHub第三方账户获取
结帖率 100%
Bbs1
本版专家分:0
Blank
GitHub 绑定GitHub第三方账户获取
Bbs6
本版专家分:6122
Blank
红花 2016年10月 移动开发大版内专家分月排行榜第一
2016年7月 移动开发大版内专家分月排行榜第一
Blank
黄花 2016年8月 移动开发大版内专家分月排行榜第二
Blank
蓝花 2016年9月 移动开发大版内专家分月排行榜第三
Bbs6
本版专家分:6122
Blank
红花 2016年10月 移动开发大版内专家分月排行榜第一
2016年7月 移动开发大版内专家分月排行榜第一
Blank
黄花 2016年8月 移动开发大版内专家分月排行榜第二
Blank
蓝花 2016年9月 移动开发大版内专家分月排行榜第三
Bbs1
本版专家分:0
Blank
GitHub 绑定GitHub第三方账户获取
Bbs1
本版专家分:0
Bbs1
本版专家分:0
Bbs1
本版专家分:0
Bbs1
本版专家分:0
Blank
GitHub 绑定GitHub第三方账户获取
Bbs1
本版专家分:0
android:程序build的时候无错,运行出异常
-
[Android studio]关于Gradle 编译报错 - Error while generating the main dex list问题的解决方案之一
引起Error while generating the main dex list的原因有很多,主要是引用的包冲突了。 但是在开发<em>中</em>,本人遇到了一种特殊的情况,在此记录一下。 问题背景:        本人进行多模块的项目开发,在项目前期一直是引用的module。但是在项目后期,打算将module打包成jar文件进行依赖。 问题描述:         在build.gradle文件<em>中</em>可...
有谁遇到过这种问题吗,Error:Execution failed for task ':app:transformClassesWithDexForDebug
Error:Execution failed for task ':app:transformClassesWithDexForDebug'. > com.android.build.api.tran
错误 Failed resolution of: Landroid/support/v7/internal/widget/TintManager;解决办法
今天在用design包的tablayout跟viewpager配合使用时,碰到了一个问题,一直报如下错误: telayout E/<em>Android</em>Runtime: FATAL EXCEPTION: main Process: com.ress.customercoordinatelayout, PID:
问题记录:Execution failed for task ':app:transformClassesWithMultidexlistForRelease
1. 报错log Execution failed for task ':app:transformClassesWithMultidexlistForRelease Caused by: com.android.build.api.transform.TransformException: Error while generating the main dex list. 2. 现象 直接...
编译异常:Execution failed for task ':app:transformClassesWithMultidexlistForDebug'.
Execution failed for task ‘:app:<em>transformClassesWithMultidexlistForDebug</em>’. com.android.build.api.transform.TransformException: Error while generating the main dex list 这个问题多半是依赖重复导致的 在android <em>studio</em>...
com.android.build.api.transform.TransformException: Error while generating the main dex list.
一般是引入第三方jar重复导致冲突引起 删除重复即可 或者仔细阅读第三方jar处理或者咨询客服
app:transformClassesWithMultidexlistForDebug
是否遇到了以下问题,就是他: Error:FAILURE: Build failed with an exception. * What went wrong: Execution failed for task ':app:<em>transformClassesWithMultidexlistForDebug</em>'. &gt; com.android.build.api.transform.Transf...
Android 使用android-support-multidex解决Dex超出方法数的限制问题,让你的应用不再爆棚
随着应用不断迭代,业务线的扩展,应用越来越大(比如集成了各种第三方sdk或者公共支持的jar包,项目耦合性高,重复作用的类越来越多),相信很多人都遇到过如下的错误: UNEXPECTED TOP-LEVEL EXCEPTION: java.lang.IllegalArgumentException: method ID not in [0, 0xffff]: 65536 没错,你的应用<em>中</em>的Dex 文件方法数超过了最大值65536的上限,简单来说,应用爆棚了. 那么让我们看一下为什么会引起这种
Flutter 运行不了app:transformClassesWithMultidexlistForDebug错误!
Exit code 0 from: F:\<em>Android</em>\sdk\platform-tools\adb.exe -s emulator-5554 shell -x logcat -v time -t 1 --------- beginning of main WifiForwarder unable to open QEMU pipe: Invalid argument executing: F...
android studio 编译通过,打包时报错
-
Execution failed for task ':app:transformClassesWithMultidexlistForDebug
引用包出现如下问题 : 要不添加  multiDexEnabled true 要不就删除  multiDexEnabled true 就可以解决问题 FAILURE: Build failed with an exception. * What went wrong: Execution failed for task ':app:transformClassesWithMultidexl...
androidError:Execution failed for task ':app:transformClassesWithDexForDebug'.
昨天经理让更新项目<em>中</em>含有的激光推送的jar包,起初想的是挺简单的,毕竟之前也接触过,不就是按照激开发里面的文档一步一步来,看下面的地址。 https://docs.jiguang.cn/jpush/client/<em>Android</em>/android_guide/ 事实并非是这样,意想不到的错误就会突然来袭!!! Error:Execution failed for task ':app:trans...
Error:Execution failed for task ':app:transformClassesWithMultidexlistForDeb
不说了,分个包吧! 1添加依赖: //65536 implementation 'com.android.support:multidex:1.0.3' 2APP下build.gradle添加声明: defaultConfig { multiDexEnabled true } dexOptions { jav...
:app:transformClassesWithMultidexlistForDebug FAILED
项目没问题,编译报错,也没有重复的jar包,我这边出现的问题是 "multiDexEnabled" declared twice 在app build.gradle里面把  multiDexEnabled true 这句话去掉然后问题就解决了
com.android.build.api.transform.TransformException:解决办法
遇到了一个这样的错误:com.android.build.api.transform.TransformException:java.util.zip.ZipException:duplicate entry:com/alibaba/fastjson/JSONWriter.class    这实际上是一个引用jar 包冲突的问题,解决方法就是根据错误的路径信息检查项目<em>中</em>所有的jar包,
Error while generating the main dex list
 jar 包冲突 我的遇到这个的原因是因为v7包 包含v4 所以把v7去掉就解决了
com.Android.build.api.transform.TransformException:Java.util.zip.ZipException异常
异常:com.<em>Android</em>.build.api.transform.TransformException:Java.util.zip.ZipException
Error:Execution failed for task ':app:transformClassesWithDexForDebug&#
Error:Execution failed for task ':app:transformClassesWithDexForDebug&#     3个错误non-zero exit value 1; non-zero exit value 2; non-zero exit value 3 Error:Exec
Execution failed for task ':app:transformClassesWithDexForRelease'
Execution failed for task’:app:transformClassesWithMultidexlistForRelease’和 ‘com.android.build.api.transform.TransformException: Error while generating the main dex list.’.爬坑记录 这种编译问题说实话,解决起来如果运气好找几篇...
android Studio遇到transformClassesWithDexForDebug错误
遇到这个粗无的原因,有很大可能是包冲突,这个包冲突不是jar重复,而是jar里面的某个类重复!具体可以使用命令 gradle dependencies --info来查看详细的信息 另一个原因可能是app的方法过多,使用MultiDex去解决这个问题即可! 参考:http://stackoverflow.com/questions/33095536/apptransformclasseswi
Android Studio打包程序时出现transformClassesWithDexForRelease错误
Error:Execution failed for task ':app:transformClassesWithDexForRelease'. > com.android.build.api.transform.TransformException: com.android.ide.common.process.ProcessException: java.util.concurrent.ExecutionException: com.android.dex.DexIndexOverflowExcept
弃用growingio后产生的问题解决
当你弃用growingio后会出现这样的错误 java.lang.NoClassDefFoundError: Failed resolution of: Lcom/growingio/android/sdk/agent/VdsAgent; 不用害怕,这是因为growingio污染了你的V4包,找到你项目对应的V4包将其替换掉即可。
Gradle 编译报错 : TransformException: Error while generating the main dex list。
https://blog.csdn.net/stupid56862/article/details/81130589
transformClassesWithDexForDebug
-
java.lang.NoClassDefFoundError: Failed resolution of: Landroid/support/v4/app/LoaderManager
Process: cn.com.aaa.bbb, PID: 6894 java.lang.NoClassDefFoundError: Failed resolution of: Landroid/support/v4/app/LoaderManager; at android.support.v4.app.Fragme...
Android Studio编译错误:Error while generating the main dex list
这个错误一般提示如下: FAILURE: Build failed with an exception. * What went wrong: Execution failed for task ':app:transformClassesWithMultidexlistForInstant_runDebug'. &gt; com.android.build.api.transform.Tran...
transformClassesWithMultidexlistForDebug
Error:Execution failed for task ':<em>transformClassesWithMultidexlistForDebug</em>'. > java.io.IOException:
':app:transformClassesWithDexForDebug'.finished with non-zero exit value 2
本来想以下面的作为标题,但为了让跟多的人能检索到,就直接从错误里面提取 关键字了android谨慎使用net包的json错误产生背景: –1 我使用了net.sf.json –2 我在该项目里面使用了module(除app以外的) 感谢stackoverflow 以后要养成搜索后优先点击来自stackoverflow的答案 因为服务器就是导入的net.sf.json,所以就在android工
Android studio build遇到的问题Could not resolve com.android.support:multidex:1.0.1.
我一直不能引入这个support 包, Error:A problem occurred configuring project ':app'. > Could not resolve all de
Error:Execution failed for task ':app:transformClassesWithJarMergingForDebug
Error:Execution failed for task ':app:transformClassesWithJarMergingForDebug'. > com.android.build.a
com.android.build.api.transform.TransformException报错
在开发当<em>中</em>,你会遇到这个问题,造成process.ProcessException的原因有很多,我就举一个我遇到的问题:造成报错的原因是因为我重复引用了jdk包,找到并删除重复的库,就可以解决了。如果想要了解更多的问题,可以查看这篇文章:http://www.cnblogs.com/jingmo0319/p/5781878.html
安卓运行报错Error:Execution failed for task ':app:transformClassesWithDexForDebug'解决
在androidstuio<em>中</em>运行我的未完项目,报错: Error:Execution failed for task ':app:transformClassesWithDexForDebug'. > com.android.build.api.transform.TransformException: com.android.ide.common.process.ProcessException: org.gradle.process.internal.ExecException: Process 'co
报错com.android.build.api.transform.TransformException: java.util.zip.ZipException
今天在不同的手机上安装同一个项目时,出现报错如下: Error:Execution failed for task ':app:transformClassesWithJarMergingForDebug'. > com.android.build.api.transform.TransformException: java.util.zip.ZipException: duplicate
Android studio build时候报错
-
Error:Execution failed for task ':app:transformClassesWithMultidexlistForDebug'. > java.io.IOExcepti
在升级到as3.0后出现部分错误,但是通过查度娘解决起来还可以,但是遇到了以上这个错误着实让我头大!!!主要解决方法:由于自己项目有很多第三方依赖,导致dex文件合并失败,解决方法在Module下的build.gradle<em>中</em>添加 multiDexEnabled truedefaultConfig{        multiDexEnabled true}dependencies{ compile'...
关于"app:transformClassesWithDexForDebug"报错的问题解决
在项目开发<em>中</em>出现: Error:Execution failed for task ':app:transformClassesWithDexForDebug'. > com.android.build.api.transform.TransformException: com.android.ide.common.process.ProcessException: java.util.con
Android Studio Error:Execution failed 持续更新...
  首先我的Studio版本为3.0.1,然后出现的问题就是,直接build没有问题,但是打签名包时就出现了  Error:Execution failed for task ':skymonkey.jkgj.com:transformClassesWithMultidexlistForRelease'.&amp;gt; java.lang.UnsupportedOperationException (n...
MultiDex后java.lang.NoClassDefFoundError异常解决
出现java.lang.NoClassDefFoundError异常,排除掉classpath设置问题,发现是multidex后导致的。 为什么要用multidex?项目<em>中</em>因方法数超过了65536,所以用到了MultiDex。 经过筛查,发现这里异常是因为multidex落下了compileapplication配置造成的。改正后,解决。 这里放上完整的multidex步骤: 1.在buil
Android Studio 的 build 过程
我们知道,在 <em>Android</em> 项目的开发过程<em>中</em>,只需要点一下 <em>Android</em> Studio 的运行按钮,就可以将代码编译好并运行在设备上。相信任何一个 <em>Android</em> 开发者都知道,从我们点击按钮到设备上运行 APP,<em>Android</em> Studio 默默地做了编译、打包(生成 APK 文件)、安装、运行等很多事情,安装和运行不是本文所关心的内容。下面,我们一起来看看,<em>Android</em> Studio 的...
Android之平时遇见的异常和错误总结(不断更新)
安卓错误经验累积  1、当出现下面错误时候     08-21 03:43:16.679: E/<em>Android</em>Runtime(1087): java.lang.RuntimeException: Unable to start activity ComponentInfo{com.example.fragment/com.example.fragment.MainActivity}: andr
jar包重复:com.android.build.api.transform.transformexception
用android <em>studio</em>添加jar包后,运行会提示:
完美解决Error:Execution failed for task ':APP:transformClassesWithDexForDebug'...问题
相信大伙在<em>Android</em>开发过程<em>中</em>都避免不了要集成第三方的项目、集成完之后有时就会碰到这个令人灰常厌恶的transformClassesWithDexForDebug、详细的Log如下: Error:Execution failed for task ':APP:transformClassesWithDexForDebug'. > com.android.build.api.trans
app:transformClassesWithDexForDebug Execution问题解决
在android <em>studio</em>编译代码时,出现以下错误: UNEXPECTED TOP-LEVEL EXCEPTION: Error:Execution failed for task ':app:transformClassesWithDexForDebug'.
在android studio 编译运行程序时报出如下错误
在android <em>studio</em> <em>中</em>编译运行程序时报出如下错误: Error:Execution failed for task ':dldandroidclient:transformClassesW
com.android.build.api.transform.TransformException: java.util.zip.ZipException:异常处理
Error:Execution failed for task ':vPClubPayDemo:transformClassesWithJarMergingForDebug'. > com.android.build.api.transform.TransformException: java.util.zip.ZipException: duplicate entry: com/alipay/an
Android 5.0以下,使用android studio 出现错误com.android.build.api.transform.TransformException:
<em>Android</em> 5.0以下,使用android <em>studio</em> 出现错误com.android.build.api.transform.TransformException:使用as去跑5.0以下的手机,居然跑出了错误com.android.build.api.transform.TransformException: …….class com.android.dx.command.Main with
添加Lib项目报错:Error:Execution failed for task ':app:processDebugManifest'.解决
添加Lib项目报错:Error:Execution failed for task ‘:app:processDebugManifest’.解决今天在创建一个项目的时候添加了一个Lib项目和很多依赖,发现程序运行不起来,最后一个一个依赖去掉,发现是依赖的Lib项目问题。错误情况: Error:Execution failed for task ':app:processDebugManifest'
解决 app:transformClassesWithDexForDebug 错误
具体报错信息信息:Error:Execution failed for task ':weishoot:transformClassesWithDexForDebug'. > com.android.build.api.transform.TransformException: java.lang.RuntimeException: com.android.ide.common.proces
Android studio的一次编译报错’Error:Execution failed for task ':app:transformClassesWithDexForDebug‘,困扰了两天
<em>Android</em> <em>studio</em><em>中</em>的一次编译报错’Error:Execution failed for task ':app:transformClassesWithDexForDebug‘,困扰了两天
Error:Failed to resolve: com.android.support:multidex:1.0.2
今天导入一个项目报如下的错误:Error:Failed to resolve: com.android.support:multidex:1.0.2 问题解决的办法是添加google()在allprojects里如下:问题解决
安卓4.X手机上运行的一次报错:Error:Execution failed for task ':app:transformClassesWithDexForDebug'.
记录一次开发<em>中</em>的报错信息 在安卓4.x以上运行程序都没有问题,就在4.x系统的手机上就报错:  Error:Execution failed for task ':yMKFGL:transformClassesWithDexForDebug'. > com.android.build.api.transform.TransformException: com.android.ide.co
android studio Error:Execution failed for task ':app:packageDebug'.解决方案
Error:Execution failed for task ':app:packageDebug'. > Duplicate files copied in APK META-INF/LICENSE File 1: C:\Users\DDF\.gradle\caches\modules-2\files-2.1\com.fasterxml.jackson.core\jackson-datab
Error:Execution failed for task ':app:transformDexArchiveWithExternalLibsDex
导入的包<em>Android</em> stuio自带,android_support_v4.,android_support_v7.修改方法:删除jar包,并且在bulid.gradle里删除implementation files('libs/XXX.jar')
Error:Execution failed for task ':app:transformClassesWithDexForDebug'. > com.android.build.api.tran
Error:Execution failed for task ':app:transformClassesWithDexForDebug'.&amp;gt; com.android.build.api.transform.TransformException: com.android.ide.common.process.ProcessException: java.util.concurrent.Ex...
Error:Execution failed for task :app:transformClassesWithInstantRunForDebug解决方案
最近更新过<em>Android</em> Studio后,很多新导入的工程会报错,究其书面意思就是通过InstantRun无法转换classes。报错信息:Error:Execution failed for task ':app:transformClassesWithInstantRunForDebug'. &amp;gt; java.lang.ClassNotFoundException: io.realm.Rea...
Error:Execution failed for task ':app:transformClassesWithDexForDebug'解决记录
转载请标明出处: http://blog.csdn.net/lxk_1993/article/details/50511172 本文出自:【lxk_1993的博客】; 新的排版地址https://blog.csdn.net/lxk_1993/article/details/95475603 3个错误non-zero exit value 1;non-ze...
Error:Execution failed for task ':app:transformClassesWithDexForDebug'.解决方法
添加multiDexEnabled true 给应用程序的build.gradle文件。 defaultConfig { multiDexEnabled true }
Error:Execution failed for task ':app:transformClassesWithDexForDebug
引入之前在eclipse下开发的项目到<em>Android</em>Studio 遇到了如下错误: Error:Execution failed for task ':guanXiang:transformClassesWithDexForDebug'. > com.android.build.api.transform.TransformException: com.android.ide.common.pr
AndroidStudio报错 Error:Execution failed for task ':app:transformClassesWithDexForDebug'.
使用<em>Android</em><em>studio</em>集成第三方代码的时候,经常会出现如下错误:Error:**Execution failed for task ':app:transformClassesWithDexForDebug'.** > com.android.build.api.transform.TransformException: com.android.ide.common.process.Proc
Error:Execution failed for task ':app:transformClassesWithDexForDebug'. >
<em>Android</em> 打包出错 com.<em>Android</em>.build.api.transform.TransformException:java.util.zip.ZipException: duplicate entry:android/support/v4/app/TaskStackBuilder$ArrayIterator.class`. Error:Execution failed for task':app:transformClassesWithDexForDebug'. >com.android.
解决编译问题 Error:Execution failed for task ':app:transformClassesWithDexForDebug'.
编译问题: Error:Execution failed for task ':app:transformClassesWithDexForDebug'. > com.android.build.api.transform.TransformException:  com.android.ide.common.process.ProcessException:  java.util.con
app:transformClassesWithDexForDebug
Error:Execution failed for task ':app:transformClassesWithDexForDebug'. > com.android.build.api.transform.TransformException: java.lang.RuntimeException: java.lang.RuntimeException: com.android.ide.com
踩坑日记01:transformClassesWithDexForDebug
踩坑日记01:transformClassesWithDexForDebug今天刚打开<em>studio</em>碰见了这个问题,记录一下踩坑日记 问题情况问题图片问题日志Error:Execution failed for task ':app:transformClassesWithDexForDebug'.>java.io.IOException: Could not delete path 'E:\andr
Android Studio transformClassesWithDexForDebug
转载请注明出处:http://blog.csdn.net/harryweasley/article/details/53462768在用<em>Android</em> Studio 构建的时候,总是报错,报错如下:Error:Execution failed for task ':XXXX:transformClassesWithDexForDebug'. > com.android.build.api.trans
app:transformClasses_enhancedWithInstantReloadDexForDebug
今天碰到如下错误如上错误, 情况是写自定义控件时,运行没问题,但是修改代码再次编译时就出现这个问题。这个其实是我们开启了instant run的原因,如下 instant run这个功能让我们开发更有效率,但是也总是会出问题,这个功能翻译过来就是瞬时运行。按照我的理解,运行代码后如果没报错,这as就会保存这种状态的缓存,如下 修改代码后 再次运行就非常的快,貌似不用编译全部的文件
com.android.build.api.transform.TransformException: com.android.builder.packaging.DuplicateFileExcep
com.android.build.api.transform.TransformException: com.android.builder.packaging.DuplicateFileException
com.android.build.transform.api.TransformException
defaultConfig { multiDexEnabled true }dexOptions { javaMaxHeapSize "4g" //specify the heap size for the dex process } 添加了以上信息后,可能还会出现错误,不过这个时候确实能氢气的看出是什么东东重复了,直接删除多余的即可。
记百度地图jar包冲突问题com.android.build.api.transform.TransformException:com.android.ide.commom.process.Proce
导入jar包后报如下异常 com.android.build.api.transform.TransformException:com.android.ide.commom.process.ProcessExeption:……finished with non-zero exit value 2] 网友的解决办法都是删除冲突或重复的jar包,有说v4的,大概是版本不一样,并没有解决问题。 co
androidStudio com.android.build.api.transform.TransformException解决办法
出现下面这个错误 Error:Execution failed for task ':mygirlFlash:transformClassesWithJarMergingForDebug'. > com.android.build.api.transform.TransformException: java.util.zip.ZipException: duplicate entry: u
android学习记录4:解决as 导入依赖包时报错:com.android.dex.DexException和com.android.build.api.transform.TransformExc
今天导入v7和design的包时,build后没有问题,但是运行时,一直报错,如下图: 后来google了一下,在Stack Overflow里面找到了答案,因为我依赖了另一个Moudle,而这个Moudle里面的libs文件夹的jar文件与我运行的Moudle<em>中</em>libs里的jar重复,导致报了这些错误。去掉重复的jar后,clean了一下项目,然后运行成功。
如何解决androidStudio com.android.build.api.transform.TransformException
Error:Execution failed for task ':mygirlFlash:transformClassesWithJarMergingForDebug'. > com.<em>Android</em>.build.api.transform.TransformException: Java.util.zip.ZipException: duplicate entry: u/fb/a.clas
【问题解决】com.android.build.api.transform.TransformException: java.util.zip.ZipException: duplicate entr
【问题描述】  我的项目里用集成了第三方授权登录,和社会化分享,build apk报错 com.android.build.api.transform.TransformException: java.util.zip.ZipException: duplicate entry: com/sina/sso/RemoteSSO$Stub$Proxy.class 【原因解释】 出现
11、com.android.build.api.transform.TransformException
一、bug 现象:             在同一个工程引用两个 相同包名的 lib 是会报这样的错误:                      Error:Execution failed for task ':app:transformClassesWithJarMergingForDebug'.                                > com.android
Error:Execution failed for task ':app:transformClassesWithDexForRelease'. > com.android.build.api.tr
Error:Execution failed for task ':app:transformClassesWithDexForRelease'. > com.android.build.api.transform.TransformException: com.android.ide.common.process.ProcessException: java.util.concurrent.Exe
Error:Execution failed for task ':transformClassesWithJarMergingForDebug'. > com.android.build.api.t
Error:Execution failed for task ':transformClassesWithJarMergingForDebug'. > com.android.build.api.transform.TransformException: java.util.zip.ZipException: duplicate entry: com/squareup/leakcanary
com.android.build.api.transform.TransformException: com.android.ide.common.process.ProcessException
今天在做项目的时候重启了次电脑,结果重启运行以后就报错了  Error:Execution failed for task ':app:transformClassesWithDexForDebug'. > com.android.build.api.transform.TransformException: com.android.ide.common.process.Proce
Error:Execution failed for task ':app:transformClassesWithDexForDebug'.
今天在引用一个项目时报出如下错误:............. ............ ................. To run dex in process, the Gradle daemon needs a larger heap. It currently has approximately 910 MB. For faster builds, increase the maximu
Error:Execution failed for task ':app:transformClassesWithDexForDebug'
Error:Execution failed for task ':app:transformClassesWithDexForDebug'. com.android.build.transform.api.TransformException: 官方文档查看: In versions of Google Play services prior to 6.5, you had
midl\oleaut32.dll : error MIDL2020 : error generating type library : SetFuncAndParamNames failed : StoredProc (0x8002802C)问题!
编译时出现midl\oleaut32.dll : error MIDL2020 : error generating type library : SetFuncAndParamNames faile
gradle编译出错:Execution failed for task ':app:compileTestDebugJava'.
今天更新了android <em>studio</em>,从0.5.3升级到0.6.1版本,结果在IDE<em>中</em>编译时没有问题,但是在命令行时编译就会出现以下错误: :app:compileTestDebugJava <em>FAILED</em> FAILURE: Build failed with an exception. * What went wrong: Execution failed for task ':app:c
对Too many classes in --main-dex-list,main dex capacity exceded提供简单几种方案。
对Too many classes in –main-dex-list,main dex capacity exceded提供简单几种方案。问题: 这个问题出现在使用分包库后,main-dex里面的方法数超出。 gradle plugin版本:2.+ gralde 版本:2.10+ 简单提供一些解决方案: 1、使用<em>Android</em>官方提供方案,见Configure Apps with O
程序员实用工具网站
目录 1、搜索引擎 2、PPT 3、图片操作 4、文件共享 5、应届生招聘 6、程序员面试题库 7、办公、开发软件 8、高清图片、视频素材网站 9、项目开源 10、在线工具宝典大全 程序员开发需要具备良好的信息检索能力,为了备忘(收藏夹真是满了),将开发过程<em>中</em>常用的网站进行整理。 1、搜索引擎 1.1、秘迹搜索 一款无敌有良心、无敌安全的搜索引擎,不会收集私人信息,保...
Running Xen A Hands-On Guide to the Art of Virtualization下载
《Running Xen A Hands-On Guide to the Art of Virtualization》 chm文件。 相关下载链接:[url=//download.csdn.net/download/zhuliting/2137847?utm_source=bbsseo]//download.csdn.net/download/zhuliting/2137847?utm_source=bbsseo[/url]
Web QQ 密码加密算法C#源码下载
Web QQ 密码加密算法C#源码 这个代码的可读性很好。 可以作为大家的共用库。 相关下载链接:[url=//download.csdn.net/download/stonepeter/2940445?utm_source=bbsseo]//download.csdn.net/download/stonepeter/2940445?utm_source=bbsseo[/url]
OpenGL超级宝典(英文第五版)下载
《OpenGL超级宝典(第5版)》是OpenGL及3D图形编程最好的入门指南,涵盖了使用最新版本的OpenGL进行编程所需要的主要知识。全书分三部分,共16章,另有3个附录。第一部分包括第1章到第7章,介绍如何构建一个使用OpenGL的程序、如何设置3D渲染环境,以及如何创建基本对象和光线并对他们进行着色。然后深入研究如何使用OpenGL,并向读者介绍GLSL,以及如何创建自己的着色器。第二部分包括第8章到第12章,将进行更深入的研究,而懂得如何应用这些高级特性将使读者超越业余3D玩家的水平。这一部分不仅能够使我们掌握更多的可视化效果,同时也考虑了性能表现。第三部分包括第13章到第16章,着重 相关下载链接:[url=//download.csdn.net/download/boxiangxi0812/6926065?utm_source=bbsseo]//download.csdn.net/download/boxiangxi0812/6926065?utm_source=bbsseo[/url]
相关热词 c# oracle 开发 c#选择字体大小的控件 c# usb 批量传输 c#10进制转8进制 c#转base64 c# 科学计算 c#下拉列表获取串口 c# 如何防止参数被修改 c#开发微信公众号例子 c# null
我们是很有底线的