myeclipse删除项目错误信息:an unexpected error occurred while performing the refactoring [问题点数:40分,结帖人lijiafa]

Bbs1
本版专家分:0
结帖率 100%
Bbs1
本版专家分:0
Bbs1
本版专家分:0
Bbs1
本版专家分:0
Bbs5
本版专家分:2685
Blank
Github 绑定github第三方账户获取
Bbs1
本版专家分:40
android重命名包命出现an unexpected exception occured错误的解决办法
原文地址 http://hiroz.cn/rename-application-package-exception/在 Android 中,相同包名的 App 是无法同时安装的。因为临时接到需求,要把我正在做的 App 做一个渠道定制版,又需要可以和在线版本的 App 同时安装。Eclipse 中(老项目伤不起),选中 App 项目点右键弹出菜单,选中 Android Tools -> Renam
Ubuntu系统安装CUDA或NVIDIA驱动后出现循环登录问题的Solution (附:building kernel modules error)
写在前面: 由于各种原因,在通过CUDA安装显卡驱动或者直接通过NVIDIA驱动程序安装显卡驱动后,有时会出现显卡驱动崩溃的情况,而这种情况的表现形式就是循环登陆(或附带屏幕分辨率异常),这时就需要进行显卡驱动程序的卸载重装。 ~~~~~~~~~~~~~~~~~~~~~~~~~~~~~~~~~~~~~~~~~~~~~~~~~~~~~~ 关于nvidia显卡驱动的卸载重装,不少博客中介绍的方法...
解决:ubuntu下windows分区挂载不上、nvidia显卡驱动重装时kernel错误
遇到2个问题,把解决过程记录一下: 1、ubuntu下windows分区挂载不上 问题: 进了一次windows系统之后,挂载ntfs分区出现错误: The NTFS partition is in an unsafe state. Please resume and shutdown Windows fully (no hibernation or fast restarting), ...
Eclipse集成CVS Update时报错的原因及解决办法
最近项目中在执行update操作时报错,从所报的错误中看不出具体的原因,错误日志如下: An <em>error</em> <em>occurred</em> synchronizing /cneweb2.0: The server reported an <em>error</em> <em>while</em> <em>performing</em> the "cvs update" command. The server reported an <em>error</em> <em>while</em> per
Nessus的安装/激活/更新
0x1,安装 百度:Nessus,随意下载一个就好了. 0x2,激活 开启代理,获取register code,如图: 获取到register code,填写,进行激活,意外报错: NOTICE: An <em>unexpected</em> <em>error</em> <em>occurred</em> <em>while</em> downloading the plugins. This could be due to a network e...
Docker下RabbitMQ四部曲之四:高可用实战
本章是《Docker下RabbitMQ四部曲》系列的终篇,今天的我们一起来体验Rabbit’MQ集群的高可用能力,看看RabbitMQ集群中的部分节点宕机时,是否还能生产和消费消息; 原文地址:https://blog.csdn.net/boling_cavalry/article/details/80351491 前文链接 《Docker下RabbitMQ四部曲》的前三篇链接如下: ...
java连接rabbitmq报java.io.IOException
java.io.IOException at com.rabbitmq.client.impl.AMQChannel.wrap(AMQChannel.java:106) at com.rabbitmq.client.impl.AMQChannel.wrap(AMQChannel.java:102) at com.rabbitmq.client.impl.AMQChannel.exnWrapping...
springboot:org.springframework.amqp.AmqpIOException: java.io.IOException
springboot整合rabbitMQ报错: 首先看一下RabbitMq服务是否开启 如果开启了进入RabbitMq管理界面即:http://localhost:15672 使用配置文件的用户名和密码登录:(确保rabbitMq已有此用户,如没有请参考:https://blog.csdn.net/forever131466/article/details/85098636)   ...
Kafka史上最详细原理总结 ----看完绝对不后悔
KafkaKafka是最初由Linkedin公司开发,是一个分布式、支持分区的(partition)、多副本的(replica),基于zookeeper协调的分布式消息系统,它的最大的特性就是可以实时的处理大量数据以满足各种需求场景:比如基于hadoop的批处理系统、低延迟的实时系统、storm/Spark流式处理引擎,web/nginx日志、访问日志,消息服务等等,用scala语言编写,Link...
springboot集成rabbitMq遇到的坑
spring.application.name=rabbitmq spring.rabbitmq.host=127.0.0.1 spring.rabbitmq.port=15672 spring.rabbitmq.username=huitao spring.rabbitmq.password=1234 这是配置文件! 2018-12-08 13:22:04.617 ERROR 5172...
反编译UNEXPECTED TOP-LEVEL EXCEPTION出错的解决方法
反编译UNEXPECTED TOP-LEVEL EXCEPTION出错的解决方法 UNEXPECTED TOP-LEVEL EXCEPTION: org.jf.dexlib.Util.ExceptionWithContext: method index is too large. at org.jf.dexlib.Util.ExceptionWithContext.withContext(E
MyEclipse想说爱你不容易(写于2012-11-18)
      对于java的开发人员人来,eclipse与MyEclipse已经是熟之又熟的工具了,同样,我也是它的一个fans,它的项目管理功能,代码编辑、定位、查找、提示、调试......等等等等各种强大的功能(上面列举的只是最简单最常用的功能),简直让人爱死了。       本人一直用MyEclipse6.0版本,一直用到今天。随着软件技术的飞速发展,各种技术都在不断的更新。而至今天,MyE...
myeclipse连接oracle出现ora-00604 和ora-12705错误的解决方案
错误描述:     使用的是<em>myeclipse</em> 7.0版本,oracle是10g版本,在连接的时候出现了以下问题     Error <em>while</em> <em>performing</em> database login with the     oracle.jdbc.driver.OracleDriver driver:     ORA-00604:<em>error</em> <em>occurred</em> at recursiv...
安装GIRD提示INS-08106错误
安装GIRD时提示[INS-08106] Unexpected <em>error</em> <em>occurred</em> <em>while</em> loading the view 'GridPlugPlayInfoUI' associated to state 'GridPlugPlayInfoUI'. 查看日志如下 ---# Begin Stacktrace #--------------------------- ID:
error中成长001:Myeclipse连接mysql的时候出现错误
错误内容:  Error <em>while</em> <em>performing</em> database login with the mysql driver"Acess denied for user 'root'@'localhost'(using password:YES)                   原因是:在连接自己机器数据库时没有使用自己安装时设定的密码。
Android项目打包开启proguard的混淆优化带来的有关问题
Android项目打包开启proguard的混淆优化带来的问题 文章来源:http://www.itnose.net/detail/6043297.html 更多文章:http://www.itnose.net/type/85.html 1.引入一个sdk以后,打包报错:  [INFO] Unexpected <em>error</em> <em>while</em> evaluating instruction: 
日积月累:Proguard进行源代码混淆和崩溃日志反混淆
在实际的开发成产品apk的发布过程中,我们经常会使用到代码混淆技术。不过在讲解如何进行代码混淆之前,我先跟大家演示一下反编译的过程,这样才能让大家明白为什么需要进行代码混淆。    一、代码反编译  1.准备工作  首先我们准备好一个项目的apk文件(未进行混淆打包)、dex2jar工具(下载地址:http://code.google.com/p
myeclipse删除文件或项目时出现异常
 当我们在用<em>myeclipse</em>做项目的时候,会碰到有垃圾文件或者项目,它们放在工作集中会显得冗杂多余,这时候我们就要删除它们。 但是有时我们会碰到如图问题,在删除文件或项目时候<em>myeclipse</em>会报“处理重构‘删除’时出现异常”的错误,从而导致文件或项目不能完全删除, 那么我们应该怎么解决呢? 其实很简单,此时你将<em>myeclipse</em>关闭,然后再重启,这时候删除文件或者项目就
myeclipse 配置DB driver测试连接错误
问题 配置hibernate时,在DB Browser中新建一个配置,各种信息(url,driver,jar包等)填完后,测试时出现错误,弹出一个框提示:Error <em>while</em> <em>performing</em> database login with the Oracle driver:ORA-00604:<em>error</em> <em>occurred</em> at recursive SQL level 1ORA-12705:Ca...
(源码) generator-mybatis-generator-1.3.2.zip
generator-mybatis 1.3.2 源码 是源码是源码 不是jar包
infomatica新建repository 显示编码报错
infomatica安装后,新建repository报错,我弄来弄去就是这两个报错循环两个错误如下:The service did not start due to the following <em>error</em>: The repository code page [2252: MS Windows Latin 1 (ANSI), superset of Latin1] does not match th...
eclipse myeclipse 保存的时候报错
An internal <em>error</em> <em>occurred</em> during: "Running Android Lint". org/eclipse/jdt/internal/compiler/ast/UnionTypeReference 解决办法,window->preference->android->lint Error Checking ->when saving files,
logstash常见错误
logstash config email have <em>error</em> :[2018-06-13T20:17:28,072][ERROR][logstash.outputs.email   ] Something happen <em>while</em> delivering an email {:exception=&amp;gt;#&amp;lt;Net::ReadTimeout: Net::ReadTimeout&amp;gt;}我修改...
Python学习笔记(十一)关系型数据库
关系型数据库的一些功能: 多用户同时访问数据; 用户使用数据的保护; 高效地存储和检索数据; 数据被模式定义以及被约束限制; Joins 通过连接发现不同数据之间的关系; 声明式(非命令式)查询语言,SQL(Structured Query Language) 之所以被称为关系型(relational)是因为数据库展现了表单(table)形式的不同类型...
Unexpected error occurred in scheduled task本地测试正常,上传服务器后报错
在本地,定时任务执行正常,但是上传到服务器后,程序抛异常。 Unexpected <em>error</em> <em>occurred</em> in scheduled task。 网上百度后也没找到解决方法。 然后检查了源码:发现有个逻辑问题,就是定时任务每次请求数据的时候都要和上一次结果对比,如果不同就更新。但是如果数据库表中没有数据,则查出为空。问题就出在这里。由于我的定时任务往数据库添加的数据比较多,又做了一个
关于JDK和JRE的几种报错
(1)双击Eclipse图标,Eclipse闪退。 (2)在命令行输入java -version,报错如下: An <em>error</em> has <em>occurred</em> <em>while</em> processing the shared archive file. (3)打开Eclipse,试图在Tomcat上运行Java Web项目时,报错如下: The specified JRE installation does not exist.
关于使用yarn add concurrently报错问题
当我运行yarn add concurrently时出现了以下报错:<em>error</em> An <em>unexpected</em> <em>error</em> <em>occurred</em>: &quot;https://registry.yarnpkg.com/concurrently: connect ETIMEDOUT 104.16.62.173:443&quot;.解决方法:运行 yarn install --concurrency 1 即可...
升级RN遇到的一些问题
1、首先按照这个文档里的步骤   https://reactnative.cn/docs/0.51/upgrading.htmlnpm install -g react-native-git-upgrade我执行到一半给关了,再次执行的时候出错 ERR! Unexpected end of JSON input <em>while</em> parsing near '...nd-index-1.0.2这个错然后执...
SQuirrel 连不上 Phoenix Hbase ---> 可能是因为zookeeper 集群中的一个zookeeper 启动有问题
Unexpected Error <em>occurred</em> attempting to open an SQL connection. java.util.concurrent.TimeoutException     at java.util.concurrent.FutureTask.get(Unknown Source)     at net.sourceforge.squirrel_
MyEclipse中连接MySQL数据库报错
在MyEclipse中的数据库程序,在启动程序后报错:java.lang.ClassNotFoundException:   org.gjt.mm.mysql.Driver  解决方法: 在MyEclipse中写数据库程序,需要在MyEclipse中添加MySQL数据库的驱动包,即mysql-connector-java-5.0.4-bin.jar. 在MyEclipse中加载M
Appium 测试遇到问题解决方案
转载自:http://bbs.51testing.com/thread-1072915-1-1.html Appium 测试遇到问题解决方案  [复制链接]     qh988629 该用户从未签到 电梯直达 1#
MyEclipse中DB Browser连接数据库失败的解决办法
刚才在MyEclipse中,建立数据库连接,数据库是oracle9i,连接字符串是用MyEclipse中默认的,即jdbc:oracle:thin:@[:]:oracle的监听服务已经启动,但是连接不上,提示:the network adapter could not establish the connection可是使用PLSQL Developer可以连接,后来连接字符串换成
kettle使用指南
一、kettle下载 [官网地址][1] 1. 安装JDK环境:JDK1.8以及更高的版本 2. 下载以后解压就可以使用了 二、任务(.kjb)与转换(.ktr) 简单地说,一个转换就是一个ETL的过程,而作业则是多个转换、作业的集合,在作业中可以对转换或作业进行调度、定时任务等 三、组件 1.spoon.bat/spoon.sh 图形界面工具,就是启动上图主界...
ant debug最常见的一个错误解决
这个问题,我用了一下午的时间,在网上搜索各种解决方法都没有解决,最后我同事一句话就gz
解决 npm i 及 yarn install 都无法进行安装的问题和node-sass安装太慢的问题
今天经过长时间的尝试和搜索,设置是切换各种镜像源的尝试,都无法正常安装,目前已找到解决方法了,一开始网上并没有确切的答案,但是经过不断的试错,终于找到了问题的源头,现在分享下,避免以后其他人走太多弯路。 发现问题 info There appears to be trouble with your network connection. Retrying... info The...
11g RAC搭建错误
1、[INS-08106] [php] view plaincopy SEVERE: [FATAL] [INS-08106] Unexpected <em>error</em> <em>occurred</em> <em>while</em> loading the view 'GridPlugPlayInfoUI' associated to state 'GridPlugPlayInfoUI'.   这步设置GridPlugPlay
MyEclipse或Eclipse按住ctrl点击方法,提示Problems finding implementations或无法跳转的问题解决
MyEclipse或Eclipse按住ctrl点击方法,提示Problems finding implementations或无法跳转Reason:An <em>error</em> <em>occurred</em> <em>while</em> searching for implementations for method ....解决方法:1.关闭Eclipse或者MyEclipse2.删除 &amp;lt;workspace&amp;gt;/.metada...
安装svn插件报错
An <em>error</em> <em>occurred</em> <em>while</em> collecting items to be installed session context was:(profile=epp.package.jee, phase=org.eclipse.equinox.internal.p2.engine.phases.Collect, operand=, action=). Unable to read
解决win10下配置matlab接口的GPU版Caffe时常遇到的一些错误
如何配置windows10下的MATLAB接口的GPU版本的caffe,网上的教程挺多的,但因为大家用的硬软件不同,按教程配置下来以后,往往会出现一些小问题。在此,分享一下几个常见问题的解决方法。具体配置过程可以参见http://www.cnblogs.com/alcohol/p/caffe-windows.html。 常见问题: 1.版本不兼容。我用的是vs2013+cuda7.5+
利用HDFs上传文件的错误
WARN hdfs.DFSClient: DataStreamer Exception org.apache.hadoop.ipc.RemoteException(java.io.IOException):  File /examples/people.json._COPYING_ could only be replicated to         0 nodes instead of
Eclipse ADT最后一步安装时An error occurred错误的解决办法,亲测有效
在安装eclipseADT时,不要勾选update选项,而且一定要保证离线安装,因为eclipse默认会在联网的情况下安装其他许多的插件,这时会很浪费时间,所以切记不要勾选update,保证离线。 切记若以前电脑上安装过eclipse-ADT,则重新安装时一定要把老的卸载掉,而不要简单滴删除,因为这时会残留DDMS文件,它会造成题目所述的错误。 具体的卸载办法是:help——install——...
Ionic初学习上遇到的问题
本人初次接触Ionic,一个Ionic小白,所以按照了网上的教程一步步进行操作。 先下载安装了NodeJs,然后,通过如下指令,通过npm安装了最新版本的cordova和ionic。 npm install -g cordova ionic 成功安装cordova和ionic后,通过如下命令,就可以进行使用官方提供的现成应用模块模板了。 ionic start myApp tabs
Yarn 安装过程出现 read ECONNRESET 错误
在使用yarn安装项目依赖包时,出现以下错误。 info There appears to be trouble with your network connection. Retrying... <em>error</em> An <em>unexpected</em> <em>error</em> <em>occurred</em>: &amp;quot;http://r.cnpmjs.org/which/download/which-1.2.14.tgz: read ECONNR...
连接redis出错
[org.springframework.scheduling.support.TaskUtils$LoggingErrorHandler] - Unexpected <em>error</em> <em>occurred</em> in scheduled task.   org.springframework.dao.DataAccessResourceFailureException: Cannot get Jedis co
openstack常见问题
1 ERROR: 'NoneType' object has no attribute 'rstrip' 使用nova list命令查看时出错: root@cloud:~# nova list --all-tenants |grep ACTIVE |awk -F '|' '{print $5}' |awk -F '=' '{print$2}' ERROR: 'NoneType' objec
并发时,缓存锁导致的相关问题
信息: 更新一条用户并更新缓存 异常: System.NullReferenceException: Object reference not set to an instance of an object.    at GTA.EFM.BLL.UserInfoBLL.b__f(UsersEntity a) in F:\EFM3.0\1.GTA_EFM\13.Code Management\T
logstash 出现的问题
[FATAL][logstash.runner          ] An <em>unexpected</em> <em>error</em> <em>occurred</em>! {:<em>error</em>=&amp;gt;#&amp;lt;NoMethodError: undefined method `[]' for nil:NilClass&amp;gt;, :backtrace=&amp;gt;[&quot;/export/servers/logstash-6.2.2/vendor/bund...
python3 MAC 安装报错
通过以下命令安装 brew install python3异常:Error: An <em>unexpected</em> <em>error</em> <em>occurred</em> during the `brew link` stepThe formula built, but is not symlinked into /usr/localPermission denied @ dir_s_mkdir - /usr/local/Frame...
Apache--SSI 服务器端包含
(参考apache手册及百度百科:http://baike.baidu.com/view/188371.htm) 访问静态页面时,页面有一个模块无法显示并报错“an <em>error</em> <em>occurred</em> <em>while</em> processing this directive”,查看原html文件,发现该处是通过SSI的命令include进来的:   通过改正引入文件的路径,成功引入。这里做一下笔记: 【
spring boot-分布式定时任务中,异步执行时JMS无法重新投递消息
这篇博客是紧接着上篇博客来说的http://blog.csdn.net/liuchuanhong1/article/details/64126346 在上篇博客中,我们基本上实现了分布式的定时任务架构的搭建,但是,当我们异步消费消息中间件中的消息的时候,如果执行的过程中抛了异常,那么,我们无法做到消息重试,示例如下: @Component // 必须加此注解,该类才会被作为Message
SVN客户端工具Cornerstone—注意事项
SVN客户端工具Cornerstone—注意事项 ①先更新后提交   在看到有新版本(即同伴已经提交代码时),先更新代码,直至working copy不再显示白色圈,然后运行代码确定可运行且功能无误之后再commit自己的代码,否则,会造成项目中出现多处冲突或bug,且很难排查原因   ②完成独立功能后再提交,且务必填写提交信息   每完成一个独立的功能,或解决一个bug
ibatis 配置错误
错误为: - The <em>error</em> <em>occurred</em> <em>while</em> load DataBase Provider. - The <em>error</em> <em>occurred</em> in . - Check the oracleClient1.0. "Error <em>while</em> configuring the Provider named \"oracleClient1.0\". Cause : The
hive 调用python脚步报错
Error: java.lang.RuntimeException: Hive Runtime Error <em>while</em> closing operators: [Error 20003]: An <em>error</em> <em>occurred</em> when trying to close the Operator running your custom script.         at org.apache.hado...
MyEclipse开发中遇到的错误(连载)
>>1.严重: Servlet.service() for servlet jsp threw except 严重: Servlet.service() for servlet jsp threw exception java.lang.NullPointerException at org.apache.jsp.qiantai.index_jsp._jspService(index_j
使用MATLAB将m文件生成jar包步骤&遇到的问题及解决方法(ERROR:an error occurred while shelling out to javac)
环境说明: MATLAB R2012a jdk1.6 windows7 MATLAB安装 下载链接:https://blog.csdn.net/xuxinrk/article/details/80563864 注册后重复弹出验证license窗口 使用的license已过期,更改系统时间或使用新license替换。 生成jar包步骤 步骤链接:https://blog.csdn....
在notebook中使用pyspark遇到的问题
代码:from pyspark import SparkContext sc = SparkContext() rdd.getNumPartitions() rdd.glom().collect()遇到的问题: 执行rdd.glom().collect()时出现如下错误:Py4JJavaError: An <em>error</em> <em>occurred</em> <em>while</em> calling z:org.apache.spar
anaconda更新失败,出现“拒绝访问”的错误
anaconda输入更新命令:conda upgrade --all后,出现如下错误: The following packages will be UPDATED: conda: 4.5.4-py36_0 --&gt; 4.5.5-py36_0 Proceed ([y]/n)? y Preparing transaction: done Verifying transaction: done...
ibatis一个错误的排查
一段ibatis查询语句如下: &amp;lt;select id=&quot;getDownloadApkURL&quot; parameterClass=&quot;domain.BaseQueryDO&quot; resultClass=&quot;java.lang.String&quot;&amp;gt; SELECT update_url FROM idle_apk_info ...
公交司机解决PSQLException
最近遇到了一个bug,是关于JPA语句的问题,其实代码很简单,就是使用NamedQuery对数据库中符合条件的数据进行更新操作,代码如下(其实不想贴代码)@NamedQuery(name = "customer.updateSentToBusinessCheckByCustomerIds", query = "update Customer as c set c.sentToBusinessChe
关于eclipse安装gralde插件出现的安装不上问题
错误提示: An <em>error</em> <em>occurred</em> <em>while</em> collecting items to be installed session context was:(profile=epp.package.java, phase=org.eclipse.equinox.internal.p2.engine.phases.Collect, operand=, action=). Pr
py4j——用python访问java遇到的问题解决
简单来说就是先装上py4j的包,然后在Python环境中去执行官网py4j的demo程序,但是遇到了一些问题。ERROR:root:Exception <em>while</em> sending command. Traceback (most recent call last): File "/opt/cloudera/parcels/CDH-5.10.0-1.cdh5.10.0.p0.41/lib/spar
关于CMake编译不通过
Error <em>occurred</em> <em>while</em> communicating with CMake server. Check log /dumpDex-master/app/.externalNativeBuild/cmake/debug/armeabi-v7a/cmake_server_log.txt for additional information.   如果报这个错误,你可以尝试一下把an...
关于Visual Assist X遇到初始化失败的问题
打开VS的时候,弹出错误对话框 a critical <em>error</em> <em>occurred</em> <em>while</em> initializing Visual Assist.  无论怎么重装Visual Assist X还是修复VS都不能解决问题。因为此前磁盘出现问题,我猜有可能是C盘某个文件损坏导致。 但是不知道到底是哪个文件,我就把 C:\Users\Administrator\AppData\Roaming\V
MyEclipse中DB Browser无法连接到Oracle数据库
刚部署好的开发环境,在通过DB Browser连接到数据库时竟然报以下错误: <em>while</em> trying to login to database: ORA-00604: <em>error</em> <em>occurred</em> at recursive SQL level 1 ORA-12705: Cannot access NLS data fi...
装了eclipse ,但是安装ADT的时候,报错,错误内容如下
An <em>error</em> <em>occurred</em> <em>while</em> collecting items to be installed session context was:(profile=epp.package.standard, phase=org.eclipse.equinox.internal.p2.engine.phases.Collect, operand=, action=). Unable to
Eclipse 中安装 Pydev 插件
一般有两种方法。 一、在线安装 参考:python+Eclipse+pydev环境搭建         Eclipse和PyDev搭建完美Python开发环境(Windows篇) 但是安装过程遇到如下问题: An <em>error</em> <em>occurred</em> <em>while</em> collecting items to be installed session context was:(p
Vagrant add时出现错误
最近搞vagrant,照着网上的文章在vagrant box add这一步一直报错 An <em>error</em> <em>occurred</em> <em>while</em> downloading the remote file. The <em>error</em> message, if any, is reproduced below. Please fix this <em>error</em> and try again. 找了好久终于在s
myeclipse弹出an internal error occurred during报错解决办法
<em>myeclipse</em>弹出an internal <em>error</em> <em>occurred</em> during:"initializing"java tooling.有时候<em>myeclipse</em>总是在保存的时候弹出错误,只要保存就弹出.本资源可以解决报错问题
an unexpected error has occurred
an <em>unexpected</em> <em>error</em> has <em>occurred</em> rnError Message:该项不适于在指定状态下使用!rnrnrn我用c#.NET连接数据库是出现了这种错误,怎么解决呀,请各位朋友帮帮忙
[INS-08109] 验证状态 'getOCMDetails' 的输入时出现意外错误。
我是在重装的时候出现此错误的,我将这段环境变量,就是pathE:\work\oracle\product\11.2.0\dbhome_3\bin;去掉之后就没有报错了.
rabbit mq实际操作遇到的错误
配置了用户,虚拟路径后,还是一直报权限问题,另一个同事做客户端能够顺利的把数据发上去。所以,最终定位到spring-boot版本问题,由1.4.3改为1.5.6就没有问题了。大坑!...
ubuntu中运行jupyter notebook创建Python文件的时候报错
创建Python文件的时候遇到下面的错误:Creating Notebook Failed An <em>error</em> <em>occurred</em> <em>while</em> creating a new notebook. Unexpected <em>error</em> <em>while</em> saving file: arma/Untitled.ipynb [Errno 13] Permission denied: ‘/home/wang/.local
yarn设置淘宝镜像问题 亲测成功
如果觉得安装速度慢,安装源和原来 npm 是一样的,可以通用,修改方法如下:yarn config get registry # -&amp;gt; https://registry.yarnpkg.com 可以改成 taobao 的源:yarn config set registry https://registry.npm.taobao.org # -&amp;gt; yarn config v0.15.0 ...
解决使用iBatis时initialize type alias异常问题
在进行.NET项目开发时,会想到不同的持久层框架,如nhiberate、ibatis等。使用框架的好处是开发人员可以有大部分精力去关注系统的逻辑,不用太多的关注数据层的操作。 其中在使用“半自动”的iBatis框架时,我们需要去创建一个用来map数据实体(类)和数据库字段的sqlMap的xml文件。在这个sqlMap文件中,statements中的增删改查脚本需要用到的传入参数(paramete
mybatis pagehelper分页查询时候报错
今天再做开发的时候遇到了mybatis Pagehelper   分页查询的错误。The <em>error</em> <em>occurred</em> <em>while</em> handling results ### SQL: SELECT count(*) FROM tb_pro_rating WHERE  pro_info_id = ? ### Cause: j,找了很久没有找到原因。              最后跟踪源代码,发现
(转载)解决 npm i 及 yarn install 都无法进行安装的问题和node-sass安装太慢的问题
转载自:https://blog.csdn.net/tyro_java/article/details/79772442发现问题info There appears to be trouble with your network connection. Retrying... info There appears to be trouble with your network connection...
添加ionic中android插件时
[ERROR] Cordova encountered an <em>error</em>. You may get more insight by running the Cordova command above directly.[ERROR] An <em>error</em> <em>occurred</em> <em>while</em> running cordova plugin add E:\worpspace\XunfeiTest2
myeclipse中安装jrebel插件
<em>myeclipse</em>10 jrebel插件 + jrebel5.3.2破解版下载地址: 1.      先安装好<em>myeclipse</em>的jrebel的插件,在<em>myeclipse</em>10的时候用<em>myeclipse</em>自己的安装方法安装的时候失败了,后来用的自己下好插件,手动安装的办法。即是把插件的features和plugins文件夹考到D:\<em>myeclipse</em>\MyEclipse 10-1\dropi
Myeclipse2014开发Maven项目错误汇总(三)
       作为使用Maven开发的过程中,或多或少会遇到一些问题,本人开发Maven项目的时间也不算特别长,之前遇到问题也没想到整理,后来遇到了一些同样的问题才想起来做一下整理,方便以后的开发,在eclipse/Myeclipse上解决方法都是类似的,此处就以Myeclipse2014为例: 1、错误提示:Description Resource Path Location Type Pro...
redmine3.3.0安装问题
1.An <em>error</em> <em>occurred</em> <em>while</em> installing rmagick (2.16.0), and Bundler cannot continue. Make sure that `gem install rmagick -v '2.16.0'` succeeds before bundling. >yum install ImageMagick-devel
折中解决已有项目与CXF ws功能整合时的jar包冲突
对原有文档管理项目进行简化和调整,同时对客户的其他应用提供webService接口。WS使用CXF提供,功能较简单,但原项目所提供的jar与CXF所依赖的包发生冲突。首先在整合过程中,去除了一些CXF使用的jar改用项目中存在的,项目编译没问题后,进行功能瘦身调整。 整个瘦身过程,没有利用CXF工具生成WSDL文件进而产生客户端服务,而简单了写个客户端调用。能够通过ws传递信息,同时能够通过返回的
Mybatis连接数据库时报错原因归纳
一: 报错信息 org.apache.ibatis.exceptions.PersistenceException:  ### Error querying database.  Cause: java.sql.SQLException: Listener refused the connection with the following <em>error</em>: ORA-12505, TNS:lis
spark直连kafka中遇到的问题
出现问题:找不到 leader offset py4j.protocol.Py4JJavaError: An <em>error</em> <em>occurred</em> <em>while</em> calling o41.createDirectStreamWithoutMessageHandler. : org.apache.spark.SparkException: java.nio.channels.ClosedChannelExce...
【MyBatis】常见错误记录
错误类型一: 错误提示:org.apache.ibatis.exceptions.PersistenceException: ### Error querying database. Cause: org.apache.ibatis.reflection.ReflectionException: There is no getter for property named 'values' i
【Troubleshooting】用户组/权限_导致grid日志不轮循清理_Bug 9595783
Bug 9595783  Owner and permission problemsafter applying a patch to an 11.2.0.1 Grid Infrastructure Home  This note givesa brief overview of bug 9595783.   The content was last updated on: 02-DEC-20
安装Oracle Database 11g时出现[INS-08109] 验证状态 'getOCMDetails' 的错误信息如何解决
这个框不选,输入邮箱后跳过,你又没有Oracle的metlink账户,怎么可能连接成功呢! Oracle的metlink账户是要付费使用的,而且米米还不是一点点的! 所以只要不填写直接走下一步就OK了...
wireshare 在win7 64位系统安装出现的问题
1、wireshare 64位在win7 上面安装应该没有问题。主要是winpcap。它的安装出现很多问题。 第一、安装的时候出现 an <em>error</em> occured when installing winpcap 0x00000430。这个问题是什么我也不知道,但是还是可以继续安装的。完成之后启动wireshare发现NPF driving is not running。我按照网上一些说法,输入
Myeclipse和eclipse遇到无法删除的项目时的解决办法
首先把<em>myeclipse</em>和eclipse关掉,反正凡是占用java虚拟机的进程都得关掉, 然后,到项目的目录下面去<em>删除项目</em>。     如果实在不行,就打开任务管理器,把java虚拟机的进程关掉
spyder炸了以及使用kernel问题
一个神奇的错误: 用spyder的时候,发生An <em>error</em> <em>occurred</em> <em>while</em> starting the kernel,然后spyder提示我们用conda install spyder‑kernels=0.* 或者 pip install spyder‑kernels==0.* 来解决问题,但是我们复制过去命令行的时候,出现了下面这样的一片红色: 不合法??哪里不合法?? 最后发...
yarn 常见错误
1. Application application_1406781725029_0125 failed 2 times due to AM Container for appattempt_1406781725029_0125_000002 exited with exitCode: 1 due to: Exception from container-launch: org.apache.h
Java for Web学习笔记(一零六):Spring框架中使用JPA(6)Isolation和C3P0(下)
使用hibernate-c3p0的isolation设置 我们前面学习的方式,都是先设置datasource,然后在JPA实现中关联该数据源。hibernate提供了hibernate-c3p0,在提供entityManagerFactoryBean的时候进行数据源的设置,实际上采用xml文件配置[1],很多都是这种方式,只不过我们采用代码方式实现。 pom.xml的设置,将将hibernat
JDBC-Driver、PostgreSQL的SQL语句参数上限错误分析及解决办法(源码)
JDBC-Driver、PostgreSQL的SQL语句参数上限错误分析及解决办法(源码)Mybatis + PostgreSQL-JDBC-Driver 42.1.4批量插入24178条数据(每条30字段).报如下错误:pSQL 9.6Cause: org.postgresql.util.PSQLException: An I/O <em>error</em> <em>occurred</em> <em>while</em> sending to t
请问这是什么原因
com.ibatis.sqlmap.client.SqlMapException: There was an <em>error</em> <em>while</em> building the SqlMap instance. --- The <em>error</em> <em>occurred</em> in jdbc.properties. --- The <em>error</em> <em>occurred</em> <em>while</em> loading global properties...
软件发布SignTool Error 处理方法
VS2005/VS2008软件发布问题:SignTool Error: An <em>error</em> <em>occurred</em> <em>while</em> attempting to sign 处理方法
An internal error occurred during: java.lang.NullPointerException
实用开发工具Myeclipse,在启动tomcat时,不间断的会弹出 An internal <em>error</em> <em>occurred</em> during: "Calculating completion proposals...". java.lang.NullPointerException的错误对话框!
有林新闻客户端第一版源码下载
这段时间做的一个新闻客户端,界面优美,数据都是从百度新闻那里直接抓取的,有json和html解析。上面的滑动Tab是通过自定义View自己画出来的,列表的图片都是通过异步软引用方式加载的,可以流畅的运行。另外新闻详情是使用webview加载部分html显示的,效果非常好,比直接解析html要好很多。整体较为美观,流畅。 这里是之前的一个客户端大家可以看看(http://www.eoeandroid.com/thread-547690-1-1.html),(http://www.eoeandroid.com/thread-326736-1-1.html) 另外大家如果有什么问题,欢迎加入此群一起 相关下载链接:[url=//download.csdn.net/download/linpeng123l/8109715?utm_source=bbsseo]//download.csdn.net/download/linpeng123l/8109715?utm_source=bbsseo[/url]
fread函数和fwrite函数的应用下载
/* 从键盘输入4个学生的有关数据,然后把它们转存到磁盘文件上去 */ #include<stdio.h> #define SIZE 4 struct student_type { char name[10]; int num; int age; char addr[15]; }stud[SIZE]; …… …… 相关下载链接:[url=//download.csdn.net/download/luowei505050/2167285?utm_source=bbsseo]//download.csdn.net/download/luowei505050/2167285?utm_source=bbsseo[/url]
Libxml简单教程下载
Libxml简单教程,介绍Libxml的应用以及例子 相关下载链接:[url=//download.csdn.net/download/haoguil/2470838?utm_source=bbsseo]//download.csdn.net/download/haoguil/2470838?utm_source=bbsseo[/url]
文章热词 机器学习教程 Objective-C培训 交互设计视频教程 颜色模型 设计制作学习
相关热词 mysql关联查询两次本表 native底部 react extjs glyph 图标 怎么学习互联网大数据 村干部学习大数据心得
我们是很有底线的