linux 中安装SqLite3,make时出现这种错误,求大神解决一下。急急急! [问题点数:40分]

Bbs1
本版专家分:0
结帖率 0%
Bbs1
本版专家分:0
linux下编译异常处理(以SQLite 为例)
我们在<em>linux</em>平台下进行sqlite数据库的移植处理,在编译时可能会遇到如下问题,在此简要列出其原因及处理方式。rnrn1、expected  specifier-qualifier-list before …rn 在使用GCC时经常会遇到expected specifier-qualifier-list before …之类的<em>错误</em>。specifiers是指void、char、struct Fo
网上书店系统
网上书店系统
安装MySQL时,CMAKE报错
环境必须<em>安装</em>:yum -y install gcc gcc-c++ c<em>make</em>如果不是缺少管理用户、相应的工具。<em>解决</em>方法:清除缓存文件需要把源码目录中的CMakeCache.txt文件删除,然后再重新CMAKE。...
linux安装出现的问题与解决方案
rn FATAL ERROR: Could not find ./bin/my_print_defaults <em>解决</em>方法网上很多方法都是:/usr/local/mysql/scripts/mysql_install_db --user=mysql但是很有可能报错,找不到bin目录中的my_print_defaults<em>错误</em>信息: FATALERROR:Couldnotfind./bin/my_prin...
circle类的实现
circle类的实现 斤斤计较<em>急急</em><em>急急</em><em>急急</em><em>急急</em><em>急急</em><em>急急</em><em>急急</em>急斤斤计较<em>急急</em><em>急急</em><em>急急</em><em>急急</em><em>急急</em><em>急急</em><em>急急</em>急
java代码啊
很值得学习的java代码!求积分啊,<em>急急</em>急
sqlite3安装出错解决办法
windows版本nn<em>解决</em>方案:nnnn将2个文件解压到同一文件夹下,就可以<em>解决</em>了出错问题了nnnn以上是正确运行后的结果nnsqlite<em>安装</em>教程nnsqlite下载地址
linux常见致命错误(fatal error),解决办法:
Ubuntu18.04<em>安装</em>MATLAB2018a 图文教程rnMATLAB作为一个基本的数学统计软件,guangzhirn激活rn第一步rn选择rn第二步rnsudo cp -f /home/yq/program/MATLABR2018aLinux64Crack/R2018a/bin/glnxa64/matlab_startup_plugins/lmgrimpl/libmwlmgrimpl.so /usr/l...
git 编译安装出现错误
Can’t locate ExtUtils/MakeMaker.pm in @INCnnyum install perl-ExtUtils-CBuilder perl-ExtUtils-MakeMakernn<em>make</em>: * [http-push.o] Error 1nnyum update curl libcurl n yum -y install libcurl-devel.x86_6 n yu...
linux makemakefile中出现的一些问题.
1.<em>make</em>file:2: * 遗漏分隔符 。 停止 n2.<em>make</em>: 没有什么可以做的为 `modules’。 ntext.c文件nn#include&amp;lt;<em>linux</em>/kernel.h&amp;gt;n#include&amp;lt;<em>linux</em>/module.h&amp;gt;n#include&amp;lt;<em>linux</em>/init.h&amp;gt;n#include &amp;lt;<em>linux</em>/miscdevice.h&amp;gt;n#incl...
linux用源码安装mysql的时候编译报错的解决方法
先进你的源码包 把CMakeCache.txt 文件删除   rm -rf CMakeCache.txtrnrn然后运行 rnrn                      yum -y install bison*rn                      yum -y install ncurses*rn之后在重新c<em>make</em>   编译<em>安装</em>就<em>解决</em>了
[Linux] 安装软件时make gcc找不到错误
[Linux] <em>安装</em>软件时<em>make</em> gcc找不到<em>错误</em>
linux下redis安装遇到的问题及解决办法
<em>linux</em>下<em>安装</em>redis:nn$ wget http://download.redis.io/releases/redis-3.2.0.tar.gzn$ tar xzf redis-3.2.0.tar.gzn$ cd redis-3.2.0n$ <em>make</em>nnn1. 如果输入<em>make</em>提示 : <em>make</em>: cc:命令未找到n原因:未<em>安装</em>gcc<em>解决</em>方法:<em>安装</em>gcc[ckl@localhos
在Linux系统里安装redis时,编译出现这个问题应该怎么解决
在Linux系统里<em>安装</em>redis时,编译<em>出现</em>这个问题应该怎么<em>解决</em>![在这里插入图片描述](https://img-nn
使用ubuntu16.04配置linux内核和busybox出现错误解决方法总结
也许很多人都知道,ARM裸机1期加强版课程用的是ubuntu 16.04,当用这个ubuntu编译内核和制作文件系统的时候会<em>出现</em>一些问题,售后团队用了一天时间找到了如下<em>解决</em>方法。rnrnrn更多干货关注威信订阅号baiwenkejirnrnrnrnrnrnrnrnrnrnrn1.rnrn编译busybox-1.23.2: rnrn<em>出现</em><em>错误</em>:rnrnrnscripts/kconfig/Makefil
Linux 环境安装Python 3版本
Python就为我们提供了非常完善的基础代码库,覆盖了网络、文件、GUI、数据库、文本等大量内容,被形象地称作“内置电池(batteries included)”。用Python开发,许多功能不必从零编写,直接使用现成的即可。除了内置的库外,Python还有大量的第三方库,也就是别人开发的,供你直接使用的东西。当然,如果你开发的代码通过很好的封装,也可以作为第三方库给别人使用。
make出现错误
<em>make</em>file文件执行出错
安装pcre无法成功执行make解决方法
问题描述:n在Ubuntu上<em>安装</em>Nginx,第一步<em>安装</em>pcre的时候获取<em>安装</em>包->解压缩->执行./configuren然后执行<em>make</em>的时候报错:<em>make</em>: *** No targets specified and no <em>make</em>file found. stopn仔细看执行./configure的最后有报错:You need a C++ compiler for C++ support
安装redis中执行make时出错及解决方案
执行 <em>make</em> 时若报这个错nnnn<em>出现</em>如下<em>错误</em> : nncd src &amp;amp;&amp;amp; <em>make</em> allnn<em>make</em>[1]: Entering directory '/xx/xx/redis-x.x.x/src'nn         CC adlist.onn/bin/sh: cc: command not foundnn<em>make</em>[1]:  *** [adlist.o] Error 127n...
centos 7 安装redis时,make test 有错误 解决方案
                                    centos 7 <em>安装</em>redis时,<em>make</em> test 有<em>错误</em> <em>解决</em>方案nn<em>错误</em>如下图nnnn<em>解决</em>步骤:nn1.<em>安装</em>tcl,wget http://downloads.sourceforge.net/tcl/tcl8.6.1-src.tar.gz nn2.解压tar xzvf tcl8.6.1-src.tar.gznn3.进入...
在centos6.x 下安装redis 出现问题
问题1:n<em>linux</em> CentOS6下<em>安装</em>redis报错 <em>make</em>[1]: *** [adlist.o] <em>错误</em> 127。[<em>安装</em>gcc]n<em>解决</em>方案:n因为Redis是C实现的,需要gcc来进行编译,所以原因是系统未<em>安装</em>gcc,按顺序执行:nyum install cppnyum install binutilsnyum install glibcnyum install glibc-kernhead...
Linux下安装memcached遇到的一系列问题
root@VM_24_101_centos libevent-2.1.8-stable]# <em>make</em> n  GEN      test/rpcgen-attemptednwhich: no python2 in (/usr/local/sbin:/usr/local/bin:/sbin:/bin:/usr/sbin:/usr/bin:/root/bin:/root/bin)n  File "
linux安装他版本python时遇到的问题及解决方法
因为学习需要以及centos6.9中的python版本过低,所以更新了下python以下是脚本#coding=utf-8nnimport osnimport sysnif os.getuid() == 0:n passnelse:n print '当前用户不是root用户,请以root用户执行脚本'n sys.exit(1)nnversion = raw_input('请输入你想...
解决Linux系统下安装redis make出错的问题
主要问题rncollect2: ld 返回 1 <em>make</em>[1]: *** [redis-server] <em>错误</em> 1 rn<em>make</em>[1]: Leaving directory `/usr/local/redis-3.0.rnrnrnrn<em>解决</em>方法 : <em>make</em> +参数  CFLAGS="-march=i686"rn原理:和gcc编译有关系 -march=i686设定为像-march=i686rn -mt
安装Zabbix过程中出现的问题集
<em>安装</em>Zabbix过程中<em>出现</em>的问题集:zabbix是一个基于WEB界面的提供分布式系统监视以及网络监视功能的企业级的开源<em>解决</em>方案。 zabbix能监视各种网络参数,保证服务器系统的安全运营;并提供灵活的通知机制以让系统管理员快速定位/<em>解决</em>存在的各种问题。故障一:  2637:20151009:050431.719 [Z3001] connection to database 'zabbix' fai...
解决RedHat linux7.0安装出现的一些问题
<em>出现</em>的问题有: n设置BIOS启动项进入U盘启动,选择install,<em>出现</em>no caching mode page found的error;n<em>解决</em>了上述问题,后进行<em>安装</em>,<em>出现</em>no suitable images,可能是要改写setparams;
CentOS 7下sqlite3的问题修复
Centos7下的nltk启动问题CentOS 7, Python 3.6,ipython 6.0.0问题描述n ipython n启动ipython命令n import nltkn爆出以下的<em>错误</em>信息:In [1]: import nltkn---------------------------------------------------------------------------
linuxlinux:./configure 命令出现报错;make 命令报错:没有指明目标
目录nn一、<em>出现</em>报错nn二、<em>解决</em>方法nn一、<em>出现</em>报错nn使用./configure和<em>make</em>命令时,<em>出现</em>以下报错,编译<em>安装</em>失败:nnnn二、<em>解决</em>方法nn(1)<em>解决</em>./configure失败报错问题方法:nn<em>解决</em>方法——<em>安装</em> gcc 和 C++编译器nnncd ~nnnyum install gcc gcc-c++nnnnnn(2)<em>解决</em>./configure失败报错问题后,再次进行编译<em>安装</em>,此时...
安装redis-执行make命令报错解决方法
问题原因:未<em>安装</em>GCCcd hiredis && <em>make</em> staticn<em>make</em>[3]: 进入目录“/opt/redis-3.0.4/deps/hiredis”ngcc -std=c99 -pedantic -c -O3 -fPIC -Wall -W -Wstrict-prototypes -Wwrite-strings -g -ggdb net.cn<em>make</em>[3]: gcc:命令未找到nma
linux下Make编译出错,输入/输出错误原因及解决办法
输入/输出<em>错误</em>rnrncollect2: error: ld returned 1 exit statusrnrnrn原因:rn          编译时工程放在 /mnt/hgfs 共享目录下了rnrnrn<em>解决</em>办法:rn         把工程放在本地的其他目录下,即可编译成功
ubuntu编译安装sqlite库
编译<em>安装</em>sqlite库 静态库
linuxlinux 报错:安装 nginx 时,make 报错解决方法
目录nn一、报错情况nn二、<em>解决</em>方法nn三、openssl旧版本下载和<em>安装</em>nn一、报错情况nn(1)输入命令,报错:nnn<em>make</em>nnnnnn(2)具体报错:nnn<em>make</em>[1]: *** [objs/src/event/ngx_event_openssl.o] <em>错误</em> 1n<em>make</em>[1]: 离开目录“/usr/local/nginx-1.1.10”n<em>make</em>: *** [build] <em>错误</em> 2nn...
linux下redis安装遇到的问题记录
1.redis在<em>make</em>时报错rnrnrn下载解压redis-3.0.2后,执行<em>make</em>进行编译,结果<em>出现</em>下面的<em>错误</em>:rnrn<em>make</em>: cc: Command not found <em>make</em>: *** [adlist.o] Error 127rnrnrnrnrn2.rnrn这是由于新<em>安装</em>的Linux系统没有<em>安装</em>gcc环境,需要<em>安装</em>gcc,为了方便,这里我选择用yum进行<em>安装</em>。rnrn# yum 
Apache安装(1)-apr找不到,make错误等问题
一般服务器系统已经自带了Apache的一些Apache的东西了,但是他们不完整,所以我们<em>安装</em>就报APR找不到。nn下面有<em>解决</em>步骤,综合各个网站自己实践确认得出的哦:nn1.移除系统自带的不完整的APR相关的信息nn命令:nnnyum remove apr-util-devel apr apr-util-mysql apr-docs apr-devel apr-util apr-util-docsn...
make编译QT程序出现如下报错
/usr/local/qwt-6.1.0/lib/libqwt.so: undefined reference to `QSvgGenerator::~QSvgGenerator()'/usr/local/qwt-6.1.0/lib/libqwt.so: undefined reference to `QSvgGenerator::setTitle(QString const&amp;amp;)'/usr...
linux下redis 安装及遇到的问题解决
一、<em>安装</em>过程n1、解压redis<em>安装</em>包ntar -zxvf redis-3.2.0.tar.gzn2、进入redis解压文件夹中ncd redis-3.2.0n3、编译n<em>make</em>n4、编译测试n<em>make</em> testn5、<em>安装</em>n<em>make</em> installn6、设置配置文件路径nmkdir -p /home/user/redis-3.2.0/6379nnncp redis.c
安装redis时出现错误
在<em>安装</em>redis时<em>出现</em>了一些没见过<em>错误</em>:第一1 Redis为c语言编写,因此<em>安装</em>需要配置c语言编译环境gcc,查看<em>linux</em>是否<em>安装</em>了该编译环境,可以直接输入命令查看如下图所示:而如果提示commond not find则意味着本机并无该环境,因此需要<em>安装</em>gcc环境,采用yum install gcc-c++执行进行<em>安装</em>,然后上传redis的<em>安装</em>包,并解压(别忘了关闭防火墙哦)。然后当你输入命令m...
第一次安装Linux,出现的问题
       跟着“腾讯课堂”教程<em>安装</em>Linux10.0版本的,刚开始是添加“镜像文件”的时候,一直找不到CentOS镜像在哪里。当时第一反应就是和之前自学java一样,下载了一大堆文件下来,视频,压缩包,<em>安装</em>包什么都有,有时就是会少那么一两个东西(因甚至会断了一些视频,学完这个教程视频,学习下一个,发现根本和上节课的接不上。这个非常要命,处于什么都不懂的状态,突然没接上上节课讲的,突然又讲了新的...
cmake 出现错误解决办法
编译时<em>出现</em>如下<em>错误</em>:given no  RUNTIME DESTINATIONrnrnrnrnrnrnrn<em>解决</em>方法:rn修改c<em>make</em>文件,加入标记的语句:rnrnrnrn再次进行 c<em>make</em> ..  就可以通过编译
busybox在make编译过程中出错
博主在busybox<em>安装</em>时,在<em>make</em>编译时出了两个错:'MTD_FILE_MODE_RAW' undeclared和'BLKSECDISCARD' undeclared ,在经过上网百度时,发现几乎所有的博客都是千篇一律,但是实际试了<em>一下</em>,发现并没有成功。在经过根据自己的猜想和实验之后,自己想出了一种<em>解决</em>方法,贴出来交流<em>一下</em>。(前四步为busybox<em>安装</em>过程,第5步为上述问题的<em>解决</em>方法)1.到官...
CMake安装发生未知错误解决办法
CMake<em>安装</em>发生未知<em>错误</em>的<em>解决</em>办法n<em>错误</em>如下图:nn<em>解决</em>办法:n1、下载ZIP包,nhttps://c<em>make</em>.org/download/nn我下载的是这个版本nn2、解压到喜欢的地方,解压后如下图nn3、添加系统变量n我的电脑-属性nnn4、完成了nnn...
安装编译leveldb出现的问题以及总结
<em>安装</em>leveldb:nnn1、git clone https://github.com/google/leveldb.gitnnn2、到leveldb目录下,执行<em>make</em>命令nn &amp;gt; <em>make</em>nn此时<em>出现</em>了<em>错误</em>:nn*** No targets specified and no <em>make</em>file found. Stop.nn网上有很多<em>解决</em>此<em>错误</em>的方法,但是都对我不太适应,后来在该目录下执行...
PHP源码编译报错解决方法
cc: Internal error: Killed (program cc1)rnPlease submit a full bug report.rnSee for instructions.rn<em>make</em>: *** [ext/<em>sqlite3</em>/libsqlite/<em>sqlite3</em>.lo] Error 1rn[root@iZ23uewresmZ php-5.6.27]# rnrnrn百度搜索 ***
linux编译内核make menuconfig报错解决办法
<em>linux</em>编译内核时rn输入<em>make</em> menuconfig命令rnrnrn*** Unable to find the ncurses libraries or thernrn*** required header files.rnrn*** '<em>make</em> menuconfig' requires the ncurses libraries.rnrn***rnrn*** Install ncurse
C#课余测验
课余训练 在线等 <em>急急</em>急``````
Python安装问题: Python3.7.2 make install 出问题解决办法
<em>错误</em>提示为:ModuleNotFoundError: No module named ‘_ctypes’nn<em>解决</em>办法nnsudo apt-get updatennsudo apt-get upgradennsudo apt-get dist-upgradennsudo apt-get install build-essential python-dev python-setuptools pyth...
安装mdtest时出现一般127错误解决办法
<em>安装</em>Mdtest<em>出现</em><em>错误</em>:rnDLinux -D_FILE_OFFSET_BITS=64 -D_LARGEFILE_SOURCE=1 -D__USE_LARGEFILE64=1 -g -o mdtest mdtest.c -lmn<em>make</em>: DLinux: Command not foundn<em>make</em>: [mdtest] Error 127 (ignored)有时候也会有 error 101啥的
执行make menuconfig出错问题
daron@daron-virtual-machine:~/<em>linux</em>/tiny6410/<em>linux</em>-2.6.38$ <em>make</em> menuconfig  HOSTCC  scripts/basic/fixdep  HOSTCC  scripts/basic/docproc  HOSTCC  scripts/kconfig/conf.o  HOSTCC  scripts/kconfig/kxgette...
Centos7 中下载安装 gcc资源 解决make: *** 没有指明目标并且找不到 makefile错误
<em>解决</em><em>make</em>: *** 没有指明目标并且找不到 <em>make</em>file<em>错误</em>。 停止。n执行<em>一下</em><em>安装</em>keepalived语句报错:n./configure --prefix=/usr/local/keepalivedn<em>make</em>n<em>make</em> installn报错信息:nconfigure: error:n!!! OpenSSL is not properly installed on your system....
linux centos7 安装MQTT mosquitto时常见异常及解决办法
【1】编译找不到openssl/ssl.hrn    【<em>解决</em>方法】——<em>安装</em>opensslrnsudo yum install openssl-develrn【2】编译过程找不到ares.hrnsudo yum install libc-ares-devrnmosquitto_internal.h:51:20: error: ares.h: No such file or directoryrn其实
centos7 安装图形化界面及安装完成后出现please make your choice from '1'...
执行命令 yum groupinstall "X Window System"  (注意有引号) 回车rnrn这里输入  y 回车 然后等待<em>安装</em>rn rnrn这里再输入 y 回车rnrnrn<em>安装</em>完成会<em>出现</em>   complete rnrnrn输入命令 yum grouplist 检查可以<em>安装</em>的图形界面rnrnrn然后<em>安装</em>  yum groupinstall "GNOME Desktop" 回车 等待
Linux系统安装Python编译报错
                                             Unix &amp;amp; Linux 平台<em>安装</em> Pythonnn以下为在 Unix &amp;amp; Linux 平台上<em>安装</em> Python 的简单步骤:nn打开 WEB 浏览器访问https://www.python.org/downloads/source/n 选择适用 于Unix/Linux 的源码压缩包。n 下载...
linux学习之路——Linux出现“内部错误解决方案
本篇博客只是为了记载自己在学习<em>linux</em>的过程中所遇到的问题。在网上可能大家会遇到各种各样的<em>解决</em>方法,在我所写的博客里只记录小编在遇到问题时,是怎么<em>解决</em>的,以便以后查阅!如果没有<em>解决</em>您的问题,小编我深感抱歉。如果能后<em>解决</em>您<em>出现</em>的问题,小编我甚是激动。rn小编在学习过程中有一天打开虚拟机中的<em>linux</em>系统时提示,<em>出现</em>内部<em>错误</em>。<em>出现</em>问题当然就开始在网上找有关<em>解决</em>方法,当然也有提议说重装系统,这是最笨的
安装mysql8.0.15过程中出现以下问题
<em>安装</em>mysql8.0.15过程中<em>出现</em>以下问题nmysql installer Invalid server templaten可能原因是<em>安装</em>路径中有中文或空格。nn
make menuconfig 后出现错误解决办法
<em>make</em> menuconfig 指令执行后<em>出现</em>以上<em>错误</em>,说明是需要<em>安装</em>ncuses-develrn在Ubuntu 12.04下<em>安装</em>ncuses-devel使用指令rn“sudo apt-get install libncurses5-dev”rn<em>安装</em>好之后,再<em>make</em> menuconfig就不会有任何问题了。
【slam初探】安装opencv中遇到的问题(cmake)
我使用的系统为Ubuntu Kylin,<em>安装</em>opencv时依旧遇到了一些令人困惑的问题。整理如下:n1.c<em>make</em>过程中下载ippicv_<em>linux</em>_20151201长时间无响应n原因:网络原因,下载速度极慢nn<em>解决</em>方法:手动下载,然后替换已下载的不完整文件。n      下载地址:https://raw.githubusercontent.com/Itseez/opencv_3rdpa
关于使用Makefile进行GCC编译报错问题解决方法
汇编代码如下:_start:n ldr r0, =0x11111111n ldr r1, =0xE0200240n str r0, [r1] ldr r0, =0x0n ldr r1, =0xE0200244n str r0, [r1]nflag:n b flagnMakefile代码如下:led.bi
ffmpeg在linux下编译时遇到的错误,以及修正方法
FFMPEG在Linux下编译过程中出错总结rn一.Nasm的版本问题rn如果<em>安装</em>x264<em>出现</em>nasm版本过低或者没有时,下载<em>安装</em>最新版nasm。rn<em>安装</em>过程以及注意事项:rn如果nasm版本过小先卸载rnsudo apt-get autoremove --purge nasmrn然后下载nasm解压,进入到nasm目录下rn然后执行rn./configure--prefix=/usr 注意这个路
protobuf安装中遇到的问题及解决方案
首先来个 protobuf 简介:rn     rn      Protocol Buffers 是一种轻便高效的结构化数据存储格式,可以用于结构化数据串行化,很适合做数据存储或rn RPC 数据交换格式。它可用于通讯协议、数据存储等领域的语言无关、平台无关、可扩展的序列化结构数据格式。目前提供了 C++、Java、Python 三种语言的 API。rn     <em>安装</em>步骤:rnrnrn rn  
qt环境安装
自己的<em>安装</em>笔记,<em>make</em>阶段,<em>出现</em><em>一下</em><em>错误</em> /usr/bin/ld: cannot find -lXrender collect2: ld returned 1 exit status <em>make</em>[1]: *** [../../../../lib/libQtWebKit.so.4.7.3] <em>错误</em> 1 <em>make</em>[1]: Leaving directory,自己遇到的问题都<em>解决</em>的,ubuntu 12.04系统。
linux下Matcaffe调用及库链接问题的解决(mattest不通过)
编译<em>make</em> matcaffe后,执行<em>make</em> mattest后,往往<em>出现</em>“Invalid MEX-file"问题,其原因是MATLAB和<em>linux</em>的库冲突,<em>解决</em>的方法是用<em>linux</em>的库(在编译caffe之前大家的opencv等库肯定也早已装好了)n大部分的<em>解决</em>方法是通过export LD_LIBRARY_PATH和 LD_PRELOAD来链接,但是效果不好。最后发现,只有直接去MATLAB下面
CentOS7安装gotoblas遇到的问题
<em>错误</em>信息:/usr/lib64/gcc/x86_64-suse-<em>linux</em>/4.7/../../../../x86_64-suse-<em>linux</em>/bin/ld: cannot find -l-lcollect2: error: ld returned 1 exit status <em>make</em>[1]: * [../libgoto2_nehalemp-r1.13.so] Error 1 <em>make</em>[1]:...
安装编译 caffe-SSD 环境常见错误解决方法
n1)fatal error: hdf5.h: 没有那个文件或目录n2)nvcc fatal : Unsupported gpu architecture ‘compute_20’n3)cv::imread(cv::String const&amp;amp;amp;amp;amp;amp;, int)’未定义的引用n4)对’inflateValidate@ZLIB_1.2.9’未定义的引用n注意:每次修改完,重新 <em>make</em> 时,都需要先...
安装linux系统时候遇到的一些问题
1电脑不能<em>安装</em>虚拟机。    有的电脑不支持虚拟化,所以无法<em>安装</em>虚拟机,所以在<em>安装</em>之前先检查下电脑的情况,网上有方法。    这样只能通过<em>安装</em>双系统的办法学习<em>linux</em>了。2win10+<em>linux</em>  ubuntu18.04。这个网上有很多资料,我这里遇到两个比较典型的问题特此记录。    2.1使用软碟通制作的U盘不能启动,我遇到的问题是网上基本都是要求写入模式:USB-HD++,这里更改为RAW...
安装svn1.8.17,遇到sqlite3相关错误
<em>安装</em>svn1.8版本,遇到如下<em>错误</em>:nsubversion/libsvn_subr/sqlite.c:102: error: expected specifier-qualifier-list before ‘<em>sqlite3</em>’nsubversion/libsvn_subr/sqlite.c:111: error: expected specifier-qualifier-list before ‘<em>sqlite3</em>_stmt’nsubversion/libsvn_subr/sqlite.c:118: error
opencv编译中遇到的error(1)
<em>错误</em>1 error C4996: 'fopen': This function or variable may be unsafe. Consider using fopen_s instead. To disable deprecation, use _CRT_SECURE_NO_WARNINGS. See online help for details. f:\opencv2.
fastDFS安装时,./make.sh编译时出错---perl:未找到命令
前言:nn最近在实践项目的过程中,用到了fastDFS,<em>安装</em>的时候在./<em>make</em>.sh编译时报错。nn<em>错误</em>:nnnn<em>解决</em>方案:nn执行:nn[plain] view plain copynnyum -y install zlib zlib-devel pcre pcre-devel gcc gcc-c++ openssl openssl-devel libevent libevent-devel ...
mdmcpq.in文件
急求XP系统中mdmcpq.inf和usbser.sys文件,<em>解决</em>套件无连接!
解决Redis安装时的编译报错问题
1、报错:“cc:未找到命令”rnrn<em>解决</em>办法如下:rn&amp;amp;amp;amp;nbsp;&amp;amp;amp;amp;nbsp;&amp;amp;amp;amp;nbsp;&amp;amp;amp;amp;nbsp;&amp;amp;amp;amp;nbsp;Linux环境<em>安装</em>gcc。rnyum -y install gcc auto<em>make</em> autoconf libtool <em>make</em>rnrnrngcc<em>安装</em>完毕,完美<em>解决</em>!rn2、报错:“<em>make</em>[1]: *** [adlist.o] <em>错误</em>
Linux安装软件时出现无法修正错误解决方法
在WIN10子系统装软件时,报如下<em>错误</em>: n n经过查找资料,<em>解决</em>方法就是更换系统的源:nnnn# 1.备份原来的数据源配置文件ncp /etc/apt/sources.list /etc/apt/sources.list_backupn# 2.编辑数据源配置文件nvi /etc/apt/sources.listn# 在这里我使用的是阿里云的数据源:n#======================...
linux/ubuntu下安装nginx时./configure后出现几种错误解决方法
尽管ubuntu系统下apt-get具体强大软件<em>安装</em>功能,但有时还是需要独立<em>安装</em>软件。n由于nginx的一些模块需要依赖其他第三方库,通常有pcre库(支持rewrite模块)、zlib库(支持gzip模块)、openssl库(支持ssl模块)等n1,<em>错误</em>提示:error:the HTTP rewrite module requires the PCRE libraryn n<em>解决</em>方法:su
ubuntu18.04 在编译内核时报错解决方案。
ubuntu18.04在编译时报错,主要是<em>安装</em>包问题,将下面<em>安装</em>包重新<em>安装</em><em>一下</em>即可<em>解决</em>。nnsudo apt-get install libncurses5-dev libssl-devnnsudo apt-get install build-essential opensslnnsudo apt-get install zlibc minizipnnsudo apt-get install li...
lapack 安装错误
Testing Nonsymmetric Eigenvalue Problem routines rn./xeigtstz < nep.in > znep.out 2>&1 rnMakefile:453: recipe for target ‘znep.out’ failed rn<em>make</em>[1]: * [znep.out] Error 139<em>出现</em>上述<em>错误</em>,一句话搞定: rnulimit -s unlimit
centos7编译安装php7我遇到的错误
 nn关于php.ininn1、如果是rpm包<em>安装</em>的,默认配置文件是/etc/php.ini。n2、如果是源码包<em>安装</em>的,需要自己到源码包的目录下复制一个php.ini-development或者php.ini-production到php的配置文件所在目录,并改名为php.ini。nn nn nn nn关于centos7<em>安装</em>php7请参考nnhttp://www.jb51.net/article/...
Qt在Linux上安装出现错误
q<em>make</em>: could not exec ‘/usr/lib/i386-<em>linux</em>-gnu/qt4/bin/q<em>make</em>’: No such file or directory n1、<em>错误</em>如下图所示:2、<em>解决</em>的办法按网上一般的步骤来,但还是会遇到讲解不清楚的地方输入密码获取权限,进入如下页面:关键在这里,该如何改,我在这磨蹭了好一会不得门道,现将具体方法告知各位像我一样的小白。 n 3、上一步用到V
linux安装一些软件的时候出现包依赖问题
sudo apt-get install aptitude nsudo aptitude install python-dev n先no后yes
Eclipse SDT
用于<em>解决</em>在Eclipse中<em>安装</em>ADT20.0.3插件时<em>出现</em>的“org.eclipse.cdt.feature.group 0.0.0' but it could not be found”<em>错误</em>。
编译ncurses错误处理及解决办法
编译ncurses是编译<em>linux</em>内核时用到的一个工具,在<em>make</em>时遇到了如下<em>错误</em>:In file included from ../ncurses/curses.priv.h:283:0,n from ../ncurses/lib_gen.c:19:n_46863.c:835:15: error: expected ‘)’ before ‘int’n../inclu
PostBuildVistaFix
<em>解决</em><em>安装</em>程序在win7/vista<em>安装</em>时<em>出现</em>2869的<em>错误</em>
linux sqlite 安装编译问题
1.   <em>安装</em>从官网下载<em>安装</em>就行rn到<em>安装</em>目录下输入以下rn./configurern<em>make</em>rnsudo <em>make</em> installrn生成 <em>sqlite3</em>.c <em>sqlite3</em>.h 等文件rn2.      新建数据库 <em>sqlite3</em> test.dbrn3.      写测试程序把<em>sqlite3</em>.c <em>sqlite3</em>.h 和测试程序放在一个目录下rn#includern#includernintma
内核模块编译时出现的问题解决
第一次把自己编译的驱动模块加载进开发板,就<em>出现</em>问题,还好没花费多长时间,下面列举<em>出现</em>的问题及<em>解决</em>方案n     1:<em>出现</em>insmod: error inserting 'hello.ko': -1 Invalid module formatnnnn法一(网上的):是因为内核模块生成的环境与运行的环境不一致,用<em>linux</em>-2.6.27内核源代码生成的模块,可能就不能在<em>linux</em>-2.6.3
用命令行工具sqlite3打开数据库出现乱码的解决方案
数据库中存储的数据本是中文,用<em>sqlite3</em>打开之后变成乱码rn方法:rn(1)查看dos的编码方式,一般为GBK(简体中文)rnAndroid一般的编码方式都是UTF-8,所以要将dos的编码方式也改为UTF-8rn(2)借用chcp命令改变编码方式rnchcp 65001        (将编码方式改为UTF-8)rnchcp 936            (将编码方式改回GBK)rn(3)改
安装lamp环境遇到的坑以及解决办法(详细)
一:<em>安装</em>Apachenn1.<em>安装</em>yum -y install httpd2.开启apache服务systemctl start httpd.service3.设置apache服务开机启动systemctl enable httpd.servicenn4.验证apache服务是否<em>安装</em>成功n在本机浏览器中输入虚拟机的ip地址,CentOS7查看ip地址的方式为:ip addrnn这里我遇到了一个bug...
【Caffe】Matlab接口(make编译通过,make mattest出错)
之前一直在用pycaffe,很少接触MatCaffe,然而几个论文上的demo需要用到Matcaffe,最近在编译的时候,<em>出现</em>不少<em>错误</em>,记录<em>一下</em>。环境配置:Ubuntu16.04 + TitanX + Cuda7.5 + Cudnn V4<em>错误</em>如下:# <em>make</em> mattestncd matlab; /usr/local/MATLAB/R2015b/bin/matlab -nodisplay -r '
anaconda3安装解决VScode出错的问题
软件名称:anaconda3n问题描述n在<em>安装</em>anaconda3时,<em>安装</em>程序进行到VScode时,点击<em>安装</em>,会<em>出现</em>各种报错,导致<em>安装</em>的软件没有Anaconda Navigator等菜单选项,在试验了N多方法后均无效果。n<em>解决</em>方法n可以通过单独<em>安装</em>VScode的方法<em>解决</em>以上问题:n1.<em>安装</em>之前卸载原来<em>安装</em>的anaconda3;n2.通过https://code.visualstudio.com/下载...
linux python3 版本安装,及安装遇到问题处理
<em>安装</em>: 版本可以自己到官网查看想<em>安装</em>的版本。nn<em>linux</em> 选择源码<em>安装</em>nnnn选择版本,最新的会在前两行nnnn<em>linux</em>选择前两个,这边选择第一个nn<em>安装</em>步骤:nn#假如有用到import bz2,需先<em>安装</em>bzip2-devel依赖,python3才会<em>安装</em>此模块。nyum install openssl-devel expat-devel bzip2-devel gdbm-devel read...
求教关于视窗中滚动条 滚动后 擦除和重绘的问题
关于滚动条 重绘 和 擦除的问题 <em>急急</em>急 求教
ubuntu14.04安装opencv3.1及其出现问题
<em>安装</em>opencv3.1rn从官网(http://opencv.org/downloads.html)下载Opencv,并将其解压到你要<em>安装</em>的位置,假设解压到了/home/opencv。rnrn1 unzip opencv-3.1.0.zipn2 sudo cp ./opencv-3.1.0 /homen3 sudo mv opencv-3.1.0 opencvrnrnrn<em>安装</em>前准备,创建编译文件夹
这是SQLITE的MAKEFILE
这是一个NAKEFILE库,用于SQLITE格式的数据,方便实用,简单易懂
内网下安装django时缺少_sqlite3
yum -y install sqlite-develnn
make 时报错:无目标,已停止
有个<em>make</em>file是这样的,a.<em>make</em>file:rnrnNCNN =/home/wzy/ncnn-masternOPENCV = /home/wzy/opencv-2.4.11nnINCPATH=-I${NCNN}/build/install/include \n -I${OPENCV}/modules/objdetect/include \n -I${OPENCV}/modules/high
安装redis服务器时,执行sudo make test时出现错误
You need tcl 8.5 or newer in order to run the Redis test nMakefile:225: recipe for target ‘test’ failed n<em>make</em>: * [test] Error 1nn提示需要<em>安装</em>tcl,<em>解决</em>方法如下nnnwget http://downloads.sourceforge.net/tcl/tcl8.6.1-s...
编译文件时make install报错
在一般用户使用时rn正常编译文件四步骤:rn$ tar -zxvf filename //解压rn$ ./configure //去解压目录下执行rn$ <em>make</em> //编译所有rn$ <em>make</em> install //将编译好的文件进行<em>安装</em>rnrn在执行<em>make</em> install时遇到了下面的<em>错误</em>:rn[hadoop@hadoop01 ~/tools/xz-5.0.3]$ <em>make</em> installrnMaking ...
cmake 常见问题及解决
1. undefined reference to symbol ‘pthread_key_delete@@GLIBC_2.2.5未定义对某符号的引用,该<em>错误</em>为链接时(linking)发生的<em>错误</em>。有如下方式的<em>解决</em>方案:n修改 Makefile 文件,为变量 LDFLAGS加入,-L /lib64 -l pthread; n通过TARGET_LINK_LIBRARIES(... -lpthread -
openfst 1.6.1编译过程中失败的修改(short-path.h)
近期想升级<em>一下</em>KALDI这个程序,在编译openfst 1.6.1过程中,发现这个编译过程已经和原来的不太一样。rnrnrn网上没有可参照的地方。rnrnrn只能从原始的文档上进行查看http://www.openfst.org/twiki/bin/view/FST/DistInstall。rnrnrn通过文档查看,发现只需要三步rnrnBasic Installationn===========
make -k(keep going)命令会在发现错误时继续执行(用于一次发现所有错误
我们在执行<em>make</em>file进行编译的时, 会经常遇到<em>错误</em>, 然后<em>解决</em>, 然后又<em>make</em>,  然后又发现<em>错误</em>, 然后又<em>解决</em>, 烦人, 能不能一次发现所有<em>错误</em>呢? n        能的!nnn        main.cpp很简单, 我们只看<em>make</em>file(故意写成<em>错误</em>的g+++):nmain: main.o n g+++ -o main main.onmain.o: main.cpp
Linux下面安装Python常见错误解决方法
1、nnnnn2、<em>安装</em>setuptools报错n<em>安装</em>zlibn$wget http://zlib.net/zlib-1.2.8.tar.gzn$tar -xvzf zlib-1.2.8.tar.gzn$cd zlib-1.2.8.tar.gzn$./configuren$<em>make</em>n$sudo <em>make</em> installnn然后再次<em>安装</em>Pythonnnncopying
编译内核出现错误
编译内核出息的<em>错误</em>rnroot@jxj:/home/share/IPC/hi3516cv300/sdk/3516c/<em>linux</em>-3.18.y# <em>make</em> menuconfigrnHOSTCC scripts/kconfig/mconf.ornIn file included from scripts/kconfig/mconf.c:23:0:rnscripts/kconfig/lxdialog/d
yum安装提示 PYCURL ERROR 6错误解决方法
n n n 如果你在使用yum<em>安装</em>的时候提示以下<em>错误</em>:nnLoaded plugins: fastestmirror, securitynCould not retrieve mirrorlist http://mirrorlist.centos.org/?release=6&amp;amp;arch=x86_64&amp;amp;repo=os error wasn14: PYCU...
编译综合实验:选择部分C语言的语法成分,设计其词法分析程序、语法语义分析程序并采用编译的方法将C语言表达式翻译成后缀式形式下载
选择部分C语言的语法成分,设计其词法分析程序、语法语义分析程序并采用编译的方法将C语言表达式翻译成后缀式形式 相关下载链接:[url=//download.csdn.net/download/skylqf01/2425041?utm_source=bbsseo]//download.csdn.net/download/skylqf01/2425041?utm_source=bbsseo[/url]
linux多线程设计及示例下载
一个线程或者是可汇合的(joinable,缺省值),或者是脱离的(detached)。当一个可汇合的线程终止时,它的线程ID和退出状态将留到另一个线程对它调用pthread_join。脱离线程却象守护进程:当它们终止的时,所有相关资源都被释放,我们不能等待它们终止。如果一个线程需要知道另一个线程什么时候终止,那就最好好吃第二个线程的可汇合状态。 相关下载链接:[url=//download.csdn.net/download/myboboapple/2497018?utm_source=bbsseo]//download.csdn.net/download/myboboapple/2497018?utm_source=bbsseo[/url]
glassfish-v3-windows.part2下载
glassfish-v3-windows.part2 相关下载链接:[url=//download.csdn.net/download/Jeremy_Yu/2698209?utm_source=bbsseo]//download.csdn.net/download/Jeremy_Yu/2698209?utm_source=bbsseo[/url]
文章热词 机器学习教程 Objective-C培训 交互设计视频教程 颜色模型 设计制作学习
相关热词 mysql关联查询两次本表 native底部 react extjs glyph 图标 java大神班 大数据大神班
我们是很有底线的