使用Cmake编写程序时遇到的 error: narrowing conversion

C/C++ > C++ 语言 [问题点数:100分,结帖人selfpaper]
等级
本版专家分:0
结帖率 66.67%
等级
本版专家分:454108
勋章
Blank
状元 2017年 总版技术专家分年内排行榜第一
Blank
榜眼 2014年 总版技术专家分年内排行榜第二
Blank
探花 2013年 总版技术专家分年内排行榜第三
Blank
进士 2018年总版新获得的技术专家分排名前十
2012年 总版技术专家分年内排行榜第七
等级
本版专家分:345
selfpaper

等级:

CMake Warning at cmake/OpenCVPackaging.cmake:23 (message): CPACK_PACKAGE_VER 问题处理

今天在win7中配置opencv2.4.13 时报错 ,错误信息是:CMake Warning at cmake/OpenCVPackaging.cmake:23 (message): CPACK_PACKAGE_VER 网上搜了一圈,发现只有提问的,没有找到答案,只好自己想办法了。 我也是...

CMAKE error

CMake Error at CMakeLists.txt:19 (TARGET_LINK_LIBRARIES):  Cannot specify link libraries for target "netdetect" which is not built by  this project. 答案:  要将 ADD_EXECUTABLE的声明放

opencv: 安装 & 可能遇到的问题 & 解决方案

安装中可能遇到的问题  装了N次OpenCV,遇坑无数:Problem_0  apt-get 下不了。Solution  用aptitude下。Problem_1  ffmpeg下不到。Solution  下载 ffmpeg 压缩包,在终端下解压即可。无需制定目录,也...

VTK-5.10.1版本--配置问题

错误 1 error C2039: “errorLine”: 不是“Tcl_Interp”的成员 e:\Program Files\VTK\vtk\Common\vtkTclUtil.cxx 493 vtkCommonTCL 错误 2 error C2039: “errorLine”: 不是“Tcl_Interp”的成员 e:\Program ...

OpenCV使用CMake和MinGW-w64的编译安装

之前写过的一篇博文:OpenCV使用CMake和MinGW的编译安装及其在Qt配置运行 是使用 32 位的 MinGW 在 Windows 下编译 OpenCV 生成 32 位的 dll。 而这篇博文是使用 64 位的 MinGW 编译 OpenCV 生成 64 位的 dll。 ...

Narrowing conversion error on Windows.

requires a narrowing conversion</code> at the <code>BINLOG_INFO("Hello {}!", "World");</code> line. <p>However, when I compile the same code with WSL (GCC 8.3.0) everything works as ...

Narrowing conversion error trying to compile Urho3D under C++11.

C:\Projects\Game Development\Engines\Urho3D\Source\ThirdParty\Bullet\src\LinearMath\btScalar.h:339:54: error: narrowing conversion of '+Inf' from 'double' to 'float' inside...

Linux安装MySQL5.5版本+源码安装遇到的问题及解决方法

网上安装数据库的教程很多,百度了一些。按照教程做的时候总会出现一些问题,... 参考教程:http://www.cnblogs.com/fly1988happy/archive/2011/11/21/2257682.html 安装过程中遇到的问题和解决方法:问题一、CMake ...

VTK配置步骤(WIN7 64位 + VS2012 + VTK-5.10.1)

由于项目中需要用到VTK,上周三就开始编译VTK源码,中间出现了一系列问题。首先是下载的高版本代码顺利编译后,...在群里也没能得到解决办法,到是发现大家最初配置都出现过很多问题,有的一个月才配置好,简直吓尿

ubuntu16.04,zed7020,sdsoc,xfOpenCV,arm-linux,OpenCV3.4.1

二、但第5步出现问题: 可以看到什么都没有输出,即使运行我生成好的./sdx_hello.elf依旧不会正常输出。/mnt下也没有看到挂载的SD卡,但SecureCRT却可以检测到SD卡,但并不是ttyusb0而是ttyacm0!!但去windows.....

MySQL编译安装常见错误

[root@localhost mysql-5.7.19]# cmake -DCMAKE_INSTALL_PREFIX=/usr/local/mysql \ > -DSYSCONFDIR=/etc \ > -DMYSQL_TCP_PORT=3306 \ > -DMYSQL_UNIX_ADDR=/var/lib/mysql/mysql.sock \ ...

Windows: error: expected unqualified-id

<div><p>ANGLE is attempting to pull in the latest version of the Vulkan validation layers, but is hitting an error with the Windows build: <pre><code> FAILED: obj/third_party/vulkan-validation-layers/...

SQL专栏之常见注入备忘

layout: post title: SQL专栏 category: Vulnerability_mining tags: SQL keywords: mysql,注入 前言 xxxxx 开始 分类 先对sql注入的类型进行分类,大体我分为两类,一类是能够直观的看到数据库返回的信息,另一类...

Build error on W32

E:/Phflsource/photoflow/src/dt/iop/clipping.cc:284:65: error: narrowing conversion of '+Inf' from 'double' to 'float' inside { } [-Wnarrowing] float aabb_in[4] = { ...

视觉SLAM十四讲第二版实践操作遇到的问题

视觉SLAM十四讲第二版实践操作问题汇总(更新中…) Ubuntu系统版本为 18.04,IDE为CLion 第3讲 问题: ...因为CLion默认会在工程目录下创建cmake-build-debug文件夹用来存放中间文件。 解决: s...

pytorch下import numpy失败_PyTorch的编译系统

背景本文以PyTorch 1.0为基础。PyTorch的编译首先是python风格的编译,使用了python的setuptools编译系统。...3,使用cmake生成Makefile;4,Make命令——中间源文件的产生;5,Make命令——编译...

Cmake build and test automation

<p>There was a hard error in one of the samples from a narrowing conversion. <h2>Ubuntu 16.04 (WSL) + GCC 6.2 + Boost 1.58.0 <p>Configure using: <pre><code>Bash mnagy-Z50-75:~/build/triSYCL/...

ffmpeg与第三方编码编译安装

2019独角兽企业重金招聘Python工程师标准>>> ...

Build failed on segmatch:make

/home/graerth/new_ws/src/segmatch/segmatch/src/opencv_random_forest.cpp:350:65: warning: narrowing conversion of ‘((segmatch::OpenCvRandomForest*)this)->segmatch::OpenCvRandomForest::params_....

opencv 3.0安装提示ippicv 安装的MD5不匹配问题

于是打开该sh文件,按照sh文件的步骤来安装,直到提示错误步骤----就是在下载完后新建build目录并进入cmakecmake -D CMAKE_BUILD_TYPE=RELEASE -D CMAKE_INSTALL_PREFIX=/usr/local -D WITH_TBB=ON等等)出错: ...

Can't compile in linux

/home/cammera/Software/Softwarebuilds/gbe-plus/src/gba/swi.cpp:49:1: error: narrowing conversion of ‘65134’ from ‘int’ to ‘s16 {aka short int}’ inside { } [-Wnarrowing] }; ^ /home/cammera/...

MySQL源码安装

1 获取mysql源码版本 http://dev.mysql.com/downloads/mysql/ 下载并留心MD5信息 将下载后的文件上传到linux服务器上 2 校验 安装包 [root@server ~]# md5sum -b...b054b30d89c03f6173af4c6

Efficient&Elegant:Java程序员入门Cpp

最近项目急需C++ 的知识结构,虽说我有过快速学习很多新语言的经验,但对于C++ 老特工我还需保持敬畏(内容太多),本文会从一个Java程序员的角度,制定高效学习路线快速入门C++ 。 Java是为了就业,C++ 是信仰。...

Does not build on Windows

s already another issue about not building on Windows, but my error log is different enough from theirs that I don't want to confuse things in that thread. <p>I'm running Microsoft Visual ...

build translate fail under gcc 5.3.1

/home/wliao2/translate/pytorch_translate/cpp/Decoder.cpp:38:18: error: expected constructor, destructor, or type conversion before ‘(’ token C10_DEFINE_string(encoder_model, "", "...

从其他语言迁移到c

How do I get started writing C++ projects? I have experience with JavaScript, Go, Rust, Ruby, etc. so what are the package managers, build ... 我如何开始编写C ++项目? 我有JavaScript,Go,Rust,Rub...

undefined reference to `dggsvd3'

This is my CMakeError.log: <p>Performing C++ SOURCE FILE Test HAVE_TEUCHOS_LAPACKLARND failed with the following output: Change Dir: /share/apps/Trilinos-master/build/CMakeFiles/CMakeTmp <p>...

Claymore-Dual-Miner:下载以太坊矿工(2020年更新)-源码

Claymore-Dual-Miner:下载以太坊矿工(2020年更新)

垃圾分类数据集及代码

资源说明: 数据集主要包括6类图片:硬纸板、纸、塑料瓶、玻璃瓶、铜制品、不可回收垃圾 代码运行说明: 1、 安装运行项目所需的python模块,包括tensorflow | numpy | keras | cv2 2、 train.py用于训练垃圾分类模型,由于训练的数据量过于庞大,因此不一并上传 3、 predict.py用于预测垃圾的类别,首先运行predict.py,然后输入需要预测的文件路径,即可得到结果。

个人简历模板

优质简历模板,目前最前全的模板收藏,需要换工作的小伙伴们可以试试

相关热词 c# 测试并发 c# 如何提交地址 c# 反射 转 原码 c#mvc项目 c# 示例 长连接 c# 开发网站 c#通过反射获取类型信息 c# lock 的参数 c# stream 复制 android c#