使用Cmake编写程序时遇到的 error: narrowing conversion

C/C++ > C++ 语言 [问题点数:100分,结帖人selfpaper]
等级
本版专家分:0
结帖率 66.67%
等级
本版专家分:456808
勋章
Blank
状元 2017年 总版技术专家分年内排行榜第一
Blank
榜眼 2014年 总版技术专家分年内排行榜第二
Blank
探花 2013年 总版技术专家分年内排行榜第三
Blank
进士 2018年总版新获得的技术专家分排名前十
2012年 总版技术专家分年内排行榜第七
selfpaper

等级:

CMAKE error

CMake Error at CMakeLists.txt:19 (TARGET_LINK_LIBRARIES):  Cannot specify link libraries for target "netdetect" which is not built by  this project. 答案:  要将 ADD_EXECUTABLE的声明放

编译的时候出现问题?

/home/administrator/caffe-yolov3/cuda.cpp:53:22: warning: narrowing conversion of 'x' from size_t {aka long unsigned int}' to 'unsigned int' inside { } [-Wnarrowing] dim3 d = ...

Narrowing conversion error on Windows.

requires a narrowing conversion</code> at the <code>BINLOG_INFO("Hello {}!", "World");</code> line. <p>However, when I compile the same code with WSL (GCC 8.3.0) everything works as ...

Narrowing conversion error trying to compile Urho3D under C++11.

C:\Projects\Game Development\Engines\Urho3D\Source\ThirdParty\Bullet\src\LinearMath\btScalar.h:339:54: error: narrowing conversion of '+Inf' from 'double' to 'float' inside...

Windows: error: expected unqualified-id

<div><p>ANGLE is attempting to pull in the latest version of the Vulkan validation layers, but is hitting an error with the Windows build: <pre><code> FAILED: obj/third_party/vulkan-validation-layers/...

OpenCV使用CMake和MinGW-w64的编译安装

之前写过的一篇博文:OpenCV使用CMake和MinGW的编译安装及其在Qt配置运行 是使用 32 位的 MinGW 在 Windows 下编译 OpenCV 生成 32 位的 dll。 而这篇博文是使用 64 位的 MinGW 编译 OpenCV 生成 64 位的 dll。 ...

Linux安装MySQL5.5版本+源码安装遇到的问题及解决方法

网上安装数据库的教程很多,百度了一些。按照教程做的时候总会出现一些问题,... 参考教程:http://www.cnblogs.com/fly1988happy/archive/2011/11/21/2257682.html 安装过程中遇到的问题和解决方法:问题一、CMake ...

我个人的apache log4cxx v0.10.0的编译与测试使用

https://logging.apache.org/log4cxx/latest_stable/usage.htmlhttps://logging.apache.org/log4cxx/latest_stable/download.htmlhttps://archive.apache.org/dist/logging/log4cxx/1、个人环境:CentOS 7.3,gcc ...

ffmpeg与第三方编码编译安装

一、安装环境 文档日期:2015年7月8日,所下载软件的版本是该日期所在的最新版本。 是 1、系统 CENTOS7 ...yum -y install gccglibc glibc-devel make nasm pkgconfig lib-devel openssl-devel expat-develgettext-...

iOS编程 手动忽略clang编译器警告

在iOS开发过程中, 我们可能会碰到一些系统方法弃用, weak、循环引用、不能执行之类的警告。 有代码洁癖的孩子们很想消除他们, 今天就让我们来一次Fuck 警告!! 首先学会基本的语句 #pragma clang diagnostic push...

Build error on W32

E:/Phflsource/photoflow/src/dt/iop/clipping.cc:284:65: error: narrowing conversion of '+Inf' from 'double' to 'float' inside { } [-Wnarrowing] float aabb_in[4] = { ...

Does not build on Windows

s already another issue about not building on Windows, but my error log is different enough from theirs that I don't want to confuse things in that thread. <p>I'm running Microsoft Visual ...

视觉SLAM十四讲第二版实践操作遇到的问题

视觉SLAM十四讲第二版实践操作问题汇总(更新中…) Ubuntu系统版本为 18.04,IDE为CLion 第3讲 问题: ...因为CLion默认会在工程目录下创建cmake-build-debug文件夹用来存放中间文件。 解决: s...

Cmake build and test automation

<p>There was a hard error in one of the samples from a narrowing conversion. <h2>Ubuntu 16.04 (WSL) + GCC 6.2 + Boost 1.58.0 <p>Configure using: <pre><code>Bash mnagy-Z50-75:~/build/triSYCL/...

Caffe2 - Build From Source (源码编译安装) - troubleshooting (疑难解答)

Caffe2 - Build From Source (源码编译安装) - troubleshooting (疑难解答) 1. ImportError: No module named setuptools yongqiang@strong-sys:~/Caffe2_install/pytorch$ python setup.py install ...

Build failed on segmatch:make

/home/graerth/new_ws/src/segmatch/segmatch/src/opencv_random_forest.cpp:350:65: warning: narrowing conversion of ‘((segmatch::OpenCvRandomForest*)this)->segmatch::OpenCvRandomForest::params_....

Can't compile in linux

/home/cammera/Software/Softwarebuilds/gbe-plus/src/gba/swi.cpp:49:1: error: narrowing conversion of ‘65134’ from ‘int’ to ‘s16 {aka short int}’ inside { } [-Wnarrowing] }; ^ /home/cammera/...

pytorch下import numpy失败_PyTorch的编译系统

背景本文以PyTorch 1.0为基础。PyTorch的编译首先是python风格的编译,使用了python的setuptools编译系统。...3,使用cmake生成Makefile;4,Make命令——中间源文件的产生;5,Make命令——编译...

Efficient&Elegant:Java程序员入门Cpp

最近项目急需C++ 的知识结构,虽说我有过快速学习很多新语言的经验,但对于C++ 老特工我还需保持敬畏(内容太多),本文会从一个Java程序员的角度,制定高效学习路线快速入门C++ 。 Java是为了就业,C++ 是信仰。...

build translate fail under gcc 5.3.1

/home/wliao2/translate/pytorch_translate/cpp/Decoder.cpp:38:18: error: expected constructor, destructor, or type conversion before ‘(’ token C10_DEFINE_string(encoder_model, "", "...

从其他语言迁移到c

How do I get started writing C++ projects? I have experience with JavaScript, Go, Rust, Ruby, etc. so what are the package managers, build ... 我如何开始编写C ++项目? 我有JavaScript,Go,Rust,Rub...

undefined reference to `dggsvd3'

This is my CMakeError.log: <p>Performing C++ SOURCE FILE Test HAVE_TEUCHOS_LAPACKLARND failed with the following output: Change Dir: /share/apps/Trilinos-master/build/CMakeFiles/CMakeTmp <p>...

mingw64 cross-compile build on ubuntu host does not create .dll for Windows

connection_base.cxx:1299:53: warning: narrowing conversion of ‘(time_t)seconds’ from ‘time_t {aka long long int}’ to ‘long int’ inside { } [-Wnarrowing] timeval tv = { time_t(seconds), int...

Compiling for Windows 10 ARM64

requires a narrowing conversion [D:\omitted\oals-master\build\OpenAL.vcxproj] D:\omitted\oals-master\alc\mixer\mixer_neon.cpp(73,40): warning C4244: 'initializing': conversion from 'const...

cnn-crf-stereo测试-----stereo-net安装编译方法

打开stereo文件夹sudo ...打开build文件夹sudo cmake ../../stereo出现错误CMake Error at /home/jennifer/stereoCode/cnn-crf-stereo/dependencies/imageutilities/ImageUtilitiesConfig.cmake:157 (find_packa...

为什么我在linux系统PC端编译OpenCV,用的是cmake-gui,make到这个地方的时候就总是报错过不去

相关热词 c# 点击事件 自动点击 c# 图片透明背景 c# 模拟按键 c# 线程同步方式 c# 集合改变 1 c# c# 后进先出 集合 c#执行私有方法 c#排序从大到小 c#访问修饰符总结